{"text_format":"1","workbook":"xlsx","n_sheets":6,"sheets":["10BPdraft","Draft","Data","09BPdraft","08BPdraft","07BPdraft"],"not_rendered":{"charts":0,"images":0,"macros":0,"external_links":5,"defined_names":16,"comments":0,"pivot_tables":0},"unopened":[],"bounds":{"document_bytes":16777216,"sheet_cells":100000,"rows_first":2000,"rows_last":500,"rows_between":2000,"halvings":0,"cell_chars":16384,"cell_head_chars":4096},"cells_cut":0,"cells_raw":0,"read":"whole","date_system":"1900"}

{"sheet":"10BPdraft","index":0,"n_rows":88,"n_cols":14,"rows_kept":88,"cut":false,"hidden":false,"merged":[]}
[null,"Team 6","Team 5","Team 2","Team 3","Team 11","Team 1","Team 9","Team 4","Team 10","Team 12","Team 8","Team 7"]
["Rd","Kevin","Chris","Casey","Andy","Ray","Jeremy","Ryan","T&J/Will","Bill","Mark","Duke & Josh","JTP","Rd"]
[1,"(Cl.Lee)","(J.Vazquez)","(L.Hochevar)","11>(S.Kazmir)","(A.Beltre)","5>(M.Scherzer)","(B.Abreu)","(J.Jurrjens)","(J.Drew)","(A.Burnett)","(C.Sabathia)","(J.Beckett)",1]
[2,"(V.Guerrero)","(Jo.Hamilton","(Al.Soriano)","(Mi.Cabrera)","(C.Quentin)","7>(J.Peavy)","(Mi.Tejada)","(J.Lannan)","7>(B.Sheets)","(El.Andrus)","(M.Teixeira)","(O.Hudson)",2]
[3,"(D.Lowe)","(M.Pelfrey)","(J.Blanton)","(Ub.Jimenez)","(H.Kuroda)","(T.Lincecum)","(R.Oswalt)","(Wa.Rodriguez)","(M.Cain)","(A.Wainwright)","(D.Haren)","(C.Zambrano)",3]
[4,"(K.Kawakami)","(T.Lilly)","(P.Maholm)","(J.de la Rosa)","(H.Bailey)","(Jo.Santana)","(J.Cueto)","(R.Dempster)","(C.Billingsley)","(J.Marquis)","(Jo.Johnson)","(G.Soto)",4]
[5,"(Fr.Morales)","(J.Happ)","(R.Nolasco)","(C.Kershaw)","(J.McDonald)","(An.Sanchez)","(J.Broxton)","(Ra.Wells)","(C.Hamels)","(R.Wolf)","(K.Correia)","(C.Iannetta)",5]
[6,"(R.Hanigan)","(T.Hanson)","(M.Parra)","(A.Harang)","(T.Hudson)","(C.Volstad)","(J.Motte)","(M.Latos)","(Y.Gallardo)","(C.Carpenter)","(C.Richard)","(A.Pujols)",6]
[7,"(J.Loney)","(Ar.Ramirez)","(K.Lohse)","(B.Webb)","(H.Bell)","(Br.Myers)","(Ra.Hernandez)","(M.Montero)","(Ru.Martin)","(Fr.Cordero)","(M.DeRosa)","(M.Prado)",7]
[8,"(B.Phillips)","(Jo.Reyes)","(T.Gorzelanny)","(Fr.Rodriguez)","(De.Lee)","(B.McCann)","(C.Utley)","(A.Dunn)","(P.Fielder)","(Y.Molina)","(Han.Ramirez)","(R.Zimmerman)",8]
[9,"(M.Reynolds)","(H.Pence)","(R.Doumit)","(R.Weeks)","(An.LaRoche)","(J.Votto)","(Ch.Jones)","(D.Wright)","(L.Berkman)","(Ad.Gonzalez)","(R.Braun)","(T.Tulowitzki)",9]
[10,"(I.Stewart)","(Ma.Ramirez)","(R.Howard)","(S.Rolen)","(R.Theriot)","(Ke.Johnson)","(J.Werth)","(S.Drew)","(P.Sandoval)","(D.Uggla)","(S.Victorino)","(Col.Rasmus)",10]
[11,"(Ev.Cabrera)","8>(B.Molina)","(T.Helton)","(A.McCutchen)","(R.Ibanez)","(T.Glaus)","(N.Morgan)","(B.Hawpe)","(J.Rollins)","(A.Ethier)","(M.Holliday)","(D.Fowler)",11]
[12,"(M.Kemp)","7>(J.Bruce)","(Co.Hart)","(Ca.Gonzalez)","(Ca.Lee)","(Y.Escobar)","(Ma.Diaz)","(C.Coghlan)","(Co.Ross)","(J.Bay)","(F.Lopez)","10>(N.McLouth)",12]
[13,"(K.Blanks)","7>(C.Beltran)","(Co.Jackson)","(C.Maybin)","(D.Stubbs)","(A.Soriano)","(Do.Davis)","(A.Rowand)","(J.Upton)","(R.Ludwick)","1>(C.B.Young)","1>(Gar.Jones)",13]
[14,"R.Halladay","Ad.LaRoche","Ed.Jackson","P.Polanco","Ar.Chapman","C.Headley","J.Willingham","R.Furcal","K.Medlen","B.Arroyo","St.Castro","Br.Penny",14]
[15,"Car.Gomez","C.Ruiz","C.McGehee","B.Wagner","3>Se.Smith","M.Bourn","B.Norris","S.Schumaker","Br.Wilson","J.Cantu","1>C.Barmes","5>C.Blake",15]
[16,"R.Madson","Jo.Baker","M.Gamel","Br.Ryan","An.Sanchez","M. Byrd","J.Towles","T.Hoffman","M.Fontenot","O.Cabrera","5>A.Iwamura","J.Uribe",16]
[17,"Mel.Cabrera","J.Hammel","Delw.Young","11>M.Capps","3>Ed.Volquez","B.Zito","Z.Duke","L.Milledge","C.Qualls","7>V.Padilla","7>I.Kennedy","5>K.Fukudome",17]
[18,"Ol.Perez","L.Castillo","T.Stauffer","F.Paulino","J.Garland","G.Sherrill","A.Kennedy","C.Marmol","L.Gregerson","J.Maine","6>J.Flores","C.Withrow",18]
{"$rows_left_out":69}
{"sheet":"Draft","index":1,"n_rows":566,"n_cols":7,"rows_kept":566,"cut":false,"hidden":false,"merged":[]}
["Pick","Tm#","Owner","Team Name","SS#","Player","Comment"]
[1.01,6,{"$f":"VLOOKUP($B2,Data!$A$2:$C$13,3,0)","v":"Kevin"},{"$f":"VLOOKUP($B2,Data!$A$2:$C$13,2,0)","v":"The Luddites"},1003,{"$f":"IF(ISNA(VLOOKUP($E2,Data!$A$16:$B$1902,2,0)),\"\",VLOOKUP($E2,Data!$A$16:$B$1902,2,0))","v":"Lee, Cliff"},"Crossover Eligible"]
[1.02,5,{"$f":"VLOOKUP($B3,Data!$A$2:$C$13,3,0)","v":"Chris"},{"$f":"VLOOKUP($B3,Data!$A$2:$C$13,2,0)","v":"Memories of Mom"},1007,{"$f":"IF(ISNA(VLOOKUP($E3,Data!$A$16:$B$1902,2,0)),\"\",VLOOKUP($E3,Data!$A$16:$B$1902,2,0))","v":"Vazquez, Javier"},"Crossover Eligible"]
[1.03,2,{"$f":"VLOOKUP($B4,Data!$A$2:$C$13,3,0)","v":"Casey"},{"$f":"VLOOKUP($B4,Data!$A$2:$C$13,2,0)","v":"Tulsa Drillers"},1038,{"$f":"IF(ISNA(VLOOKUP($E4,Data!$A$16:$B$1902,2,0)),\"\",VLOOKUP($E4,Data!$A$16:$B$1902,2,0))","v":"Hochevar, Luke"},"Crossover Eligible"]
[1.04,11,{"$f":"VLOOKUP($B5,Data!$A$2:$C$13,3,0)","v":"Ray"},{"$f":"VLOOKUP($B5,Data!$A$2:$C$13,2,0)","v":"South Indy Thugs"},1034,{"$f":"IF(ISNA(VLOOKUP($E5,Data!$A$16:$B$1902,2,0)),\"\",VLOOKUP($E5,Data!$A$16:$B$1902,2,0))","v":"Kazmir, Scott"},"Crossover Eligible"]
[1.05,11,{"$f":"VLOOKUP($B6,Data!$A$2:$C$13,3,0)","v":"Ray"},{"$f":"VLOOKUP($B6,Data!$A$2:$C$13,2,0)","v":"South Indy Thugs"},1478,{"$f":"IF(ISNA(VLOOKUP($E6,Data!$A$16:$B$1902,2,0)),\"\",VLOOKUP($E6,Data!$A$16:$B$1902,2,0))","v":"Beltre, Adrian"},"Traded from Andy on 6.29.09 (with An.LaRoche for 15.05 & #44 in 2009)"]
[1.06,5,{"$f":"VLOOKUP($B7,Data!$A$2:$C$13,3,0)","v":"Chris"},{"$f":"VLOOKUP($B7,Data!$A$2:$C$13,2,0)","v":"Memories of Mom"},1029,{"$f":"IF(ISNA(VLOOKUP($E7,Data!$A$16:$B$1902,2,0)),\"\",VLOOKUP($E7,Data!$A$16:$B$1902,2,0))","v":"Scherzer, Max"},"Traded from D&J on 2.21.10 (with Jo.Hamilton & J.Happ for M.Holliday & 11.02) [Previously traded from Jeremy on 7.15.09 (for 13.11 to complete R.Braun deal)]"]
[1.07,9,{"$f":"VLOOKUP($B8,Data!$A$2:$C$13,3,0)","v":"Ryan"},{"$f":"VLOOKUP($B8,Data!$A$2:$C$13,2,0)","v":"Ryan's Team"},1565,{"$f":"IF(ISNA(VLOOKUP($E8,Data!$A$16:$B$1902,2,0)),\"\",VLOOKUP($E8,Data!$A$16:$B$1902,2,0))","v":"Abreu, Bobby"},"Crossover Eligible"]
[1.08,4,{"$f":"VLOOKUP($B9,Data!$A$2:$C$13,3,0)","v":"Tim & Jeremy(?) (drafted by Will/Ray)"},{"$f":"VLOOKUP($B9,Data!$A$2:$C$13,2,0)","v":"Romeo Warriors(?)"},9,{"$f":"IF(ISNA(VLOOKUP($E9,Data!$A$16:$B$1902,2,0)),\"\",VLOOKUP($E9,Data!$A$16:$B$1902,2,0))","v":"Jurrjens, Jair"},"Crossover Eligible"]
[1.0900000000000001,10,{"$f":"VLOOKUP($B10,Data!$A$2:$C$13,3,0)","v":"Bill"},{"$f":"VLOOKUP($B10,Data!$A$2:$C$13,2,0)","v":"Reggae Rebels"},1579,{"$f":"IF(ISNA(VLOOKUP($E10,Data!$A$16:$B$1902,2,0)),\"\",VLOOKUP($E10,Data!$A$16:$B$1902,2,0))","v":"Drew, J.D."},"Crossover Eligible"]
[1.1000000000000001,12,{"$f":"VLOOKUP($B11,Data!$A$2:$C$13,3,0)","v":"Mark"},{"$f":"VLOOKUP($B11,Data!$A$2:$C$13,2,0)","v":"W&S Life Insurers"},1011,{"$f":"IF(ISNA(VLOOKUP($E11,Data!$A$16:$B$1902,2,0)),\"\",VLOOKUP($E11,Data!$A$16:$B$1902,2,0))","v":"Burnett, A.J."},"Crossover Eligible"]
[1.1100000000000001,8,{"$f":"VLOOKUP($B12,Data!$A$2:$C$13,3,0)","v":"Duke & Josh"},{"$f":"VLOOKUP($B12,Data!$A$2:$C$13,2,0)","v":"Austin Ackbars"},1004,{"$f":"IF(ISNA(VLOOKUP($E12,Data!$A$16:$B$1902,2,0)),\"\",VLOOKUP($E12,Data!$A$16:$B$1902,2,0))","v":"Sabathia, C.C."},"Crossover Eligible"]
[1.1200000000000001,7,{"$f":"VLOOKUP($B13,Data!$A$2:$C$13,3,0)","v":"Jess & Tim"},{"$f":"VLOOKUP($B13,Data!$A$2:$C$13,2,0)","v":"Resistance is Futile"},1009,{"$f":"IF(ISNA(VLOOKUP($E13,Data!$A$16:$B$1902,2,0)),\"\",VLOOKUP($E13,Data!$A$16:$B$1902,2,0))","v":"Beckett, Josh"},"Crossover Eligible"]
[2.0099999999999998,6,{"$f":"VLOOKUP($B14,Data!$A$2:$C$13,3,0)","v":"Kevin"},{"$f":"VLOOKUP($B14,Data!$A$2:$C$13,2,0)","v":"The Luddites"},1596,{"$f":"IF(ISNA(VLOOKUP($E14,Data!$A$16:$B$1902,2,0)),\"\",VLOOKUP($E14,Data!$A$16:$B$1902,2,0))","v":"Guerrero, Vladimir"},"Crossover Eligible"]
[2.02,5,{"$f":"VLOOKUP($B15,Data!$A$2:$C$13,3,0)","v":"Chris"},{"$f":"VLOOKUP($B15,Data!$A$2:$C$13,2,0)","v":"Memories of Mom"},1600,{"$f":"IF(ISNA(VLOOKUP($E15,Data!$A$16:$B$1902,2,0)),\"\",VLOOKUP($E15,Data!$A$16:$B$1902,2,0))","v":"Hamilton, Josh"},"Crossover Eligible"]
[2.0299999999999998,2,{"$f":"VLOOKUP($B16,Data!$A$2:$C$13,3,0)","v":"Casey"},{"$f":"VLOOKUP($B16,Data!$A$2:$C$13,2,0)","v":"Tulsa Drillers"},1229,{"$f":"IF(ISNA(VLOOKUP($E16,Data!$A$16:$B$1902,2,0)),\"\",VLOOKUP($E16,Data!$A$16:$B$1902,2,0))","v":"Soriano, Rafael"},"Crossover Eligible"]
[2.04,3,{"$f":"VLOOKUP($B17,Data!$A$2:$C$13,3,0)","v":"Andy"},{"$f":"VLOOKUP($B17,Data!$A$2:$C$13,2,0)","v":"Cripplers"},1400,{"$f":"IF(ISNA(VLOOKUP($E17,Data!$A$16:$B$1902,2,0)),\"\",VLOOKUP($E17,Data!$A$16:$B$1902,2,0))","v":"Cabrera, Miguel"},"Crossover Eligible"]
[2.0499999999999998,11,{"$f":"VLOOKUP($B18,Data!$A$2:$C$13,3,0)","v":"Ray"},{"$f":"VLOOKUP($B18,Data!$A$2:$C$13,2,0)","v":"South Indy Thugs"},1598,{"$f":"IF(ISNA(VLOOKUP($E18,Data!$A$16:$B$1902,2,0)),\"\",VLOOKUP($E18,Data!$A$16:$B$1902,2,0))","v":"Quentin, Carlos"},"Crossover Eligible"]
[2.06,7,{"$f":"VLOOKUP($B19,Data!$A$2:$C$13,3,0)","v":"Jess & Tim"},{"$f":"VLOOKUP($B19,Data!$A$2:$C$13,2,0)","v":"Resistance is Futile"},1058,{"$f":"IF(ISNA(VLOOKUP($E19,Data!$A$16:$B$1902,2,0)),\"\",VLOOKUP($E19,Data!$A$16:$B$1902,2,0))","v":"Peavy, Jake"},"Traded from Jeremy on 3.22.10 (for C.Heisey & 13.12)"]
[2.0699999999999998,9,{"$f":"VLOOKUP($B20,Data!$A$2:$C$13,3,0)","v":"Ryan"},{"$f":"VLOOKUP($B20,Data!$A$2:$C$13,2,0)","v":"Ryan's Team"},1693,{"$f":"IF(ISNA(VLOOKUP($E20,Data!$A$16:$B$1902,2,0)),\"\",VLOOKUP($E20,Data!$A$16:$B$1902,2,0))","v":"Tejada, Miguel"},"Crossover Eligible"]
{"$rows_left_out":547}
{"sheet":"Data","index":2,"n_rows":1902,"n_cols":5,"rows_kept":1902,"cut":false,"hidden":false,"merged":[]}
["Tm#","Team Name","Owner",null,"Supplemental Draft Order"]
[1,"Uninspired","Jeremy",null,"1st - reverse order of combined 2009-10 records (snake)"]
[2,"Tulsa Drillers","Casey",null,"2nd - reverse order of 2010 record"]
[3,"Cripplers","Andy",null,"3rd - reverse order of 2010 record"]
[4,"Romeo Warriors(?)","Tim & Jeremy(?) (drafted by Will/Ray)"]
[5,"Memories of Mom","Chris",null,"2010 Supplemental Draft Pick Trades"]
[6,"The Luddites","Kevin",null,"Chris traded 36.00 to JTP on 5.27.09 (with 13.2, N.Johnson, & R.Madson for 17.12 & 21.12)"]
[7,"Resistance is Futile","Jess & Tim",null,"Chris traded 40.00 to JTP on 8.12.09 (with 12.2 & #44-47 in 2009 for T.Alderson & 15.12)"]
[8,"Austin Ackbars","Duke & Josh",null,"D&J traded 38.00, 39.00, 42.00, & 43.00 to Kevin for 25.01, 26.01, & 27.01 in the draft"]
[9,"Ryan's Team","Ryan",null,"Kevin traded 25.00, 26.00, & 27.00 in the draft to D&J for 38.00, 39.00, 42.00, & 43.00"]
[10,"Reggae Rebels","Bill",null,"Chris traded 37.00 & 42.00 to Chris for 28.09 in the draft"]
[11,"South Indy Thugs","Ray",null,"Bill traded 28.09 in the draft to Chris for 37.00 & 42.00"]
[12,"W&S Life Insurers","Mark"]
[]
["SS#","Player","Owned?"]
[1,"Halladay, Roy",{"$f":"IF(ISNA(IF(VLOOKUP(A16,Draft!E:E,1,FALSE)=A16,\"Yes\")),\"\",IF(VLOOKUP(A16,Draft!E:E,1,FALSE)=A16,\"Yes\"))","v":"Yes"}]
[2,"Wainwright, Adam",{"$f":"IF(ISNA(IF(VLOOKUP(A17,Draft!E:E,1,FALSE)=A17,\"Yes\")),\"\",IF(VLOOKUP(A17,Draft!E:E,1,FALSE)=A17,\"Yes\"))","v":"Yes"}]
[3,"Haren, Dan",{"$f":"IF(ISNA(IF(VLOOKUP(A18,Draft!E:E,1,FALSE)=A18,\"Yes\")),\"\",IF(VLOOKUP(A18,Draft!E:E,1,FALSE)=A18,\"Yes\"))","v":"Yes"}]
[4,"Lincecum, Tim",{"$f":"IF(ISNA(IF(VLOOKUP(A19,Draft!E:E,1,FALSE)=A19,\"Yes\")),\"\",IF(VLOOKUP(A19,Draft!E:E,1,FALSE)=A19,\"Yes\"))","v":"Yes"}]
[5,"Arroyo, Bronson",{"$f":"IF(ISNA(IF(VLOOKUP(A20,Draft!E:E,1,FALSE)=A20,\"Yes\")),\"\",IF(VLOOKUP(A20,Draft!E:E,1,FALSE)=A20,\"Yes\"))","v":"Yes"}]
{"$rows_left_out":1883}
{"sheet":"09BPdraft","index":3,"n_rows":88,"n_cols":14,"rows_kept":88,"cut":false,"hidden":false,"merged":[]}
[null,"Team 1","Team 2","Team 11","Team 9","Team 5","Team 10","Team 6","Team 4","Team 12","Team 8","Team 7","Team 3"]
["Rd","Ray","Kevin","Andy","Chris","Will","Casey","Jeremy","Mark","Duke & Josh","Tim & Jeremy","Bill","JTP","Rd"]
[1,"(S.Kazmir)","(J.Saltalamacchia)","(Mi.Cabrera)","(M.Holliday)","(B.Abreu)","(L.Hochevar)","(T.Lincecum)","(A.Burnett)","(C.Sabathia)","(R.Dempster)","(B.Fuentes)","(J.Beckett)",1]
[2,"(C.Quentin)","(V.Guerrero)","(B.Webb)","12>(M.Teixeira)","(R.Oswalt)","(R.Nolasco)","12>(A.Beltre)","(J.Bay)","(J.Hamilton)","(J.Jurrjens)","(J.Drew)","(M.DeRosa)",2]
[3,"(A.Cook)","(D.Lowe)","(C.Kershaw)","(J.Vazquez)","(R.Harden)","(P.Maholm)","(B.Myers)","(A.Harang)","Jo.Santana","(J.Lannan)","(C.Hamels)","(C.Zambrano)",3]
[4,"(H.Kuroda)","(H.Kuo)","(C.R.Young)","(T.Lilly)","(J.Cueto)","(S.Olsen)","(An.Miller)","(J.Maine)","D.Haren","(Wa.Rodriguez)","(M.Cain)","(J.Peavy)",4]
[5,"(M.Owings)","(B.Lidge)","(C.Snyder)","(M.Pelfrey)","(J.Moyer)","(K.Lohse)","(Jo.Johnson)","(A.Wainwirght)","B.Zito","(Ad.LaRoche)","(C.Billingsley)","(C.Marmol)",5]
[6,"(S.Marshall)","(J.Loney)","(R.Weeks)","(M.Scherzer)","(T.Pena)","(J.Blanton)","(C.Volstad)","(C.Carpenter)","J.Flores","(D.Wright)","(Ed.Volquez)","(G.Soto)",6]
[7,"(H.Bailey)","(B.Phillips)","(J.Cantu)","(A.Ramirez)","(J.Broxton)","(D.Bush)","(B.McCann)","(Y.Molina)","I.Rodriguez","(S.Drew)","(Y.Gallard)","(C.Iannetta)",7]
[8,"(T.Hudson)","(M.Reynolds)","(J.Hardy)","(Jo.Reyes)","(Ra.Hernandez)","(Ra.Johnson)","(Ke.Johnson)","(Ad.Gonzalez)","F.Lopez","(R.Winn)","(Ru.Martin)","(A.Pujols)",8]
[9,"(De.Lee)","(R.Furcal)","(R.Ludwick)","(H.Pence)","(C.Kotchman)","(M.Parra)","(G.Atkins)","(D.Uggla)","Ha.Ramirez","(A.Rowand)","(P.Fielder)","(R.Zimmerman)",9]
[10,"(M.Hoffpauir)","(M.Kemp)","(C.Maybin)","(S.Victorino)","(C.Utley)","(R.Doumit)","(Y.Escobar)","(T.Glaus)","R.Braun","(B.Hawpe)","(L.Berkman)","(C.Guzman)",10]
[11,"(Ca.Lee)","(E.Dukes)","7>(M.Fontenot)","(Ma.Ramirez)","(C.Jones)","(R.Howard)","(C.B.Young)","(K.Greene)","A.Soriano","(J.Gerut)","(E.Encarnacion)","(T.Tulowitzki)",11]
[12,"(C.Headley)","7>(J.Rollins)","3>(C.Beltran)","3>(K.Fukudome)","(J.Francouer)","(Co.Hart)","(L.Milledge)","(A.Ethier)","6>(J.Hermida)","(R.Spilborghs)","(N.McLouth)","(M.Cameron)",12]
[13,"3>(M.Bradley)","7>(C.Ross)","3>(J.Bruce)","3>(B.Sheets)","(J.Werth)","(Co.Jackson)","(J.Votto)","(R.Ankiel)","4>(F.Lewis)","(A.Dunn)","(J.Upton)","(O.Hudson)",13]
[14,"R.Ibanez","I.Stewart","F.Rodriguez","C.Delgado","8>Ol.Perez","T.Helton","Jo.Sanchez","K.Kouzmanoff","11>J.Putz","2>K.Kawakami","P.Sandoval","R.Wolf",14]
[15,"B.Molina","M.Stanton","U.Jimenez","I.Snell","8>D.Cabrera","Dan.Murphy","T.Wellemeyer","8>C.Baek","J.Garland","2>W.Flores","12>K.Correia","B.Arroyo",15]
[16,"8>B.Looper","F.Morales","Z.Duke","An.Sanchez","M.Tejada","C.Blake","Mi.Gonzalez","F.Cordero","11>J.Valverde","Ro.Belliard","2>C.Qualls","11>An.LaRoche",16]
[17,"R.Theriot","C.Wade","S.Schumaker","B.Schneider","M.Bourn","E.Renteria","H.Bell","F.Sanchez","C.Duncan","Jo.Baker","M.Capps","C.Barmes",17]
[18,"A.Miles","I.DeJesus","Ca.Gonzalez","K.Matsui","J.Motte","B.Giles","Se.Smith","Ja.Wilson","H.Street","M.Montero","C.Meredith","11>Je.Baker",18]
{"$rows_left_out":69}
{"sheet":"08BPdraft","index":4,"n_rows":80,"n_cols":14,"rows_kept":80,"cut":false,"hidden":false,"merged":[]}
[null,"Team 10","Team 12","Team 2","Team 6","Team 4","Team 5","Team 1","Team 11","Team 9","Team 7","Team 3","Team 8"]
["Rd","Casey","Duke & Josh","Kevin","Rich&Jeremy","Mark","Pat","Ray","Andy","Chris","Bill","JTP","Tom","Rd"]
[1,"(R.Johnson)","(D.Willis)","(J.Saltalamacchia)","(B.Arroyo)","(I.Rodriguez)","(B.Abreu)","(R.Hernandez)","(A.Pettitte)","(J.Beckett)","(S.Kazmir)","(J.Vazquez)","(A.Burnett)",1]
[2,"1>(A.Beltre)","(J.Hamilton)","(V.Guerrero)","7>(P.Polanco)","(S.Rolen)","(R.Hill)","(C.Quentin","(M.Cabrera)","(J.Thome)","(J.Drew)","(M.Bradley)","(J.Lugo)",2]
[3,"(D.Bush)","(C.Young)","(D.Lowe)","(T.Lincecum)","(A.Harang)","(F.Morales)","(T.Hudson)","(B.Webb)","(B.Penny)","(C.Billingsley)","(J.Peavy)","(R.Oswalt)",3]
[4,"(P.Maholm","(T.Lilly)","(T.Gorzelanny)","(B.Myers)","(A.Wanwright)","(Do.Davis)","(G.Maddux)","(Ol.Perez)","(N.Lowry)","(C.Hamels)","(C.Zambrano)","(J.Smoltz)",4]
[5,"(S.Olsen)","(B.Zito)","(I.Snell)","(S.Hill)","(J.Maine)","(J.Francis)","(M.Owings)","(U.Jimenez)","(M.Parra)","(Y.Gallardo)","(P.Martinez)","(K.Kendrick)",5]
[6,"(R.Soriano)","(R.Wolf)","(H.Bell)","(B.McCann)","(C.Carpenter)","(W.Rodriguez)","(H.Bailey)","(C.Marmol)","(B.Molina)","(M.Cain)","(B.Sheets)","(S.Mitre)",6]
[7,"(R.Howard)","(M.Teixeira)","(C.Delgado)","(T.Wigginton)","(Ad.Gonzalez)","(M.Corpas)","(T.Hoffman)","(J.Bard)","(J.Kent)","(Ru.Martin)","(M.Montero)","(Y.Torrealba)",7]
[8,"(E.Renteria)","(K.Johnson)","(J.Loney)","(R.Braun)","(D.Uggla)","(J.Broxton)","(T.Saito)","(C.Snyder)","(A.Ramirez)","(De.Lee)","(G.Soto)","(T.Helton)",8]
[9,"(Co.Hart)","(G.Atkins)","(B.Phillips)","(L.Milledge)","(P.Feliz)","(Ad.LaRoche)","(P.Fielder)","(J.Votto)","(K.Kouzmanoff)","(E.Encarnacion)","(A.Pujols)","(C.Utley)",9]
[10,"(M.Bourn)","(An.LaRoche)","(B.Hall)","(C.Young)","(K.Greene)","(F.Sanchez)","(L.Castillo)","(R.Weeks)","(J.Reyes)","(J.Rollins)","(O.Hudson)","(C.Jones)",10]
[11,"(W.Taveras)","(H.Ramirez)","(R.Furcal)","(J.Hermida)","(E.Byrnes)","(D.Wright)","(C.Lee)","(J.Hardy)","(S.Victorino)","(A.Jones)","(R.Zimmerman)","(A.Rowand)",11]
[12,"7>(S.Drew)","(A.Soriano)","(A.Kearns)","(J.Willingham)","(J.Bay)","(A.Dunn)","(J.Upton)","(K.Griffey)","(M.Holliday)","(L.Berkman)","(T.Tulowitzki)","(B.Hawpe)",12]
[13,"3>(M.Cameron)","(H.Pence)","(M.Kemp)","(F.Pie)","(C.Duncan)","(J.Francoeur)","3>(C.Iannetta)","(B.Giles","(P.Burrell)","6>(Y.Escobar)","(C.Beltran)","(R.Church)",13]
[14,"12>J.Santana","D.Haren","M.Reynolds","An.Miller","4>10>M.Tejada","4>T.Glaus","9>M.Jacobs","C.Maybin","Ch.James","B.Wagner","K.Fukudome","4>R.Ankiel",14]
[15,"C.Tracy","F.Cordero","J.Schafer","H.Kuroda","K.Correia","1>C.Capuano","5>A.Cook","N.Johnson","J.Germano","Co.Jackson","M.DeRosa","9>M.Capps",15]
[16,"4>T.Glavine","J.Schmidt","An.Reyes","J.Valverde","A.Ethier","10>J.Pierre","6>C.Meredith","J.Patterson","6>A.Heilman","B.Fuentes","12>R.Freel","3>J.Suppan",16]
[17,"M.Alou","B.Lyon","M.Prior","Jon.Sanchez","P.Feliciano","1>W.M.Pena","8>J.Pineiro","C.Cordero","3>M.Pelfrey","J.Wilson","4>J.Isringhausen","5>B.Howry",17]
[18,"5>J.Rauch","R.Spilborghs","B.Lidge","D.Marte","Y.Molina","6>R.Castro","J.Edmonds","N.Garciaparra","O.Hernandez","H-c.Kuo","O.Vizquel","5>J.Jurrjens",18]
{"$rows_left_out":61}
{"sheet":"07BPdraft","index":5,"n_rows":78,"n_cols":14,"rows_kept":78,"cut":false,"hidden":false,"merged":[]}
[null,"Team 1","Team 10","Team 12","Team 2","Team 11","Team 9","Team 8","Team 5","Team 4","Team 6","Team 3","Team 7"]
["Rd","Ray","Casey","Duke & Josh","Kevin","Andy","Chris","Tom","Pat","Mark","Rich","JTP","Bill","Rd"]
[1,"Ra.Hernandez","F.Nieve","J.Vazquez","V.Guerrero","A.Pettitte","J.Beckett","A.Burnett","C.Schilling","I.Rodriguez","P.Polanco","B.Abreu","S.Kazmir",1]
[2,"L.Castillo","3>A.Beltre","J.Barfield","D.Lowe","G.Sheffield","J.Thome","J.Lugo","J.Schmidt","7>A.Marte","B.Myers","M.Bradley","J.Drew",2]
[3,"D.Willis","D.Bush","Z.Duke","C.Hensley","B.Webb","B.Arroyo","R.Oswalt","R.Hill","C.Carpenter","G.Maddux","J.Peavy","B.Sheets",3]
[4,"T.Hudson","S.Olson","R.Johnson","T.Gorzelanny","An.Reyes","C.Billingsley","J.Smoltz","L.Hernandez","A.Harang","An.Sanchez","C.Zambrano","C.Capuano",4]
[5,"J.Suppan","C.Young","J.Hirsh","J.Patterson","K.Wells","N.Lowry","Do.Davis","J.Broxton","R.Clemens","Jo.Johnson","B.Penny","M.Cain",5]
[6,"T.Saito","B.Wagner","K.Wood","J.Jennings","H.Kuo","M.Prior","P.LoDuca","B.Lidge","A.Wainwright","B.McCann","M.Barrett","C.Hamels",6]
[7,"P.Fielder","C.Jackson","D.Ross","C.Delgado","R.Weeks","J.Francis","T.Helton","J.Estrada","C.Cordero","N.Johnson","C.Iannetta","Ru.Martin",7]
[8,"W.Betemit","N.Garciaparra","R.Howard","B.Phillips","M.Cabrera","T.Glavine","C.Utley","M.Giles","Ad.Gonzalez","A.Ramirez","A.Pujols","D.Lee",8]
[9,"D.Eckstein","S.Thorman","R.Zimmerman","Ch.Tracy","M.Ensberg","Ad.LaRoche","C.Jones","D.Wright","D.Uggla","F.Lopez","O.Hudson","R.Durham",9]
[10,"C.Lee","C.Burke","Ha.Ramirez","R.Furcal","J.Hardy","Jo.Reyes","R.Aurilia","B.Bonds","S.Rolen","C.B.Young","G.Atkins","S.Drew",10]
[11,"C.Quentin","E.Renteria","A.Soriano","B.Hall","K.Griffey","E.Encarnacion","R.Winn","W.Taveras","Fr.Sanchez","L.Milledge","T.Tulowitzki","A.Jones",11]
[12,"J.Pierre","Co.Hart","A.Ethier","M.Kemp","B.Giles","P.Burrell","B.Hawpe","A.Dunn","J.Bay","J.Willingham","C.Beltran","L.Berkman",12]
[13,"3>R.Paulino","7>J.Rollins","J.Francoeur","A.Kearns","M.Murton","M.Holliday","M.Alou","D.Roberts","J.Edmonds","J.Hermida","L.Scott","4>C.Meredith",13]
[14,"FreddyGarcia","5>BarryZito","ChuckJames","IanSnell","MikeJacobs","BenMolina","10>PaulMaholm","10>Hoffman","9>JeffKent","TimLincecum","Pe.Martinez","M.Cameron",14]
[15,"10>R.Soriano","4>JohnMaine","Ted Lilly","11>JoshBard","2>F.Cordero","4>M.Morris","AdamEaton","ChrisDuncan","9>Kouzmanoff","C. Vargas","12>Rowand","3>R.Wolf",15]
[16,"JonLieber","KellyJohnson","BrianFuentes","MiguelOlivo","S.Linebrink","MikeGonzlez","JoseValverde","OmarVizquel","Eric Byrnes","DavidWells","S.Victorino","DanWheeler",16]
[17,"10>J.Jones","1>AaronCook","CedricHunter","11>A.Everett","2>KyleDavies","O.Hernandez","RyanChurch","BobbyHowry","YadierMolina","XavierNady","A.Callaspo","B.Thompson",17]
[18,"RyanFreel","JasonLane","3>KhalilGreene","B.Schneider","TreverMiller","A.Heilman","B.H.Kim","MattHarrison","PedroFeliz","KevinGregg","DexterFowler","C.Villanueva",18]
{"$rows_left_out":58}