{"text_format":"1","workbook":"xlsx","n_sheets":6,"sheets":["10BPdraft","Draft","Data","09BPdraft","08BPdraft","07BPdraft"],"not_rendered":{"charts":0,"images":0,"macros":0,"external_links":5,"defined_names":16,"comments":0,"pivot_tables":0},"unopened":[],"bounds":{"document_bytes":16777216,"sheet_cells":100000,"rows_first":2000,"rows_last":500,"rows_between":2000,"halvings":0,"cell_chars":16384,"cell_head_chars":4096},"cells_cut":0,"cells_raw":0,"read":"whole","date_system":"1900"}

{"sheet":"10BPdraft","index":0,"n_rows":88,"n_cols":14,"rows_kept":88,"cut":false,"hidden":false,"merged":[]}
[null,"Team 6","Team 5","Team 2","Team 3","Team 11","Team 1","Team 9","Team 4","Team 10","Team 12","Team 8","Team 7"]
["Rd","Kevin","Chris","Casey","Andy","Ray","Jeremy","Ryan","T&J/Will","Bill","Mark","Duke & Josh","JTP","Rd"]
[1,"(Cl.Lee)","(J.Vazquez)","(L.Hochevar)","11>(S.Kazmir)","(A.Beltre)","5>(M.Scherzer)","(B.Abreu)","(J.Jurrjens)","(J.Drew)","(A.Burnett)","(C.Sabathia)","(J.Beckett)",1]
[2,"(V.Guerrero)","(Jo.Hamilton","(Al.Soriano)","(Mi.Cabrera)","(C.Quentin)","7>(J.Peavy)","(Mi.Tejada)","(J.Lannan)","7>(B.Sheets)","(El.Andrus)","(M.Teixeira)","(O.Hudson)",2]
[3,"(D.Lowe)","(M.Pelfrey)","(J.Blanton)","(Ub.Jimenez)","(H.Kuroda)","(T.Lincecum)","(R.Oswalt)","(Wa.Rodriguez)","(M.Cain)","(A.Wainwright)","(D.Haren)","(C.Zambrano)",3]
[4,"(K.Kawakami)","(T.Lilly)","(P.Maholm)","(J.de la Rosa)","(H.Bailey)","(Jo.Santana)","(J.Cueto)","(R.Dempster)","(C.Billingsley)","(J.Marquis)","(Jo.Johnson)","(G.Soto)",4]
[5,"(Fr.Morales)","(J.Happ)","(R.Nolasco)","(C.Kershaw)","(J.McDonald)","(An.Sanchez)","(J.Broxton)","(Ra.Wells)","(C.Hamels)","(R.Wolf)","(K.Correia)","(C.Iannetta)",5]
[6,"(R.Hanigan)","(T.Hanson)","(M.Parra)","(A.Harang)","(T.Hudson)","(C.Volstad)","(J.Motte)","(M.Latos)","(Y.Gallardo)","(C.Carpenter)","(C.Richard)","(A.Pujols)",6]
[7,"(J.Loney)","(Ar.Ramirez)","(K.Lohse)","(B.Webb)","(H.Bell)","(Br.Myers)","(Ra.Hernandez)","(M.Montero)","(Ru.Martin)","(Fr.Cordero)","(M.DeRosa)","(M.Prado)",7]
[8,"(B.Phillips)","(Jo.Reyes)","(T.Gorzelanny)","(Fr.Rodriguez)","(De.Lee)","(B.McCann)","(C.Utley)","(A.Dunn)","(P.Fielder)","(Y.Molina)","(Han.Ramirez)","(R.Zimmerman)",8]
[9,"(M.Reynolds)","(H.Pence)","(R.Doumit)","(R.Weeks)","(An.LaRoche)","(J.Votto)","(Ch.Jones)","(D.Wright)","(L.Berkman)","(Ad.Gonzalez)","(R.Braun)","(T.Tulowitzki)",9]
[10,"(I.Stewart)","(Ma.Ramirez)","(R.Howard)","(S.Rolen)","(R.Theriot)","(Ke.Johnson)","(J.Werth)","(S.Drew)","(P.Sandoval)","(D.Uggla)","(S.Victorino)","(Col.Rasmus)",10]
[11,"(Ev.Cabrera)","8>(B.Molina)","(T.Helton)","(A.McCutchen)","(R.Ibanez)","(T.Glaus)","(N.Morgan)","(B.Hawpe)","(J.Rollins)","(A.Ethier)","(M.Holliday)","(D.Fowler)",11]
[12,"(M.Kemp)","7>(J.Bruce)","(Co.Hart)","(Ca.Gonzalez)","(Ca.Lee)","(Y.Escobar)","(Ma.Diaz)","(C.Coghlan)","(Co.Ross)","(J.Bay)","(F.Lopez)","10>(N.McLouth)",12]
[13,"(K.Blanks)","7>(C.Beltran)","(Co.Jackson)","(C.Maybin)","(D.Stubbs)","(A.Soriano)","(Do.Davis)","(A.Rowand)","(J.Upton)","(R.Ludwick)","1>(C.B.Young)","1>(Gar.Jones)",13]
[14,"R.Halladay","Ad.LaRoche","Ed.Jackson","P.Polanco","Ar.Chapman","C.Headley","J.Willingham","R.Furcal","K.Medlen","B.Arroyo","St.Castro","Br.Penny",14]
[15,"Car.Gomez","C.Ruiz","C.McGehee","B.Wagner","3>Se.Smith","M.Bourn","B.Norris","S.Schumaker","Br.Wilson","J.Cantu","1>C.Barmes","5>C.Blake",15]
[16,"R.Madson","Jo.Baker","M.Gamel","Br.Ryan","An.Sanchez","M. Byrd","J.Towles","T.Hoffman","M.Fontenot","O.Cabrera","5>A.Iwamura","J.Uribe",16]
[17,"Mel.Cabrera","J.Hammel","Delw.Young","11>M.Capps","3>Ed.Volquez","B.Zito","Z.Duke","L.Milledge","C.Qualls","7>V.Padilla","7>I.Kennedy","5>K.Fukudome",17]
[18,"Ol.Perez","L.Castillo","T.Stauffer","F.Paulino","J.Garland","G.Sherrill","A.Kennedy","C.Marmol","L.Gregerson","J.Maine","6>J.Flores","C.Withrow",18]
[19,"Dan.Murphy","N.Schierholtz","J.Hairston","11>J.Affeldt","3>C.Snyder","I.Desmond","C.Morton","I.Rodriguez","A.Cook","M.Olivo","5>O.Dotel","Si.Castro",19]
[20,"H.Kuo","T.Saito","H.Street","Mi.Adams","N.Hundley","A.Rhodes","J.Clement","K.Kendrick","R.Paulino","1>T.Byrdak","5>Tre.Miller","10>J.Thatcher",20]
[21,"I.Davis","B.Lyon","Ro.Belliard","11>O.Infante","3>C.Counsell","Jo.Tabata","E.O'Flaherty","J.Francoeur","P.Feliz","R.Franklin","5>G.Zaun","5>E.Renteria",21]
[22,"An.Miller","N.Masset","R.Pinto","Jon.Gomes","R.Troncoso","L.Nunez","S.Romo","Ju.Teheran","Ra.Betancourt","11>S.Marshall","M.Lindstrom","S.Hairston",22]
[23,"P.Moylan","C.R.Young","Jo-Jo Reyes","11>Tra.Wood","3>B.DeWitt","S.Gallagher","A.Pagan","D.McCutchen","R.Ohlendorf","C.Guzman","Fr.Sanchez","A.Huff",23]
[24,"A.Bastardo","(A.Cashner)","P.Feliciano","B.Badenhop","Se.Burnett","K.McClellan","Jo.Zimmerman","M.Lasker","B.Francisco","C.Zavada","1>Da.Ross","D.Runzler",24]
[25,"8>T.Colvin","(Et.Martin)","L.Hawkins","11>(M.Minor)","3>Jon.Garcia","Ch.Johnson","Ron.Cedeno","P.Aumont","Je.Baker","K.Matsui","1>C.Dickerson","T.Coffey",25]
[26,"8>Da.Bush","(T.Alderson)","J.Grabow","E.Mujica","(Jen.Mejia)","T.Wellemeyer","Da.Meyer","T.Abreu","De.Reyes","R.Barajas","J.Francis","G.Mock",26]
[27,"8>Y.Torrealba","(B.Lincoln)","R.Spilborghs","11>(Sh.Miller)","3>Dom.Santana","Dar.Jones","S.Elbert","Ju.Francisco","S.Gervacio","X. Nady","11>M.Stetter","T.Gwynn",27]
[28,"(Jh.Chacin)","(Z.Wheeler)","R.Church","Bo.Crosby","(H.Sosa)","(Aa.Miller)","Se.Green","J.Schafer","5>A.Heilman","B.Lidge","W.Venable","Re.Johnson",28]
[29,"(Jam.Garcia)","(T.Matzek)","W.Taveras","11>(B.Posey)","3>Rod.Lopez","(Cha.James)","W.Balentien","T.Manzella","J.Keppinger","T.Clippard","E.Caridad","(J.Niese)",29]
[30,"(J.Lyles)","(Jar.Parker)","D.Eckstein","C.Kimbrel","(A.Salome)","(Gab.Sanchez)","J.Contreras","J.Jeffress","R.VandenHurk","K.Calero","Ju.Castro","(A.Poreda)",30]
[31,"(S.Strasburg)","(Wi.Rosario)","D.Baez","11>(M.Antonelli)","3>(Ja.Castro)","(Ch.Marrero)","T.Ishikawa","W.Harris","A.Ellis","(B.Hawksworth)","J.Edmonds","(M.Bumgarner)",31]
[32,"(J.LuCroy)","(B.Lawrie)","J.Carroll","(Y.Alonso)","(B.Borchering)","(J.Vitters)","D.Herrera","H-J.Lee","D.Espinosa","(Ch.Friedrich)","(M.Leake)","(Br.Allen)",32]
[33,"(L.Morrison)","(Dom.Brown)","(T.Frazier)","11>(J.Mier)","3>(P.Alvarez)","(Ken.Davis)","(D.Storen)","(F.Freeman)","(D.Norris)","(D.Freese)","(T.Sanchez)","(D.Gordon)",33]
[34,"(R.Havens)","(D.Drabek)","(Er.Young)","(Al.Escobar)","(Gor.Hernandez)","(Br.Jackson)","(D.Schlereth)","(C.Carrasco)","(M.Dominguez)","(D.Tate)","(T.Joseph)","(T.Wheeler)",34]
[35,"(M.Stanton)","(Br.Wallace)","(Tr.Patton)","8>Ar.Vizcaino","3>(Fe.Martinez)","(C.Heisey)","(M.Taylor)","(Ad.Cardenas)","(J.Heyward)","(A.Crow)","(A.Lambo)","(L.Marson)",35]
[]
[]
[]
[]
[]
[]
[]
[null,{"$f":"B1","v":"Team 6"},{"$f":"C1","v":"Team 5"},"Team 2","Team 3","Team 11","Team 1","Team 9",{"$f":"I1","v":"Team 4"},"Team 10","Team 12","Team 8","Team 7"]
["Rd",{"$f":"B2","v":"Kevin"},{"$f":"C2","v":"Chris"},"Casey","Andy","Ray","Jeremy","Ryan",{"$f":"I2","v":"T&J/Will"},"Bill","Mark","Duke & Josh","JTP","Rd"]
["C","R.Hanigan","C.Ruiz","R.Doumit","C.Snyder","N.Hundley","B.McCann","Ra.Hernandez","M.Montero","Ru.Martin","Y.Molina","B.Molina","G.Soto","C"]
["1B","J.Loney","Ad.LaRoche","R.Howard","Mi.Cabrera","De.Lee","J.Votto","J.Clement","Ad.Dunn","P.Fielder","Ad.Gonzalez","M.Teixeira","A.Pujols","1B"]
["2B","B.Phillips","A.Iwamura","C.McGehee","R.Weeks","P.Polanco","Ke.Johnson","C.Utley","S.Schumaker","M.Fontenot","D.Uggla","F.Lopez","O.Hudson","2B"]
["3B","M.Reynolds","Ar.Ramirez","M.Gamel","S.Rolen","A.Beltre","T.Glaus","Ch.Jones","D.Wright","P.Sandoval","D.Freese","M.DeRosa","R.Zimmerman","3B"]
["SS","Ev.Cabrera","Jo.Reyes","J.Hairston","Al.Escobar","R.Theriot","Y.Escobar","M.Tejada","E.Andrus","J.Rollins","S.Drew","Han.Ramirez","T.Tulowitzki","SS"]
["CF","M.Kemp","J.Hamilton","W.Taveras","C.Maybin","D.Stubbs","C.B.Young","N.Morgan","A.Rowand","N.McLouth","A.Ethier","S.Victorino","C.Rasmus","CF"]
["OF","V.Guerrero","H.Pence","Co.Hart","A.McCutchen","R.Ibanez","A.Soriano","J.Werth","B.Hawpe","J.Upton","J.Bay","R.Braun","D.Fowler","OF"]
["OF","K.Blanks","Man.Ramirez","Co.Jackson","Ca.Gonzalez","Ca.Lee","Gar.Jones","B.Abreu","C.Coghlan","J.Drew","R.Ludwick","M.Holliday","J.Bruce","OF"]
["BC","Je.Flores","Jo.Baker",null,null,null,"Da.Ross","J.Towles","I.Rodriguez","R.Paulino","M.Olivo","Y.Torrealba","C.Iannetta","BC"]
["IF","I.Stewart","C.Blake","T.Helton",null,"An.LaRoche","Gab.Sanchez","A.Kennedy","T.Abreu","P.Feliz","J.Cantu","Fr.Sanchez","M.Prado","IF"]
["IF",null,"L.Castillo","Ro.Belliard","Br.Ryan","O. Infante","C.Headley","Ron.Cedeno","T.Manzella","Je.Baker","O.Cabrera","Ju.Castro","J.Uribe","IF"]
["OF","Car.Gomez","K.Fukudome","Delw.Young","Se.Smith","C.Quentin","M.Bourn","M.Diaz","L.Milledge","Co.Ross","J.Francoeur","W.Venable","C.Beltran","OF"]
["OF","Mel.Cabrera","N.Schierholtz","R.Church","Jon.Gomes",null,"M.Byrd","J.Willingham","W.Harris","J.Heyward","X. Nady","J.Edmonds","S.Hairston","OF"]
["UT","Dan.Murphy","G.Zaun","C.Eckstein","C.Counsell",null,"C.Barmes","A.Pagan",null,"B.Francisco","C.Guzman",null,"L.Marson","UT"]
["UT",null,"E.Renteria","J.Carroll","B.DeWitt",null,"I.Desmond","W.Balentien",null,"A.Ellis","K.Matsui",null,"A.Huff","UT"]
["UT",null,null,null,"Bo.Crosby",null,"Ch.Johnson","T.Ishikawa",null,null,"R.Barajas",null,"T.Gwynn","UT"]
["?","J.LuCroy","Wi.Rosario",null,"J.Castro","B.Posey","Ch.Marrero","M.Taylor","F.Freeman","D.Norris","D.Tate","To.Sanchez","Br.Allen","?"]
["?","L.Morrison","B.Lawrie",null,"Y.Alonso","A.Salome","J.Vitters",null,"Ad.Cardenas","M.Dominguez",null,"T.Joseph","D.Gordon","?"]
["?","R.Havens","Dom.Brown",null,"P.Alvarez","M.Antonelli","Ken.Davis",null,"Ju.Francisco","D.Espinosa",null,"A.Lambo","T.Wheeler","?"]
["?","M.Stanton","Br.Wallace",null,"Fe.Martinez","B.Borchering","Br.Jackson",null,"J.Schafer",null,null,"St.Castro","Re.Johnson","?"]
["?","I.Davis","A.Heilman",null,"Jon.Garcia","J.Mier","C.Heisey",null,"H-J.Lee",null,null,"T.Colvin",null,"?"]
["?",null,"D.Drabek",null,"Dom.Santana","Gor.Hernandez","Jo.Tabata",null,null,null,null,null,null,"?"]
["?",null,"Jar.Parker",null,null,"M.Stetter","C.Dickerson",null,null,null,null,null,null,"?"]
["?",null,"T.Matzek",null,null,"Se.Burnett","Dar.Jones",null,null,null,null,null,null,"?"]
["?",null,"Z.Wheeler","D.Baez",null,null,null,null,null,null,null,null,null,"?"]
["?","An.Miller","B.Lincoln","J.Grabow",null,"H.Sosa",null,"S.Elbert","P.Aumont",null,null,null,"Si.Castro","?"]
["?","S.Strasburg","T.Alderson","L.Hawkins",null,"Sh.Miller",null,"Jo.Zimmerman","M.Lasker",null,null,null,"C.Withrow","?"]
["?","J.Lyles","Et.Martin","P.Feliciano",null,"M.Minor","Cha.James","D.Schlereth","Ju.Teheran",null,"A.Crow","Ar.Vizcaino","M.Bumgarner","?"]
["?","Jh.Chacin","A.Cashner","Tr.Patton","C.Kimbrell","J.McDonald","Aa.Miller","D.Storen","C.Carrasco",null,"Ch.Friedrich","M.Leake","A.Poreda","?"]
["SP","Cl.Lee","J.Vazquez","J.Blanton","U.Jimenez","S.Kazmir","T.Lincecum","R.Oswalt","J.Jurrjens","M.Cain","A.Burnett","C.Sabathia","J.Beckett","SP"]
["SP","D.Lowe","M.Scherzer","P.Maholm","J.de la Rosa","H.Kuroda","Jo.Santana","J.Cueto","J.Lannan","C.Billingsley","A.Wainwright","D.Haren","J.Peavy","SP"]
["SP","K.Kawakami","M.Pelfrey","R.Nolasco","C.Kershaw","H.Bailey","An.Sanchez","Do.Davis","Wa.Rodriguez","C.Hamels","R.Wolf","Jo.Johnson","C.Zambrano","SP"]
["SP","Jam.Garcia","T.Lilly","M.Parra","A.Harang","T.Hudson","C.Volstad","B.Norris","R.Dempster","Y.Gallardo","C.Carpenter","K.Correia","B.Sheets","SP"]
["SP","R.Halladay","J.Happ","K.Lohse","B.Webb","J.Garland","Br.Myers","Z.Duke","Ra.Wells","R.Ohlendorf","B.Arroyo","C.Richard","J.Niese","SP"]
["P",null,"T.Hanson","T.Gorzelanny","Ed.Volquez","An.Sanchez","B.Zito","C.Morton","M.Latos","R.VandenHurk","J.Maine","Da.Bush","Br.Penny","P"]
["P",null,"J.Hammel","L.Hochevar","F.Paulino","Tr.Wood","T.Wellemeyer","D.Herrera","K.Kendrick","De.Reyes",null,"J.Francis","V.Padilla","P"]
["P",null,"C.R.Young","Ed.Jackson","Ar.Chapman","S.Marshall","K.McClellan","Se.Green","D.McCutchen","Ra.Betancourt","T.Clippard",null,"I.Kennedy","P"]
["P","A.Bastardo","N.Masset","T.Stauffer","E.Mujica","R.Troncoso","S.Gallagher","Da.Meyer",null,"J.Thatcher","B.Lidge",null,"G.Mock","P"]
["P","P.Moylan","B.Lyon","Jo-Jo Reyes","B.Badenhop","J.Affeldt","L.Nunez","S.Romo",null,"L.Gregerson","C.Zavada",null,null,"P"]
["P","H.Kuo","Tre.Miller","R.Pinto","Mi.Adams","M.Capps","T.Byrdak","E.O'Flaherty",null,"C.Qualls","R.Franklin",null,null,"P"]
["P","R.Madson","T.Saito","H.Street","B.Wagner","Jen.Mejia","A.Rhodes","J.Motte","C.Marmol","Br.Wilson","B.Hawksworth","E.Caridad","T.Coffey","P"]
["P","Fr.Morales","O.Dotel","R.Soriano","F.Rodriguez","H.Bell","G.Sherrill","J.Broxton","T.Hoffman","K.Medlen","F.Cordero","M.Lindstrom","D.Runzler","P"]

{"sheet":"Draft","index":1,"n_rows":566,"n_cols":7,"rows_kept":566,"cut":false,"hidden":false,"merged":[]}
["Pick","Tm#","Owner","Team Name","SS#","Player","Comment"]
[1.01,6,{"$f":"VLOOKUP($B2,Data!$A$2:$C$13,3,0)","v":"Kevin"},{"$f":"VLOOKUP($B2,Data!$A$2:$C$13,2,0)","v":"The Luddites"},1003,{"$f":"IF(ISNA(VLOOKUP($E2,Data!$A$16:$B$1902,2,0)),\"\",VLOOKUP($E2,Data!$A$16:$B$1902,2,0))","v":"Lee, Cliff"},"Crossover Eligible"]
[1.02,5,{"$f":"VLOOKUP($B3,Data!$A$2:$C$13,3,0)","v":"Chris"},{"$f":"VLOOKUP($B3,Data!$A$2:$C$13,2,0)","v":"Memories of Mom"},1007,{"$f":"IF(ISNA(VLOOKUP($E3,Data!$A$16:$B$1902,2,0)),\"\",VLOOKUP($E3,Data!$A$16:$B$1902,2,0))","v":"Vazquez, Javier"},"Crossover Eligible"]
[1.03,2,{"$f":"VLOOKUP($B4,Data!$A$2:$C$13,3,0)","v":"Casey"},{"$f":"VLOOKUP($B4,Data!$A$2:$C$13,2,0)","v":"Tulsa Drillers"},1038,{"$f":"IF(ISNA(VLOOKUP($E4,Data!$A$16:$B$1902,2,0)),\"\",VLOOKUP($E4,Data!$A$16:$B$1902,2,0))","v":"Hochevar, Luke"},"Crossover Eligible"]
[1.04,11,{"$f":"VLOOKUP($B5,Data!$A$2:$C$13,3,0)","v":"Ray"},{"$f":"VLOOKUP($B5,Data!$A$2:$C$13,2,0)","v":"South Indy Thugs"},1034,{"$f":"IF(ISNA(VLOOKUP($E5,Data!$A$16:$B$1902,2,0)),\"\",VLOOKUP($E5,Data!$A$16:$B$1902,2,0))","v":"Kazmir, Scott"},"Crossover Eligible"]
[1.05,11,{"$f":"VLOOKUP($B6,Data!$A$2:$C$13,3,0)","v":"Ray"},{"$f":"VLOOKUP($B6,Data!$A$2:$C$13,2,0)","v":"South Indy Thugs"},1478,{"$f":"IF(ISNA(VLOOKUP($E6,Data!$A$16:$B$1902,2,0)),\"\",VLOOKUP($E6,Data!$A$16:$B$1902,2,0))","v":"Beltre, Adrian"},"Traded from Andy on 6.29.09 (with An.LaRoche for 15.05 & #44 in 2009)"]
[1.06,5,{"$f":"VLOOKUP($B7,Data!$A$2:$C$13,3,0)","v":"Chris"},{"$f":"VLOOKUP($B7,Data!$A$2:$C$13,2,0)","v":"Memories of Mom"},1029,{"$f":"IF(ISNA(VLOOKUP($E7,Data!$A$16:$B$1902,2,0)),\"\",VLOOKUP($E7,Data!$A$16:$B$1902,2,0))","v":"Scherzer, Max"},"Traded from D&J on 2.21.10 (with Jo.Hamilton & J.Happ for M.Holliday & 11.02) [Previously traded from Jeremy on 7.15.09 (for 13.11 to complete R.Braun deal)]"]
[1.07,9,{"$f":"VLOOKUP($B8,Data!$A$2:$C$13,3,0)","v":"Ryan"},{"$f":"VLOOKUP($B8,Data!$A$2:$C$13,2,0)","v":"Ryan's Team"},1565,{"$f":"IF(ISNA(VLOOKUP($E8,Data!$A$16:$B$1902,2,0)),\"\",VLOOKUP($E8,Data!$A$16:$B$1902,2,0))","v":"Abreu, Bobby"},"Crossover Eligible"]
[1.08,4,{"$f":"VLOOKUP($B9,Data!$A$2:$C$13,3,0)","v":"Tim & Jeremy(?) (drafted by Will/Ray)"},{"$f":"VLOOKUP($B9,Data!$A$2:$C$13,2,0)","v":"Romeo Warriors(?)"},9,{"$f":"IF(ISNA(VLOOKUP($E9,Data!$A$16:$B$1902,2,0)),\"\",VLOOKUP($E9,Data!$A$16:$B$1902,2,0))","v":"Jurrjens, Jair"},"Crossover Eligible"]
[1.0900000000000001,10,{"$f":"VLOOKUP($B10,Data!$A$2:$C$13,3,0)","v":"Bill"},{"$f":"VLOOKUP($B10,Data!$A$2:$C$13,2,0)","v":"Reggae Rebels"},1579,{"$f":"IF(ISNA(VLOOKUP($E10,Data!$A$16:$B$1902,2,0)),\"\",VLOOKUP($E10,Data!$A$16:$B$1902,2,0))","v":"Drew, J.D."},"Crossover Eligible"]
[1.1000000000000001,12,{"$f":"VLOOKUP($B11,Data!$A$2:$C$13,3,0)","v":"Mark"},{"$f":"VLOOKUP($B11,Data!$A$2:$C$13,2,0)","v":"W&S Life Insurers"},1011,{"$f":"IF(ISNA(VLOOKUP($E11,Data!$A$16:$B$1902,2,0)),\"\",VLOOKUP($E11,Data!$A$16:$B$1902,2,0))","v":"Burnett, A.J."},"Crossover Eligible"]
[1.1100000000000001,8,{"$f":"VLOOKUP($B12,Data!$A$2:$C$13,3,0)","v":"Duke & Josh"},{"$f":"VLOOKUP($B12,Data!$A$2:$C$13,2,0)","v":"Austin Ackbars"},1004,{"$f":"IF(ISNA(VLOOKUP($E12,Data!$A$16:$B$1902,2,0)),\"\",VLOOKUP($E12,Data!$A$16:$B$1902,2,0))","v":"Sabathia, C.C."},"Crossover Eligible"]
[1.1200000000000001,7,{"$f":"VLOOKUP($B13,Data!$A$2:$C$13,3,0)","v":"Jess & Tim"},{"$f":"VLOOKUP($B13,Data!$A$2:$C$13,2,0)","v":"Resistance is Futile"},1009,{"$f":"IF(ISNA(VLOOKUP($E13,Data!$A$16:$B$1902,2,0)),\"\",VLOOKUP($E13,Data!$A$16:$B$1902,2,0))","v":"Beckett, Josh"},"Crossover Eligible"]
[2.0099999999999998,6,{"$f":"VLOOKUP($B14,Data!$A$2:$C$13,3,0)","v":"Kevin"},{"$f":"VLOOKUP($B14,Data!$A$2:$C$13,2,0)","v":"The Luddites"},1596,{"$f":"IF(ISNA(VLOOKUP($E14,Data!$A$16:$B$1902,2,0)),\"\",VLOOKUP($E14,Data!$A$16:$B$1902,2,0))","v":"Guerrero, Vladimir"},"Crossover Eligible"]
[2.02,5,{"$f":"VLOOKUP($B15,Data!$A$2:$C$13,3,0)","v":"Chris"},{"$f":"VLOOKUP($B15,Data!$A$2:$C$13,2,0)","v":"Memories of Mom"},1600,{"$f":"IF(ISNA(VLOOKUP($E15,Data!$A$16:$B$1902,2,0)),\"\",VLOOKUP($E15,Data!$A$16:$B$1902,2,0))","v":"Hamilton, Josh"},"Crossover Eligible"]
[2.0299999999999998,2,{"$f":"VLOOKUP($B16,Data!$A$2:$C$13,3,0)","v":"Casey"},{"$f":"VLOOKUP($B16,Data!$A$2:$C$13,2,0)","v":"Tulsa Drillers"},1229,{"$f":"IF(ISNA(VLOOKUP($E16,Data!$A$16:$B$1902,2,0)),\"\",VLOOKUP($E16,Data!$A$16:$B$1902,2,0))","v":"Soriano, Rafael"},"Crossover Eligible"]
[2.04,3,{"$f":"VLOOKUP($B17,Data!$A$2:$C$13,3,0)","v":"Andy"},{"$f":"VLOOKUP($B17,Data!$A$2:$C$13,2,0)","v":"Cripplers"},1400,{"$f":"IF(ISNA(VLOOKUP($E17,Data!$A$16:$B$1902,2,0)),\"\",VLOOKUP($E17,Data!$A$16:$B$1902,2,0))","v":"Cabrera, Miguel"},"Crossover Eligible"]
[2.0499999999999998,11,{"$f":"VLOOKUP($B18,Data!$A$2:$C$13,3,0)","v":"Ray"},{"$f":"VLOOKUP($B18,Data!$A$2:$C$13,2,0)","v":"South Indy Thugs"},1598,{"$f":"IF(ISNA(VLOOKUP($E18,Data!$A$16:$B$1902,2,0)),\"\",VLOOKUP($E18,Data!$A$16:$B$1902,2,0))","v":"Quentin, Carlos"},"Crossover Eligible"]
[2.06,7,{"$f":"VLOOKUP($B19,Data!$A$2:$C$13,3,0)","v":"Jess & Tim"},{"$f":"VLOOKUP($B19,Data!$A$2:$C$13,2,0)","v":"Resistance is Futile"},1058,{"$f":"IF(ISNA(VLOOKUP($E19,Data!$A$16:$B$1902,2,0)),\"\",VLOOKUP($E19,Data!$A$16:$B$1902,2,0))","v":"Peavy, Jake"},"Traded from Jeremy on 3.22.10 (for C.Heisey & 13.12)"]
[2.0699999999999998,9,{"$f":"VLOOKUP($B20,Data!$A$2:$C$13,3,0)","v":"Ryan"},{"$f":"VLOOKUP($B20,Data!$A$2:$C$13,2,0)","v":"Ryan's Team"},1693,{"$f":"IF(ISNA(VLOOKUP($E20,Data!$A$16:$B$1902,2,0)),\"\",VLOOKUP($E20,Data!$A$16:$B$1902,2,0))","v":"Tejada, Miguel"},"Crossover Eligible"]
[2.08,4,{"$f":"VLOOKUP($B21,Data!$A$2:$C$13,3,0)","v":"Tim & Jeremy(?) (drafted by Will/Ray)"},{"$f":"VLOOKUP($B21,Data!$A$2:$C$13,2,0)","v":"Romeo Warriors(?)"},14,{"$f":"IF(ISNA(VLOOKUP($E21,Data!$A$16:$B$1902,2,0)),\"\",VLOOKUP($E21,Data!$A$16:$B$1902,2,0))","v":"Lannan, John"},"Crossover Eligible"]
[2.09,7,{"$f":"VLOOKUP($B22,Data!$A$2:$C$13,3,0)","v":"Jess & Tim"},{"$f":"VLOOKUP($B22,Data!$A$2:$C$13,2,0)","v":"Resistance is Futile"},1696,{"$f":"IF(ISNA(VLOOKUP($E22,Data!$A$16:$B$1902,2,0)),\"\",VLOOKUP($E22,Data!$A$16:$B$1902,2,0))","v":"Sheets, Ben"},"Traded from Bill on 3.22.10 (for 12.12 & 20.12)"]
[2.1,4,{"$f":"VLOOKUP($B23,Data!$A$2:$C$13,3,0)","v":"Tim & Jeremy(?) (drafted by Will/Ray)"},{"$f":"VLOOKUP($B23,Data!$A$2:$C$13,2,0)","v":"Romeo Warriors(?)"},1513,{"$f":"IF(ISNA(VLOOKUP($E23,Data!$A$16:$B$1902,2,0)),\"\",VLOOKUP($E23,Data!$A$16:$B$1902,2,0))","v":"Andrus, Elvis"},"Andrus traded by Mark during the draft for S.Drew & J.Francoeur"]
[2.11,8,{"$f":"VLOOKUP($B24,Data!$A$2:$C$13,3,0)","v":"Duke & Josh"},{"$f":"VLOOKUP($B24,Data!$A$2:$C$13,2,0)","v":"Austin Ackbars"},1399,{"$f":"IF(ISNA(VLOOKUP($E24,Data!$A$16:$B$1902,2,0)),\"\",VLOOKUP($E24,Data!$A$16:$B$1902,2,0))","v":"Teixeira, Mark"},"Crossover Eligible"]
[2.12,7,{"$f":"VLOOKUP($B25,Data!$A$2:$C$13,3,0)","v":"Jess & Tim"},{"$f":"VLOOKUP($B25,Data!$A$2:$C$13,2,0)","v":"Resistance is Futile"},1735,{"$f":"IF(ISNA(VLOOKUP($E25,Data!$A$16:$B$1902,2,0)),\"\",VLOOKUP($E25,Data!$A$16:$B$1902,2,0))","v":"Hudson, Orlando"},"Crossover Eligible"]
[3.01,6,{"$f":"VLOOKUP($B26,Data!$A$2:$C$13,3,0)","v":"Kevin"},{"$f":"VLOOKUP($B26,Data!$A$2:$C$13,2,0)","v":"The Luddites"},20,{"$f":"IF(ISNA(VLOOKUP($E26,Data!$A$16:$B$1902,2,0)),\"\",VLOOKUP($E26,Data!$A$16:$B$1902,2,0))","v":"Lowe, Derek"}]
[3.02,5,{"$f":"VLOOKUP($B27,Data!$A$2:$C$13,3,0)","v":"Chris"},{"$f":"VLOOKUP($B27,Data!$A$2:$C$13,2,0)","v":"Memories of Mom"},28,{"$f":"IF(ISNA(VLOOKUP($E27,Data!$A$16:$B$1902,2,0)),\"\",VLOOKUP($E27,Data!$A$16:$B$1902,2,0))","v":"Pelfrey, Mike"}]
[3.03,2,{"$f":"VLOOKUP($B28,Data!$A$2:$C$13,3,0)","v":"Casey"},{"$f":"VLOOKUP($B28,Data!$A$2:$C$13,2,0)","v":"Tulsa Drillers"},19,{"$f":"IF(ISNA(VLOOKUP($E28,Data!$A$16:$B$1902,2,0)),\"\",VLOOKUP($E28,Data!$A$16:$B$1902,2,0))","v":"Blanton, Joe"}]
[3.04,11,{"$f":"VLOOKUP($B29,Data!$A$2:$C$13,3,0)","v":"Ray"},{"$f":"VLOOKUP($B29,Data!$A$2:$C$13,2,0)","v":"South Indy Thugs"},53,{"$f":"IF(ISNA(VLOOKUP($E29,Data!$A$16:$B$1902,2,0)),\"\",VLOOKUP($E29,Data!$A$16:$B$1902,2,0))","v":"Kuroda, Hiroki"}]
[3.05,3,{"$f":"VLOOKUP($B30,Data!$A$2:$C$13,3,0)","v":"Andy"},{"$f":"VLOOKUP($B30,Data!$A$2:$C$13,2,0)","v":"Cripplers"},6,{"$f":"IF(ISNA(VLOOKUP($E30,Data!$A$16:$B$1902,2,0)),\"\",VLOOKUP($E30,Data!$A$16:$B$1902,2,0))","v":"Jimenez, Ubaldo"}]
[3.06,1,{"$f":"VLOOKUP($B31,Data!$A$2:$C$13,3,0)","v":"Jeremy"},{"$f":"VLOOKUP($B31,Data!$A$2:$C$13,2,0)","v":"Uninspired"},4,{"$f":"IF(ISNA(VLOOKUP($E31,Data!$A$16:$B$1902,2,0)),\"\",VLOOKUP($E31,Data!$A$16:$B$1902,2,0))","v":"Lincecum, Tim"}]
[3.07,9,{"$f":"VLOOKUP($B32,Data!$A$2:$C$13,3,0)","v":"Ryan"},{"$f":"VLOOKUP($B32,Data!$A$2:$C$13,2,0)","v":"Ryan's Team"},29,{"$f":"IF(ISNA(VLOOKUP($E32,Data!$A$16:$B$1902,2,0)),\"\",VLOOKUP($E32,Data!$A$16:$B$1902,2,0))","v":"Oswalt, Roy"}]
[3.08,4,{"$f":"VLOOKUP($B33,Data!$A$2:$C$13,3,0)","v":"Tim & Jeremy(?) (drafted by Will/Ray)"},{"$f":"VLOOKUP($B33,Data!$A$2:$C$13,2,0)","v":"Romeo Warriors(?)"},15,{"$f":"IF(ISNA(VLOOKUP($E33,Data!$A$16:$B$1902,2,0)),\"\",VLOOKUP($E33,Data!$A$16:$B$1902,2,0))","v":"Rodriguez, Wandy"}]
[3.09,10,{"$f":"VLOOKUP($B34,Data!$A$2:$C$13,3,0)","v":"Bill"},{"$f":"VLOOKUP($B34,Data!$A$2:$C$13,2,0)","v":"Reggae Rebels"},7,{"$f":"IF(ISNA(VLOOKUP($E34,Data!$A$16:$B$1902,2,0)),\"\",VLOOKUP($E34,Data!$A$16:$B$1902,2,0))","v":"Cain, Matt"}]
[3.1,12,{"$f":"VLOOKUP($B35,Data!$A$2:$C$13,3,0)","v":"Mark"},{"$f":"VLOOKUP($B35,Data!$A$2:$C$13,2,0)","v":"W&S Life Insurers"},2,{"$f":"IF(ISNA(VLOOKUP($E35,Data!$A$16:$B$1902,2,0)),\"\",VLOOKUP($E35,Data!$A$16:$B$1902,2,0))","v":"Wainwright, Adam"}]
[3.11,8,{"$f":"VLOOKUP($B36,Data!$A$2:$C$13,3,0)","v":"Duke & Josh"},{"$f":"VLOOKUP($B36,Data!$A$2:$C$13,2,0)","v":"Austin Ackbars"},3,{"$f":"IF(ISNA(VLOOKUP($E36,Data!$A$16:$B$1902,2,0)),\"\",VLOOKUP($E36,Data!$A$16:$B$1902,2,0))","v":"Haren, Dan"}]
[3.12,7,{"$f":"VLOOKUP($B37,Data!$A$2:$C$13,3,0)","v":"Jess & Tim"},{"$f":"VLOOKUP($B37,Data!$A$2:$C$13,2,0)","v":"Resistance is Futile"},36,{"$f":"IF(ISNA(VLOOKUP($E37,Data!$A$16:$B$1902,2,0)),\"\",VLOOKUP($E37,Data!$A$16:$B$1902,2,0))","v":"Zambrano, Carlos"}]
[4.01,6,{"$f":"VLOOKUP($B38,Data!$A$2:$C$13,3,0)","v":"Kevin"},{"$f":"VLOOKUP($B38,Data!$A$2:$C$13,2,0)","v":"The Luddites"},46,{"$f":"IF(ISNA(VLOOKUP($E38,Data!$A$16:$B$1902,2,0)),\"\",VLOOKUP($E38,Data!$A$16:$B$1902,2,0))","v":"Kawakami, Kenshin"}]
[4.0199999999999996,5,{"$f":"VLOOKUP($B39,Data!$A$2:$C$13,3,0)","v":"Chris"},{"$f":"VLOOKUP($B39,Data!$A$2:$C$13,2,0)","v":"Memories of Mom"},30,{"$f":"IF(ISNA(VLOOKUP($E39,Data!$A$16:$B$1902,2,0)),\"\",VLOOKUP($E39,Data!$A$16:$B$1902,2,0))","v":"Lilly, Ted"}]
[4.03,2,{"$f":"VLOOKUP($B40,Data!$A$2:$C$13,3,0)","v":"Casey"},{"$f":"VLOOKUP($B40,Data!$A$2:$C$13,2,0)","v":"Tulsa Drillers"},21,{"$f":"IF(ISNA(VLOOKUP($E40,Data!$A$16:$B$1902,2,0)),\"\",VLOOKUP($E40,Data!$A$16:$B$1902,2,0))","v":"Maholm, Paul"}]
[4.04,3,{"$f":"VLOOKUP($B41,Data!$A$2:$C$13,3,0)","v":"Andy"},{"$f":"VLOOKUP($B41,Data!$A$2:$C$13,2,0)","v":"Cripplers"},26,{"$f":"IF(ISNA(VLOOKUP($E41,Data!$A$16:$B$1902,2,0)),\"\",VLOOKUP($E41,Data!$A$16:$B$1902,2,0))","v":"delaRosa, Jorge"}]
[4.05,11,{"$f":"VLOOKUP($B42,Data!$A$2:$C$13,3,0)","v":"Ray"},{"$f":"VLOOKUP($B42,Data!$A$2:$C$13,2,0)","v":"South Indy Thugs"},55,{"$f":"IF(ISNA(VLOOKUP($E42,Data!$A$16:$B$1902,2,0)),\"\",VLOOKUP($E42,Data!$A$16:$B$1902,2,0))","v":"Bailey, Homer"}]
[4.0599999999999996,1,{"$f":"VLOOKUP($B43,Data!$A$2:$C$13,3,0)","v":"Jeremy"},{"$f":"VLOOKUP($B43,Data!$A$2:$C$13,2,0)","v":"Uninspired"},37,{"$f":"IF(ISNA(VLOOKUP($E43,Data!$A$16:$B$1902,2,0)),\"\",VLOOKUP($E43,Data!$A$16:$B$1902,2,0))","v":"Santana, Johan"}]
[4.07,9,{"$f":"VLOOKUP($B44,Data!$A$2:$C$13,3,0)","v":"Ryan"},{"$f":"VLOOKUP($B44,Data!$A$2:$C$13,2,0)","v":"Ryan's Team"},34,{"$f":"IF(ISNA(VLOOKUP($E44,Data!$A$16:$B$1902,2,0)),\"\",VLOOKUP($E44,Data!$A$16:$B$1902,2,0))","v":"Cueto, Johnny"}]
[4.08,4,{"$f":"VLOOKUP($B45,Data!$A$2:$C$13,3,0)","v":"Tim & Jeremy(?) (drafted by Will/Ray)"},{"$f":"VLOOKUP($B45,Data!$A$2:$C$13,2,0)","v":"Romeo Warriors(?)"},16,{"$f":"IF(ISNA(VLOOKUP($E45,Data!$A$16:$B$1902,2,0)),\"\",VLOOKUP($E45,Data!$A$16:$B$1902,2,0))","v":"Dempster, Ryan"}]
[4.09,10,{"$f":"VLOOKUP($B46,Data!$A$2:$C$13,3,0)","v":"Bill"},{"$f":"VLOOKUP($B46,Data!$A$2:$C$13,2,0)","v":"Reggae Rebels"},18,{"$f":"IF(ISNA(VLOOKUP($E46,Data!$A$16:$B$1902,2,0)),\"\",VLOOKUP($E46,Data!$A$16:$B$1902,2,0))","v":"Billingsley, Chad"}]
[4.0999999999999996,12,{"$f":"VLOOKUP($B47,Data!$A$2:$C$13,3,0)","v":"Mark"},{"$f":"VLOOKUP($B47,Data!$A$2:$C$13,2,0)","v":"W&S Life Insurers"},8,{"$f":"IF(ISNA(VLOOKUP($E47,Data!$A$16:$B$1902,2,0)),\"\",VLOOKUP($E47,Data!$A$16:$B$1902,2,0))","v":"Marquis, Jason"}]
[4.1100000000000003,8,{"$f":"VLOOKUP($B48,Data!$A$2:$C$13,3,0)","v":"Duke & Josh"},{"$f":"VLOOKUP($B48,Data!$A$2:$C$13,2,0)","v":"Austin Ackbars"},13,{"$f":"IF(ISNA(VLOOKUP($E48,Data!$A$16:$B$1902,2,0)),\"\",VLOOKUP($E48,Data!$A$16:$B$1902,2,0))","v":"Johnson(Flo), Josh"}]
[4.12,7,{"$f":"VLOOKUP($B49,Data!$A$2:$C$13,3,0)","v":"Jess & Tim"},{"$f":"VLOOKUP($B49,Data!$A$2:$C$13,2,0)","v":"Resistance is Futile"},388,{"$f":"IF(ISNA(VLOOKUP($E49,Data!$A$16:$B$1902,2,0)),\"\",VLOOKUP($E49,Data!$A$16:$B$1902,2,0))","v":"Soto, Geovany"}]
[5.01,6,{"$f":"VLOOKUP($B50,Data!$A$2:$C$13,3,0)","v":"Kevin"},{"$f":"VLOOKUP($B50,Data!$A$2:$C$13,2,0)","v":"The Luddites"},314,{"$f":"IF(ISNA(VLOOKUP($E50,Data!$A$16:$B$1902,2,0)),\"\",VLOOKUP($E50,Data!$A$16:$B$1902,2,0))","v":"Morales, Franklin"}]
[5.0199999999999996,5,{"$f":"VLOOKUP($B51,Data!$A$2:$C$13,3,0)","v":"Chris"},{"$f":"VLOOKUP($B51,Data!$A$2:$C$13,2,0)","v":"Memories of Mom"},38,{"$f":"IF(ISNA(VLOOKUP($E51,Data!$A$16:$B$1902,2,0)),\"\",VLOOKUP($E51,Data!$A$16:$B$1902,2,0))","v":"Happ, J.A."}]
[5.03,2,{"$f":"VLOOKUP($B52,Data!$A$2:$C$13,3,0)","v":"Casey"},{"$f":"VLOOKUP($B52,Data!$A$2:$C$13,2,0)","v":"Tulsa Drillers"},27,{"$f":"IF(ISNA(VLOOKUP($E52,Data!$A$16:$B$1902,2,0)),\"\",VLOOKUP($E52,Data!$A$16:$B$1902,2,0))","v":"Nolasco, Ricky"}]
[5.04,11,{"$f":"VLOOKUP($B53,Data!$A$2:$C$13,3,0)","v":"Ray"},{"$f":"VLOOKUP($B53,Data!$A$2:$C$13,2,0)","v":"South Indy Thugs"},86,{"$f":"IF(ISNA(VLOOKUP($E53,Data!$A$16:$B$1902,2,0)),\"\",VLOOKUP($E53,Data!$A$16:$B$1902,2,0))","v":"McDonald, James"}]
[5.05,3,{"$f":"VLOOKUP($B54,Data!$A$2:$C$13,3,0)","v":"Andy"},{"$f":"VLOOKUP($B54,Data!$A$2:$C$13,2,0)","v":"Cripplers"},35,{"$f":"IF(ISNA(VLOOKUP($E54,Data!$A$16:$B$1902,2,0)),\"\",VLOOKUP($E54,Data!$A$16:$B$1902,2,0))","v":"Kershaw, Clayton"}]
[5.0599999999999996,1,{"$f":"VLOOKUP($B55,Data!$A$2:$C$13,3,0)","v":"Jeremy"},{"$f":"VLOOKUP($B55,Data!$A$2:$C$13,2,0)","v":"Uninspired"},40,{"$f":"IF(ISNA(VLOOKUP($E55,Data!$A$16:$B$1902,2,0)),\"\",VLOOKUP($E55,Data!$A$16:$B$1902,2,0))","v":"Sanchez, Jonathan"}]
[5.07,9,{"$f":"VLOOKUP($B56,Data!$A$2:$C$13,3,0)","v":"Ryan"},{"$f":"VLOOKUP($B56,Data!$A$2:$C$13,2,0)","v":"Ryan's Team"},245,{"$f":"IF(ISNA(VLOOKUP($E56,Data!$A$16:$B$1902,2,0)),\"\",VLOOKUP($E56,Data!$A$16:$B$1902,2,0))","v":"Broxton, Jonathan"}]
[5.08,4,{"$f":"VLOOKUP($B57,Data!$A$2:$C$13,3,0)","v":"Tim & Jeremy(?) (drafted by Will/Ray)"},{"$f":"VLOOKUP($B57,Data!$A$2:$C$13,2,0)","v":"Romeo Warriors(?)"},39,{"$f":"IF(ISNA(VLOOKUP($E57,Data!$A$16:$B$1902,2,0)),\"\",VLOOKUP($E57,Data!$A$16:$B$1902,2,0))","v":"Wells, Randy"}]
[5.09,10,{"$f":"VLOOKUP($B58,Data!$A$2:$C$13,3,0)","v":"Bill"},{"$f":"VLOOKUP($B58,Data!$A$2:$C$13,2,0)","v":"Reggae Rebels"},22,{"$f":"IF(ISNA(VLOOKUP($E58,Data!$A$16:$B$1902,2,0)),\"\",VLOOKUP($E58,Data!$A$16:$B$1902,2,0))","v":"Hamels, Cole"}]
[5.0999999999999996,12,{"$f":"VLOOKUP($B59,Data!$A$2:$C$13,3,0)","v":"Mark"},{"$f":"VLOOKUP($B59,Data!$A$2:$C$13,2,0)","v":"W&S Life Insurers"},10,{"$f":"IF(ISNA(VLOOKUP($E59,Data!$A$16:$B$1902,2,0)),\"\",VLOOKUP($E59,Data!$A$16:$B$1902,2,0))","v":"Wolf, Randy"}]
[5.1100000000000003,8,{"$f":"VLOOKUP($B60,Data!$A$2:$C$13,3,0)","v":"Duke & Josh"},{"$f":"VLOOKUP($B60,Data!$A$2:$C$13,2,0)","v":"Austin Ackbars"},17,{"$f":"IF(ISNA(VLOOKUP($E60,Data!$A$16:$B$1902,2,0)),\"\",VLOOKUP($E60,Data!$A$16:$B$1902,2,0))","v":"Correia, Kevin"}]
[5.12,7,{"$f":"VLOOKUP($B61,Data!$A$2:$C$13,3,0)","v":"Jess & Tim"},{"$f":"VLOOKUP($B61,Data!$A$2:$C$13,2,0)","v":"Resistance is Futile"},390,{"$f":"IF(ISNA(VLOOKUP($E61,Data!$A$16:$B$1902,2,0)),\"\",VLOOKUP($E61,Data!$A$16:$B$1902,2,0))","v":"Iannetta, Chris"}]
[6.01,6,{"$f":"VLOOKUP($B62,Data!$A$2:$C$13,3,0)","v":"Kevin"},{"$f":"VLOOKUP($B62,Data!$A$2:$C$13,2,0)","v":"The Luddites"},395,{"$f":"IF(ISNA(VLOOKUP($E62,Data!$A$16:$B$1902,2,0)),\"\",VLOOKUP($E62,Data!$A$16:$B$1902,2,0))","v":"Hanigan, Ryan"}]
[6.02,5,{"$f":"VLOOKUP($B63,Data!$A$2:$C$13,3,0)","v":"Chris"},{"$f":"VLOOKUP($B63,Data!$A$2:$C$13,2,0)","v":"Memories of Mom"},50,{"$f":"IF(ISNA(VLOOKUP($E63,Data!$A$16:$B$1902,2,0)),\"\",VLOOKUP($E63,Data!$A$16:$B$1902,2,0))","v":"Hanson, Thomas"}]
[6.03,2,{"$f":"VLOOKUP($B64,Data!$A$2:$C$13,3,0)","v":"Casey"},{"$f":"VLOOKUP($B64,Data!$A$2:$C$13,2,0)","v":"Tulsa Drillers"},49,{"$f":"IF(ISNA(VLOOKUP($E64,Data!$A$16:$B$1902,2,0)),\"\",VLOOKUP($E64,Data!$A$16:$B$1902,2,0))","v":"Parra, Manny"}]
[6.04,3,{"$f":"VLOOKUP($B65,Data!$A$2:$C$13,3,0)","v":"Andy"},{"$f":"VLOOKUP($B65,Data!$A$2:$C$13,2,0)","v":"Cripplers"},41,{"$f":"IF(ISNA(VLOOKUP($E65,Data!$A$16:$B$1902,2,0)),\"\",VLOOKUP($E65,Data!$A$16:$B$1902,2,0))","v":"Harang, Aaron"}]
[6.05,11,{"$f":"VLOOKUP($B66,Data!$A$2:$C$13,3,0)","v":"Ray"},{"$f":"VLOOKUP($B66,Data!$A$2:$C$13,2,0)","v":"South Indy Thugs"},99,{"$f":"IF(ISNA(VLOOKUP($E66,Data!$A$16:$B$1902,2,0)),\"\",VLOOKUP($E66,Data!$A$16:$B$1902,2,0))","v":"Hudson, Tim"}]
[6.06,1,{"$f":"VLOOKUP($B67,Data!$A$2:$C$13,3,0)","v":"Jeremy"},{"$f":"VLOOKUP($B67,Data!$A$2:$C$13,2,0)","v":"Uninspired"},44,{"$f":"IF(ISNA(VLOOKUP($E67,Data!$A$16:$B$1902,2,0)),\"\",VLOOKUP($E67,Data!$A$16:$B$1902,2,0))","v":"Volstad, Chris"}]
[6.07,9,{"$f":"VLOOKUP($B68,Data!$A$2:$C$13,3,0)","v":"Ryan"},{"$f":"VLOOKUP($B68,Data!$A$2:$C$13,2,0)","v":"Ryan's Team"},284,{"$f":"IF(ISNA(VLOOKUP($E68,Data!$A$16:$B$1902,2,0)),\"\",VLOOKUP($E68,Data!$A$16:$B$1902,2,0))","v":"Motte, Jason"}]
[6.08,4,{"$f":"VLOOKUP($B69,Data!$A$2:$C$13,3,0)","v":"Tim & Jeremy(?) (drafted by Will/Ray)"},{"$f":"VLOOKUP($B69,Data!$A$2:$C$13,2,0)","v":"Romeo Warriors(?)"},92,{"$f":"IF(ISNA(VLOOKUP($E69,Data!$A$16:$B$1902,2,0)),\"\",VLOOKUP($E69,Data!$A$16:$B$1902,2,0))","v":"Latos, Mat"}]
[6.09,10,{"$f":"VLOOKUP($B70,Data!$A$2:$C$13,3,0)","v":"Bill"},{"$f":"VLOOKUP($B70,Data!$A$2:$C$13,2,0)","v":"Reggae Rebels"},25,{"$f":"IF(ISNA(VLOOKUP($E70,Data!$A$16:$B$1902,2,0)),\"\",VLOOKUP($E70,Data!$A$16:$B$1902,2,0))","v":"Gallardo, Yovani"}]
[6.1,12,{"$f":"VLOOKUP($B71,Data!$A$2:$C$13,3,0)","v":"Mark"},{"$f":"VLOOKUP($B71,Data!$A$2:$C$13,2,0)","v":"W&S Life Insurers"},23,{"$f":"IF(ISNA(VLOOKUP($E71,Data!$A$16:$B$1902,2,0)),\"\",VLOOKUP($E71,Data!$A$16:$B$1902,2,0))","v":"Carpenter, Chris"}]
[6.11,8,{"$f":"VLOOKUP($B72,Data!$A$2:$C$13,3,0)","v":"Duke & Josh"},{"$f":"VLOOKUP($B72,Data!$A$2:$C$13,2,0)","v":"Austin Ackbars"},48,{"$f":"IF(ISNA(VLOOKUP($E72,Data!$A$16:$B$1902,2,0)),\"\",VLOOKUP($E72,Data!$A$16:$B$1902,2,0))","v":"Richard, Clayton"}]
[6.12,7,{"$f":"VLOOKUP($B73,Data!$A$2:$C$13,3,0)","v":"Jess & Tim"},{"$f":"VLOOKUP($B73,Data!$A$2:$C$13,2,0)","v":"Resistance is Futile"},441,{"$f":"IF(ISNA(VLOOKUP($E73,Data!$A$16:$B$1902,2,0)),\"\",VLOOKUP($E73,Data!$A$16:$B$1902,2,0))","v":"Pujols, Albert"}]
[7.01,6,{"$f":"VLOOKUP($B74,Data!$A$2:$C$13,3,0)","v":"Kevin"},{"$f":"VLOOKUP($B74,Data!$A$2:$C$13,2,0)","v":"The Luddites"},444,{"$f":"IF(ISNA(VLOOKUP($E74,Data!$A$16:$B$1902,2,0)),\"\",VLOOKUP($E74,Data!$A$16:$B$1902,2,0))","v":"Loney, James"}]
[7.02,5,{"$f":"VLOOKUP($B75,Data!$A$2:$C$13,3,0)","v":"Chris"},{"$f":"VLOOKUP($B75,Data!$A$2:$C$13,2,0)","v":"Memories of Mom"},531,{"$f":"IF(ISNA(VLOOKUP($E75,Data!$A$16:$B$1902,2,0)),\"\",VLOOKUP($E75,Data!$A$16:$B$1902,2,0))","v":"Ramirez, Aramis"}]
[7.03,2,{"$f":"VLOOKUP($B76,Data!$A$2:$C$13,3,0)","v":"Casey"},{"$f":"VLOOKUP($B76,Data!$A$2:$C$13,2,0)","v":"Tulsa Drillers"},52,{"$f":"IF(ISNA(VLOOKUP($E76,Data!$A$16:$B$1902,2,0)),\"\",VLOOKUP($E76,Data!$A$16:$B$1902,2,0))","v":"Lohse, Kyle"}]
[7.04,11,{"$f":"VLOOKUP($B77,Data!$A$2:$C$13,3,0)","v":"Ray"},{"$f":"VLOOKUP($B77,Data!$A$2:$C$13,2,0)","v":"South Indy Thugs"},258,{"$f":"IF(ISNA(VLOOKUP($E77,Data!$A$16:$B$1902,2,0)),\"\",VLOOKUP($E77,Data!$A$16:$B$1902,2,0))","v":"Bell, Heath"}]
[7.05,3,{"$f":"VLOOKUP($B78,Data!$A$2:$C$13,3,0)","v":"Andy"},{"$f":"VLOOKUP($B78,Data!$A$2:$C$13,2,0)","v":"Cripplers"},144,{"$f":"IF(ISNA(VLOOKUP($E78,Data!$A$16:$B$1902,2,0)),\"\",VLOOKUP($E78,Data!$A$16:$B$1902,2,0))","v":"Webb, Brandon"}]
[7.06,1,{"$f":"VLOOKUP($B79,Data!$A$2:$C$13,3,0)","v":"Jeremy"},{"$f":"VLOOKUP($B79,Data!$A$2:$C$13,2,0)","v":"Uninspired"},80,{"$f":"IF(ISNA(VLOOKUP($E79,Data!$A$16:$B$1902,2,0)),\"\",VLOOKUP($E79,Data!$A$16:$B$1902,2,0))","v":"Myers, Brett"}]
[7.07,9,{"$f":"VLOOKUP($B80,Data!$A$2:$C$13,3,0)","v":"Ryan"},{"$f":"VLOOKUP($B80,Data!$A$2:$C$13,2,0)","v":"Ryan's Team"},391,{"$f":"IF(ISNA(VLOOKUP($E80,Data!$A$16:$B$1902,2,0)),\"\",VLOOKUP($E80,Data!$A$16:$B$1902,2,0))","v":"Hernandez, Ramon"}]
[7.08,4,{"$f":"VLOOKUP($B81,Data!$A$2:$C$13,3,0)","v":"Tim & Jeremy(?) (drafted by Will/Ray)"},{"$f":"VLOOKUP($B81,Data!$A$2:$C$13,2,0)","v":"Romeo Warriors(?)"},384,{"$f":"IF(ISNA(VLOOKUP($E81,Data!$A$16:$B$1902,2,0)),\"\",VLOOKUP($E81,Data!$A$16:$B$1902,2,0))","v":"Montero, Miguel"}]
[7.09,10,{"$f":"VLOOKUP($B82,Data!$A$2:$C$13,3,0)","v":"Bill"},{"$f":"VLOOKUP($B82,Data!$A$2:$C$13,2,0)","v":"Reggae Rebels"},381,{"$f":"IF(ISNA(VLOOKUP($E82,Data!$A$16:$B$1902,2,0)),\"\",VLOOKUP($E82,Data!$A$16:$B$1902,2,0))","v":"Martin, Russell"}]
[7.1,12,{"$f":"VLOOKUP($B83,Data!$A$2:$C$13,3,0)","v":"Mark"},{"$f":"VLOOKUP($B83,Data!$A$2:$C$13,2,0)","v":"W&S Life Insurers"},265,{"$f":"IF(ISNA(VLOOKUP($E83,Data!$A$16:$B$1902,2,0)),\"\",VLOOKUP($E83,Data!$A$16:$B$1902,2,0))","v":"Cordero, Francisco"}]
[7.11,8,{"$f":"VLOOKUP($B84,Data!$A$2:$C$13,3,0)","v":"Duke & Josh"},{"$f":"VLOOKUP($B84,Data!$A$2:$C$13,2,0)","v":"Austin Ackbars"},526,{"$f":"IF(ISNA(VLOOKUP($E84,Data!$A$16:$B$1902,2,0)),\"\",VLOOKUP($E84,Data!$A$16:$B$1902,2,0))","v":"DeRosa, Mark"}]
[7.12,7,{"$f":"VLOOKUP($B85,Data!$A$2:$C$13,3,0)","v":"Jess & Tim"},{"$f":"VLOOKUP($B85,Data!$A$2:$C$13,2,0)","v":"Resistance is Futile"},483,{"$f":"IF(ISNA(VLOOKUP($E85,Data!$A$16:$B$1902,2,0)),\"\",VLOOKUP($E85,Data!$A$16:$B$1902,2,0))","v":"Prado, Martin"}]
[8.01,6,{"$f":"VLOOKUP($B86,Data!$A$2:$C$13,3,0)","v":"Kevin"},{"$f":"VLOOKUP($B86,Data!$A$2:$C$13,2,0)","v":"The Luddites"},477,{"$f":"IF(ISNA(VLOOKUP($E86,Data!$A$16:$B$1902,2,0)),\"\",VLOOKUP($E86,Data!$A$16:$B$1902,2,0))","v":"Phillips, Brandon"}]
[8.02,5,{"$f":"VLOOKUP($B87,Data!$A$2:$C$13,3,0)","v":"Chris"},{"$f":"VLOOKUP($B87,Data!$A$2:$C$13,2,0)","v":"Memories of Mom"},582,{"$f":"IF(ISNA(VLOOKUP($E87,Data!$A$16:$B$1902,2,0)),\"\",VLOOKUP($E87,Data!$A$16:$B$1902,2,0))","v":"Reyes(NYN), Jose"}]
[8.0299999999999994,2,{"$f":"VLOOKUP($B88,Data!$A$2:$C$13,3,0)","v":"Casey"},{"$f":"VLOOKUP($B88,Data!$A$2:$C$13,2,0)","v":"Tulsa Drillers"},95,{"$f":"IF(ISNA(VLOOKUP($E88,Data!$A$16:$B$1902,2,0)),\"\",VLOOKUP($E88,Data!$A$16:$B$1902,2,0))","v":"Gorzelanny, Tom"}]
[8.0399999999999991,3,{"$f":"VLOOKUP($B89,Data!$A$2:$C$13,3,0)","v":"Andy"},{"$f":"VLOOKUP($B89,Data!$A$2:$C$13,2,0)","v":"Cripplers"},263,{"$f":"IF(ISNA(VLOOKUP($E89,Data!$A$16:$B$1902,2,0)),\"\",VLOOKUP($E89,Data!$A$16:$B$1902,2,0))","v":"Rodriguez, Francisco"}]
[8.0500000000000007,11,{"$f":"VLOOKUP($B90,Data!$A$2:$C$13,3,0)","v":"Ray"},{"$f":"VLOOKUP($B90,Data!$A$2:$C$13,2,0)","v":"South Indy Thugs"},447,{"$f":"IF(ISNA(VLOOKUP($E90,Data!$A$16:$B$1902,2,0)),\"\",VLOOKUP($E90,Data!$A$16:$B$1902,2,0))","v":"Lee, Derrek"}]
[8.06,1,{"$f":"VLOOKUP($B91,Data!$A$2:$C$13,3,0)","v":"Jeremy"},{"$f":"VLOOKUP($B91,Data!$A$2:$C$13,2,0)","v":"Uninspired"},382,{"$f":"IF(ISNA(VLOOKUP($E91,Data!$A$16:$B$1902,2,0)),\"\",VLOOKUP($E91,Data!$A$16:$B$1902,2,0))","v":"McCann, Brian"}]
[8.07,9,{"$f":"VLOOKUP($B92,Data!$A$2:$C$13,3,0)","v":"Ryan"},{"$f":"VLOOKUP($B92,Data!$A$2:$C$13,2,0)","v":"Ryan's Team"},474,{"$f":"IF(ISNA(VLOOKUP($E92,Data!$A$16:$B$1902,2,0)),\"\",VLOOKUP($E92,Data!$A$16:$B$1902,2,0))","v":"Utley, Chase"}]
[8.08,4,{"$f":"VLOOKUP($B93,Data!$A$2:$C$13,3,0)","v":"Tim & Jeremy(?) (drafted by Will/Ray)"},{"$f":"VLOOKUP($B93,Data!$A$2:$C$13,2,0)","v":"Romeo Warriors(?)"},443,{"$f":"IF(ISNA(VLOOKUP($E93,Data!$A$16:$B$1902,2,0)),\"\",VLOOKUP($E93,Data!$A$16:$B$1902,2,0))","v":"Dunn, Adam"}]
[8.09,10,{"$f":"VLOOKUP($B94,Data!$A$2:$C$13,3,0)","v":"Bill"},{"$f":"VLOOKUP($B94,Data!$A$2:$C$13,2,0)","v":"Reggae Rebels"},439,{"$f":"IF(ISNA(VLOOKUP($E94,Data!$A$16:$B$1902,2,0)),\"\",VLOOKUP($E94,Data!$A$16:$B$1902,2,0))","v":"Fielder, Prince"}]
[8.1,12,{"$f":"VLOOKUP($B95,Data!$A$2:$C$13,3,0)","v":"Mark"},{"$f":"VLOOKUP($B95,Data!$A$2:$C$13,2,0)","v":"W&S Life Insurers"},383,{"$f":"IF(ISNA(VLOOKUP($E95,Data!$A$16:$B$1902,2,0)),\"\",VLOOKUP($E95,Data!$A$16:$B$1902,2,0))","v":"Molina, Yadier"}]
[8.11,8,{"$f":"VLOOKUP($B96,Data!$A$2:$C$13,3,0)","v":"Duke & Josh"},{"$f":"VLOOKUP($B96,Data!$A$2:$C$13,2,0)","v":"Austin Ackbars"},561,{"$f":"IF(ISNA(VLOOKUP($E96,Data!$A$16:$B$1902,2,0)),\"\",VLOOKUP($E96,Data!$A$16:$B$1902,2,0))","v":"Ramirez, Hanley"}]
[8.1199999999999992,7,{"$f":"VLOOKUP($B97,Data!$A$2:$C$13,3,0)","v":"Jess & Tim"},{"$f":"VLOOKUP($B97,Data!$A$2:$C$13,2,0)","v":"Resistance is Futile"},517,{"$f":"IF(ISNA(VLOOKUP($E97,Data!$A$16:$B$1902,2,0)),\"\",VLOOKUP($E97,Data!$A$16:$B$1902,2,0))","v":"Zimmerman, Ryan"}]
[9.01,6,{"$f":"VLOOKUP($B98,Data!$A$2:$C$13,3,0)","v":"Kevin"},{"$f":"VLOOKUP($B98,Data!$A$2:$C$13,2,0)","v":"The Luddites"},518,{"$f":"IF(ISNA(VLOOKUP($E98,Data!$A$16:$B$1902,2,0)),\"\",VLOOKUP($E98,Data!$A$16:$B$1902,2,0))","v":"Reynolds, Mark"}]
[9.02,5,{"$f":"VLOOKUP($B99,Data!$A$2:$C$13,3,0)","v":"Chris"},{"$f":"VLOOKUP($B99,Data!$A$2:$C$13,2,0)","v":"Memories of Mom"},621,{"$f":"IF(ISNA(VLOOKUP($E99,Data!$A$16:$B$1902,2,0)),\"\",VLOOKUP($E99,Data!$A$16:$B$1902,2,0))","v":"Pence, Hunter"}]
[9.0299999999999994,2,{"$f":"VLOOKUP($B100,Data!$A$2:$C$13,3,0)","v":"Casey"},{"$f":"VLOOKUP($B100,Data!$A$2:$C$13,2,0)","v":"Tulsa Drillers"},392,{"$f":"IF(ISNA(VLOOKUP($E100,Data!$A$16:$B$1902,2,0)),\"\",VLOOKUP($E100,Data!$A$16:$B$1902,2,0))","v":"Doumit, Ryan"}]
[9.0399999999999991,11,{"$f":"VLOOKUP($B101,Data!$A$2:$C$13,3,0)","v":"Ray"},{"$f":"VLOOKUP($B101,Data!$A$2:$C$13,2,0)","v":"South Indy Thugs"},525,{"$f":"IF(ISNA(VLOOKUP($E101,Data!$A$16:$B$1902,2,0)),\"\",VLOOKUP($E101,Data!$A$16:$B$1902,2,0))","v":"LaRoche, Andy"}]
[9.0500000000000007,3,{"$f":"VLOOKUP($B102,Data!$A$2:$C$13,3,0)","v":"Andy"},{"$f":"VLOOKUP($B102,Data!$A$2:$C$13,2,0)","v":"Cripplers"},498,{"$f":"IF(ISNA(VLOOKUP($E102,Data!$A$16:$B$1902,2,0)),\"\",VLOOKUP($E102,Data!$A$16:$B$1902,2,0))","v":"Weeks, Rickie"}]
[9.06,1,{"$f":"VLOOKUP($B103,Data!$A$2:$C$13,3,0)","v":"Jeremy"},{"$f":"VLOOKUP($B103,Data!$A$2:$C$13,2,0)","v":"Uninspired"},451,{"$f":"IF(ISNA(VLOOKUP($E103,Data!$A$16:$B$1902,2,0)),\"\",VLOOKUP($E103,Data!$A$16:$B$1902,2,0))","v":"Votto, Joey"}]
[9.07,9,{"$f":"VLOOKUP($B104,Data!$A$2:$C$13,3,0)","v":"Ryan"},{"$f":"VLOOKUP($B104,Data!$A$2:$C$13,2,0)","v":"Ryan's Team"},524,{"$f":"IF(ISNA(VLOOKUP($E104,Data!$A$16:$B$1902,2,0)),\"\",VLOOKUP($E104,Data!$A$16:$B$1902,2,0))","v":"Jones, Chipper"}]
[9.08,4,{"$f":"VLOOKUP($B105,Data!$A$2:$C$13,3,0)","v":"Tim & Jeremy(?) (drafted by Will/Ray)"},{"$f":"VLOOKUP($B105,Data!$A$2:$C$13,2,0)","v":"Romeo Warriors(?)"},522,{"$f":"IF(ISNA(VLOOKUP($E105,Data!$A$16:$B$1902,2,0)),\"\",VLOOKUP($E105,Data!$A$16:$B$1902,2,0))","v":"Wright, David"}]
[9.09,10,{"$f":"VLOOKUP($B106,Data!$A$2:$C$13,3,0)","v":"Bill"},{"$f":"VLOOKUP($B106,Data!$A$2:$C$13,2,0)","v":"Reggae Rebels"},449,{"$f":"IF(ISNA(VLOOKUP($E106,Data!$A$16:$B$1902,2,0)),\"\",VLOOKUP($E106,Data!$A$16:$B$1902,2,0))","v":"Berkman, Lance"}]
[9.1,12,{"$f":"VLOOKUP($B107,Data!$A$2:$C$13,3,0)","v":"Mark"},{"$f":"VLOOKUP($B107,Data!$A$2:$C$13,2,0)","v":"W&S Life Insurers"},442,{"$f":"IF(ISNA(VLOOKUP($E107,Data!$A$16:$B$1902,2,0)),\"\",VLOOKUP($E107,Data!$A$16:$B$1902,2,0))","v":"Gonzalez, Adrian"}]
[9.11,8,{"$f":"VLOOKUP($B108,Data!$A$2:$C$13,3,0)","v":"Duke & Josh"},{"$f":"VLOOKUP($B108,Data!$A$2:$C$13,2,0)","v":"Austin Ackbars"},613,{"$f":"IF(ISNA(VLOOKUP($E108,Data!$A$16:$B$1902,2,0)),\"\",VLOOKUP($E108,Data!$A$16:$B$1902,2,0))","v":"Braun(Mil), Ryan"}]
[9.1199999999999992,7,{"$f":"VLOOKUP($B109,Data!$A$2:$C$13,3,0)","v":"Jess & Tim"},{"$f":"VLOOKUP($B109,Data!$A$2:$C$13,2,0)","v":"Resistance is Futile"},562,{"$f":"IF(ISNA(VLOOKUP($E109,Data!$A$16:$B$1902,2,0)),\"\",VLOOKUP($E109,Data!$A$16:$B$1902,2,0))","v":"Tulowitzki, Troy"}]
[10.01,6,{"$f":"VLOOKUP($B110,Data!$A$2:$C$13,3,0)","v":"Kevin"},{"$f":"VLOOKUP($B110,Data!$A$2:$C$13,2,0)","v":"The Luddites"},529,{"$f":"IF(ISNA(VLOOKUP($E110,Data!$A$16:$B$1902,2,0)),\"\",VLOOKUP($E110,Data!$A$16:$B$1902,2,0))","v":"Stewart, Ian"}]
[10.02,5,{"$f":"VLOOKUP($B111,Data!$A$2:$C$13,3,0)","v":"Chris"},{"$f":"VLOOKUP($B111,Data!$A$2:$C$13,2,0)","v":"Memories of Mom"},647,{"$f":"IF(ISNA(VLOOKUP($E111,Data!$A$16:$B$1902,2,0)),\"\",VLOOKUP($E111,Data!$A$16:$B$1902,2,0))","v":"Ramirez, Manny"}]
[10.029999999999999,2,{"$f":"VLOOKUP($B112,Data!$A$2:$C$13,3,0)","v":"Casey"},{"$f":"VLOOKUP($B112,Data!$A$2:$C$13,2,0)","v":"Tulsa Drillers"},440,{"$f":"IF(ISNA(VLOOKUP($E112,Data!$A$16:$B$1902,2,0)),\"\",VLOOKUP($E112,Data!$A$16:$B$1902,2,0))","v":"Howard, Ryan"}]
[10.039999999999999,3,{"$f":"VLOOKUP($B113,Data!$A$2:$C$13,3,0)","v":"Andy"},{"$f":"VLOOKUP($B113,Data!$A$2:$C$13,2,0)","v":"Cripplers"},528,{"$f":"IF(ISNA(VLOOKUP($E113,Data!$A$16:$B$1902,2,0)),\"\",VLOOKUP($E113,Data!$A$16:$B$1902,2,0))","v":"Rolen, Scott"}]
[10.050000000000001,11,{"$f":"VLOOKUP($B114,Data!$A$2:$C$13,3,0)","v":"Ray"},{"$f":"VLOOKUP($B114,Data!$A$2:$C$13,2,0)","v":"South Indy Thugs"},560,{"$f":"IF(ISNA(VLOOKUP($E114,Data!$A$16:$B$1902,2,0)),\"\",VLOOKUP($E114,Data!$A$16:$B$1902,2,0))","v":"Theriot, Ryan"}]
[10.06,1,{"$f":"VLOOKUP($B115,Data!$A$2:$C$13,3,0)","v":"Jeremy"},{"$f":"VLOOKUP($B115,Data!$A$2:$C$13,2,0)","v":"Uninspired"},491,{"$f":"IF(ISNA(VLOOKUP($E115,Data!$A$16:$B$1902,2,0)),\"\",VLOOKUP($E115,Data!$A$16:$B$1902,2,0))","v":"Johnson, Kelly"}]
[10.07,9,{"$f":"VLOOKUP($B116,Data!$A$2:$C$13,3,0)","v":"Ryan"},{"$f":"VLOOKUP($B116,Data!$A$2:$C$13,2,0)","v":"Ryan's Team"},617,{"$f":"IF(ISNA(VLOOKUP($E116,Data!$A$16:$B$1902,2,0)),\"\",VLOOKUP($E116,Data!$A$16:$B$1902,2,0))","v":"Werth, Jayson"}]
[10.08,12,{"$f":"VLOOKUP($B117,Data!$A$2:$C$13,3,0)","v":"Mark"},{"$f":"VLOOKUP($B117,Data!$A$2:$C$13,2,0)","v":"W&S Life Insurers"},564,{"$f":"IF(ISNA(VLOOKUP($E117,Data!$A$16:$B$1902,2,0)),\"\",VLOOKUP($E117,Data!$A$16:$B$1902,2,0))","v":"Drew, Stephen"},"Drew traded from T&J during the draft with J.Francoeur for E.Andrus"]
[10.09,10,{"$f":"VLOOKUP($B118,Data!$A$2:$C$13,3,0)","v":"Bill"},{"$f":"VLOOKUP($B118,Data!$A$2:$C$13,2,0)","v":"Reggae Rebels"},520,{"$f":"IF(ISNA(VLOOKUP($E118,Data!$A$16:$B$1902,2,0)),\"\",VLOOKUP($E118,Data!$A$16:$B$1902,2,0))","v":"Sandoval, Pablo"}]
[10.1,12,{"$f":"VLOOKUP($B119,Data!$A$2:$C$13,3,0)","v":"Mark"},{"$f":"VLOOKUP($B119,Data!$A$2:$C$13,2,0)","v":"W&S Life Insurers"},475,{"$f":"IF(ISNA(VLOOKUP($E119,Data!$A$16:$B$1902,2,0)),\"\",VLOOKUP($E119,Data!$A$16:$B$1902,2,0))","v":"Uggla, Dan"}]
[10.11,8,{"$f":"VLOOKUP($B120,Data!$A$2:$C$13,3,0)","v":"Duke & Josh"},{"$f":"VLOOKUP($B120,Data!$A$2:$C$13,2,0)","v":"Austin Ackbars"},614,{"$f":"IF(ISNA(VLOOKUP($E120,Data!$A$16:$B$1902,2,0)),\"\",VLOOKUP($E120,Data!$A$16:$B$1902,2,0))","v":"Victorino, Shane"}]
[10.119999999999999,7,{"$f":"VLOOKUP($B121,Data!$A$2:$C$13,3,0)","v":"Jess & Tim"},{"$f":"VLOOKUP($B121,Data!$A$2:$C$13,2,0)","v":"Resistance is Futile"},637,{"$f":"IF(ISNA(VLOOKUP($E121,Data!$A$16:$B$1902,2,0)),\"\",VLOOKUP($E121,Data!$A$16:$B$1902,2,0))","v":"Rasmus, Colby"}]
[11.01,6,{"$f":"VLOOKUP($B122,Data!$A$2:$C$13,3,0)","v":"Kevin"},{"$f":"VLOOKUP($B122,Data!$A$2:$C$13,2,0)","v":"The Luddites"},569,{"$f":"IF(ISNA(VLOOKUP($E122,Data!$A$16:$B$1902,2,0)),\"\",VLOOKUP($E122,Data!$A$16:$B$1902,2,0))","v":"Cabrera, Everth"}]
[11.02,8,{"$f":"VLOOKUP($B123,Data!$A$2:$C$13,3,0)","v":"Duke & Josh"},{"$f":"VLOOKUP($B123,Data!$A$2:$C$13,2,0)","v":"Austin Ackbars"},618,{"$f":"IF(ISNA(VLOOKUP($E123,Data!$A$16:$B$1902,2,0)),\"\",VLOOKUP($E123,Data!$A$16:$B$1902,2,0))","v":"Holliday, Matt"},"Traded from Chris on 2.21.10 (with M.Holliday for Jo.Hamilton, J.Happ, & 1.06)"]
[11.03,2,{"$f":"VLOOKUP($B124,Data!$A$2:$C$13,3,0)","v":"Casey"},{"$f":"VLOOKUP($B124,Data!$A$2:$C$13,2,0)","v":"Tulsa Drillers"},445,{"$f":"IF(ISNA(VLOOKUP($E124,Data!$A$16:$B$1902,2,0)),\"\",VLOOKUP($E124,Data!$A$16:$B$1902,2,0))","v":"Helton, Todd"}]
[11.04,11,{"$f":"VLOOKUP($B125,Data!$A$2:$C$13,3,0)","v":"Ray"},{"$f":"VLOOKUP($B125,Data!$A$2:$C$13,2,0)","v":"South Indy Thugs"},631,{"$f":"IF(ISNA(VLOOKUP($E125,Data!$A$16:$B$1902,2,0)),\"\",VLOOKUP($E125,Data!$A$16:$B$1902,2,0))","v":"Ibanez, Raul"}]
[11.05,3,{"$f":"VLOOKUP($B126,Data!$A$2:$C$13,3,0)","v":"Andy"},{"$f":"VLOOKUP($B126,Data!$A$2:$C$13,2,0)","v":"Cripplers"},641,{"$f":"IF(ISNA(VLOOKUP($E126,Data!$A$16:$B$1902,2,0)),\"\",VLOOKUP($E126,Data!$A$16:$B$1902,2,0))","v":"McCutchen, Andrew"}]
[11.06,1,{"$f":"VLOOKUP($B127,Data!$A$2:$C$13,3,0)","v":"Jeremy"},{"$f":"VLOOKUP($B127,Data!$A$2:$C$13,2,0)","v":"Uninspired"},541,{"$f":"IF(ISNA(VLOOKUP($E127,Data!$A$16:$B$1902,2,0)),\"\",VLOOKUP($E127,Data!$A$16:$B$1902,2,0))","v":"Glaus, Troy"}]
[11.07,9,{"$f":"VLOOKUP($B128,Data!$A$2:$C$13,3,0)","v":"Ryan"},{"$f":"VLOOKUP($B128,Data!$A$2:$C$13,2,0)","v":"Ryan's Team"},636,{"$f":"IF(ISNA(VLOOKUP($E128,Data!$A$16:$B$1902,2,0)),\"\",VLOOKUP($E128,Data!$A$16:$B$1902,2,0))","v":"Morgan, Nyjer"}]
[11.08,4,{"$f":"VLOOKUP($B129,Data!$A$2:$C$13,3,0)","v":"Tim & Jeremy(?) (drafted by Will/Ray)"},{"$f":"VLOOKUP($B129,Data!$A$2:$C$13,2,0)","v":"Romeo Warriors(?)"},627,{"$f":"IF(ISNA(VLOOKUP($E129,Data!$A$16:$B$1902,2,0)),\"\",VLOOKUP($E129,Data!$A$16:$B$1902,2,0))","v":"Hawpe, Brad"}]
[11.09,10,{"$f":"VLOOKUP($B130,Data!$A$2:$C$13,3,0)","v":"Bill"},{"$f":"VLOOKUP($B130,Data!$A$2:$C$13,2,0)","v":"Reggae Rebels"},558,{"$f":"IF(ISNA(VLOOKUP($E130,Data!$A$16:$B$1902,2,0)),\"\",VLOOKUP($E130,Data!$A$16:$B$1902,2,0))","v":"Rollins, Jimmy"}]
[11.1,12,{"$f":"VLOOKUP($B131,Data!$A$2:$C$13,3,0)","v":"Mark"},{"$f":"VLOOKUP($B131,Data!$A$2:$C$13,2,0)","v":"W&S Life Insurers"},615,{"$f":"IF(ISNA(VLOOKUP($E131,Data!$A$16:$B$1902,2,0)),\"\",VLOOKUP($E131,Data!$A$16:$B$1902,2,0))","v":"Ethier, Andre"}]
[11.11,8,{"$f":"VLOOKUP($B132,Data!$A$2:$C$13,3,0)","v":"Duke & Josh"},{"$f":"VLOOKUP($B132,Data!$A$2:$C$13,2,0)","v":"Austin Ackbars"},754,{"$f":"IF(ISNA(VLOOKUP($E132,Data!$A$16:$B$1902,2,0)),\"\",VLOOKUP($E132,Data!$A$16:$B$1902,2,0))","v":"Molina, Bengie"}]
[11.12,7,{"$f":"VLOOKUP($B133,Data!$A$2:$C$13,3,0)","v":"Jess & Tim"},{"$f":"VLOOKUP($B133,Data!$A$2:$C$13,2,0)","v":"Resistance is Futile"},638,{"$f":"IF(ISNA(VLOOKUP($E133,Data!$A$16:$B$1902,2,0)),\"\",VLOOKUP($E133,Data!$A$16:$B$1902,2,0))","v":"Fowler, Dexter"}]
[12.01,6,{"$f":"VLOOKUP($B134,Data!$A$2:$C$13,3,0)","v":"Kevin"},{"$f":"VLOOKUP($B134,Data!$A$2:$C$13,2,0)","v":"The Luddites"},619,{"$f":"IF(ISNA(VLOOKUP($E134,Data!$A$16:$B$1902,2,0)),\"\",VLOOKUP($E134,Data!$A$16:$B$1902,2,0))","v":"Kemp, Matt"}]
[12.02,7,{"$f":"VLOOKUP($B135,Data!$A$2:$C$13,3,0)","v":"Jess & Tim"},{"$f":"VLOOKUP($B135,Data!$A$2:$C$13,2,0)","v":"Resistance is Futile"},655,{"$f":"IF(ISNA(VLOOKUP($E135,Data!$A$16:$B$1902,2,0)),\"\",VLOOKUP($E135,Data!$A$16:$B$1902,2,0))","v":"Bruce, Jay"},"Traded from Chris on 8.12.09 (with 40.00 & #44-47 in 2009 for 15.12 & T.Alderson)"]
[12.03,2,{"$f":"VLOOKUP($B136,Data!$A$2:$C$13,3,0)","v":"Casey"},{"$f":"VLOOKUP($B136,Data!$A$2:$C$13,2,0)","v":"Tulsa Drillers"},643,{"$f":"IF(ISNA(VLOOKUP($E136,Data!$A$16:$B$1902,2,0)),\"\",VLOOKUP($E136,Data!$A$16:$B$1902,2,0))","v":"Hart(Mil), Corey"}]
[12.04,3,{"$f":"VLOOKUP($B137,Data!$A$2:$C$13,3,0)","v":"Andy"},{"$f":"VLOOKUP($B137,Data!$A$2:$C$13,2,0)","v":"Cripplers"},664,{"$f":"IF(ISNA(VLOOKUP($E137,Data!$A$16:$B$1902,2,0)),\"\",VLOOKUP($E137,Data!$A$16:$B$1902,2,0))","v":"Gonzalez, Carlos"}]
[12.05,11,{"$f":"VLOOKUP($B138,Data!$A$2:$C$13,3,0)","v":"Ray"},{"$f":"VLOOKUP($B138,Data!$A$2:$C$13,2,0)","v":"South Indy Thugs"},620,{"$f":"IF(ISNA(VLOOKUP($E138,Data!$A$16:$B$1902,2,0)),\"\",VLOOKUP($E138,Data!$A$16:$B$1902,2,0))","v":"Lee, Carlos"}]
[12.06,1,{"$f":"VLOOKUP($B139,Data!$A$2:$C$13,3,0)","v":"Jeremy"},{"$f":"VLOOKUP($B139,Data!$A$2:$C$13,2,0)","v":"Uninspired"},563,{"$f":"IF(ISNA(VLOOKUP($E139,Data!$A$16:$B$1902,2,0)),\"\",VLOOKUP($E139,Data!$A$16:$B$1902,2,0))","v":"Escobar, Yunel"}]
[12.07,9,{"$f":"VLOOKUP($B140,Data!$A$2:$C$13,3,0)","v":"Ryan"},{"$f":"VLOOKUP($B140,Data!$A$2:$C$13,2,0)","v":"Ryan's Team"},650,{"$f":"IF(ISNA(VLOOKUP($E140,Data!$A$16:$B$1902,2,0)),\"\",VLOOKUP($E140,Data!$A$16:$B$1902,2,0))","v":"Diaz, Matt"}]
[12.08,4,{"$f":"VLOOKUP($B141,Data!$A$2:$C$13,3,0)","v":"Tim & Jeremy(?) (drafted by Will/Ray)"},{"$f":"VLOOKUP($B141,Data!$A$2:$C$13,2,0)","v":"Romeo Warriors(?)"},630,{"$f":"IF(ISNA(VLOOKUP($E141,Data!$A$16:$B$1902,2,0)),\"\",VLOOKUP($E141,Data!$A$16:$B$1902,2,0))","v":"Coghlan, Chris"}]
[12.09,10,{"$f":"VLOOKUP($B142,Data!$A$2:$C$13,3,0)","v":"Bill"},{"$f":"VLOOKUP($B142,Data!$A$2:$C$13,2,0)","v":"Reggae Rebels"},624,{"$f":"IF(ISNA(VLOOKUP($E142,Data!$A$16:$B$1902,2,0)),\"\",VLOOKUP($E142,Data!$A$16:$B$1902,2,0))","v":"Ross, Cody"}]
[12.1,12,{"$f":"VLOOKUP($B143,Data!$A$2:$C$13,3,0)","v":"Mark"},{"$f":"VLOOKUP($B143,Data!$A$2:$C$13,2,0)","v":"W&S Life Insurers"},622,{"$f":"IF(ISNA(VLOOKUP($E143,Data!$A$16:$B$1902,2,0)),\"\",VLOOKUP($E143,Data!$A$16:$B$1902,2,0))","v":"Bay, Jason"}]
[12.11,8,{"$f":"VLOOKUP($B144,Data!$A$2:$C$13,3,0)","v":"Duke & Josh"},{"$f":"VLOOKUP($B144,Data!$A$2:$C$13,2,0)","v":"Austin Ackbars"},787,{"$f":"IF(ISNA(VLOOKUP($E144,Data!$A$16:$B$1902,2,0)),\"\",VLOOKUP($E144,Data!$A$16:$B$1902,2,0))","v":"Lopez, Felipe"}]
[12.12,10,{"$f":"VLOOKUP($B145,Data!$A$2:$C$13,3,0)","v":"Bill"},{"$f":"VLOOKUP($B145,Data!$A$2:$C$13,2,0)","v":"Reggae Rebels"},628,{"$f":"IF(ISNA(VLOOKUP($E145,Data!$A$16:$B$1902,2,0)),\"\",VLOOKUP($E145,Data!$A$16:$B$1902,2,0))","v":"McLouth, Nate"},"Traded from JTP on 3.22.10 (with 20.12 for 2.09)"]
[13.01,6,{"$f":"VLOOKUP($B146,Data!$A$2:$C$13,3,0)","v":"Kevin"},{"$f":"VLOOKUP($B146,Data!$A$2:$C$13,2,0)","v":"The Luddites"},676,{"$f":"IF(ISNA(VLOOKUP($E146,Data!$A$16:$B$1902,2,0)),\"\",VLOOKUP($E146,Data!$A$16:$B$1902,2,0))","v":"Blanks, Kyle"}]
[13.02,7,{"$f":"VLOOKUP($B147,Data!$A$2:$C$13,3,0)","v":"Jess & Tim"},{"$f":"VLOOKUP($B147,Data!$A$2:$C$13,2,0)","v":"Resistance is Futile"},658,{"$f":"IF(ISNA(VLOOKUP($E147,Data!$A$16:$B$1902,2,0)),\"\",VLOOKUP($E147,Data!$A$16:$B$1902,2,0))","v":"Beltran, Carlos"},"Traded from Chris on 5.27.09 (with N.Johnson, R.Madson,  & 36.00 for 17.12 & 21.12)"]
[13.03,2,{"$f":"VLOOKUP($B148,Data!$A$2:$C$13,3,0)","v":"Casey"},{"$f":"VLOOKUP($B148,Data!$A$2:$C$13,2,0)","v":"Tulsa Drillers"},684,{"$f":"IF(ISNA(VLOOKUP($E148,Data!$A$16:$B$1902,2,0)),\"\",VLOOKUP($E148,Data!$A$16:$B$1902,2,0))","v":"Jackson, Conor"}]
[13.04,11,{"$f":"VLOOKUP($B149,Data!$A$2:$C$13,3,0)","v":"Ray"},{"$f":"VLOOKUP($B149,Data!$A$2:$C$13,2,0)","v":"South Indy Thugs"},673,{"$f":"IF(ISNA(VLOOKUP($E149,Data!$A$16:$B$1902,2,0)),\"\",VLOOKUP($E149,Data!$A$16:$B$1902,2,0))","v":"Stubbs, Drew"}]
[13.05,3,{"$f":"VLOOKUP($B150,Data!$A$2:$C$13,3,0)","v":"Andy"},{"$f":"VLOOKUP($B150,Data!$A$2:$C$13,2,0)","v":"Cripplers"},674,{"$f":"IF(ISNA(VLOOKUP($E150,Data!$A$16:$B$1902,2,0)),\"\",VLOOKUP($E150,Data!$A$16:$B$1902,2,0))","v":"Maybin, Cameron"}]
[13.06,1,{"$f":"VLOOKUP($B151,Data!$A$2:$C$13,3,0)","v":"Jeremy"},{"$f":"VLOOKUP($B151,Data!$A$2:$C$13,2,0)","v":"Uninspired"},635,{"$f":"IF(ISNA(VLOOKUP($E151,Data!$A$16:$B$1902,2,0)),\"\",VLOOKUP($E151,Data!$A$16:$B$1902,2,0))","v":"Soriano, Alfonso"}]
[13.07,9,{"$f":"VLOOKUP($B152,Data!$A$2:$C$13,3,0)","v":"Ryan"},{"$f":"VLOOKUP($B152,Data!$A$2:$C$13,2,0)","v":"Ryan's Team"},753,{"$f":"IF(ISNA(VLOOKUP($E152,Data!$A$16:$B$1902,2,0)),\"\",VLOOKUP($E152,Data!$A$16:$B$1902,2,0))","v":"Davis, Doug"}]
[13.08,4,{"$f":"VLOOKUP($B153,Data!$A$2:$C$13,3,0)","v":"Tim & Jeremy(?) (drafted by Will/Ray)"},{"$f":"VLOOKUP($B153,Data!$A$2:$C$13,2,0)","v":"Romeo Warriors(?)"},632,{"$f":"IF(ISNA(VLOOKUP($E153,Data!$A$16:$B$1902,2,0)),\"\",VLOOKUP($E153,Data!$A$16:$B$1902,2,0))","v":"Rowand, Aaron"}]
[13.09,10,{"$f":"VLOOKUP($B154,Data!$A$2:$C$13,3,0)","v":"Bill"},{"$f":"VLOOKUP($B154,Data!$A$2:$C$13,2,0)","v":"Reggae Rebels"},629,{"$f":"IF(ISNA(VLOOKUP($E154,Data!$A$16:$B$1902,2,0)),\"\",VLOOKUP($E154,Data!$A$16:$B$1902,2,0))","v":"Upton, Justin"}]
[13.1,12,{"$f":"VLOOKUP($B155,Data!$A$2:$C$13,3,0)","v":"Mark"},{"$f":"VLOOKUP($B155,Data!$A$2:$C$13,2,0)","v":"W&S Life Insurers"},633,{"$f":"IF(ISNA(VLOOKUP($E155,Data!$A$16:$B$1902,2,0)),\"\",VLOOKUP($E155,Data!$A$16:$B$1902,2,0))","v":"Ludwick, Ryan"}]
[13.11,1,{"$f":"VLOOKUP($B156,Data!$A$2:$C$13,3,0)","v":"Jeremy"},{"$f":"VLOOKUP($B156,Data!$A$2:$C$13,2,0)","v":"Uninspired"},640,{"$f":"IF(ISNA(VLOOKUP($E156,Data!$A$16:$B$1902,2,0)),\"\",VLOOKUP($E156,Data!$A$16:$B$1902,2,0))","v":"Young(Ari), ChrisB."},"Traded from D&J on 7.15.09 (for 1.06 to complete R.Braun deal)"]
[13.12,1,{"$f":"VLOOKUP($B157,Data!$A$2:$C$13,3,0)","v":"Jeremy"},{"$f":"VLOOKUP($B157,Data!$A$2:$C$13,2,0)","v":"Uninspired"},659,{"$f":"IF(ISNA(VLOOKUP($E157,Data!$A$16:$B$1902,2,0)),\"\",VLOOKUP($E157,Data!$A$16:$B$1902,2,0))","v":"Jones, Garrett"},"Traded from JTP on 3.22.10 (with C.Heisey for 2.06)"]
[14.01,6,{"$f":"VLOOKUP($B158,Data!$A$2:$C$13,3,0)","v":"Kevin"},{"$f":"VLOOKUP($B158,Data!$A$2:$C$13,2,0)","v":"The Luddites"},1,{"$f":"IF(ISNA(VLOOKUP($E158,Data!$A$16:$B$1902,2,0)),\"\",VLOOKUP($E158,Data!$A$16:$B$1902,2,0))","v":"Halladay, Roy"}]
[14.02,5,{"$f":"VLOOKUP($B159,Data!$A$2:$C$13,3,0)","v":"Chris"},{"$f":"VLOOKUP($B159,Data!$A$2:$C$13,2,0)","v":"Memories of Mom"},446,{"$f":"IF(ISNA(VLOOKUP($E159,Data!$A$16:$B$1902,2,0)),\"\",VLOOKUP($E159,Data!$A$16:$B$1902,2,0))","v":"LaRoche, Adam"}]
[14.03,2,{"$f":"VLOOKUP($B160,Data!$A$2:$C$13,3,0)","v":"Casey"},{"$f":"VLOOKUP($B160,Data!$A$2:$C$13,2,0)","v":"Tulsa Drillers"},11,{"$f":"IF(ISNA(VLOOKUP($E160,Data!$A$16:$B$1902,2,0)),\"\",VLOOKUP($E160,Data!$A$16:$B$1902,2,0))","v":"Jackson, Edwin"}]
[14.04,3,{"$f":"VLOOKUP($B161,Data!$A$2:$C$13,3,0)","v":"Andy"},{"$f":"VLOOKUP($B161,Data!$A$2:$C$13,2,0)","v":"Cripplers"},187,{"$f":"IF(ISNA(VLOOKUP($E161,Data!$A$16:$B$1902,2,0)),\"\",VLOOKUP($E161,Data!$A$16:$B$1902,2,0))","v":"Chapman, Aroldis"}]
[14.05,11,{"$f":"VLOOKUP($B162,Data!$A$2:$C$13,3,0)","v":"Ray"},{"$f":"VLOOKUP($B162,Data!$A$2:$C$13,2,0)","v":"South Indy Thugs"},476,{"$f":"IF(ISNA(VLOOKUP($E162,Data!$A$16:$B$1902,2,0)),\"\",VLOOKUP($E162,Data!$A$16:$B$1902,2,0))","v":"Polanco, Placido"}]
[14.06,1,{"$f":"VLOOKUP($B163,Data!$A$2:$C$13,3,0)","v":"Jeremy"},{"$f":"VLOOKUP($B163,Data!$A$2:$C$13,2,0)","v":"Uninspired"},523,{"$f":"IF(ISNA(VLOOKUP($E163,Data!$A$16:$B$1902,2,0)),\"\",VLOOKUP($E163,Data!$A$16:$B$1902,2,0))","v":"Headley, Chase"}]
[14.07,9,{"$f":"VLOOKUP($B164,Data!$A$2:$C$13,3,0)","v":"Ryan"},{"$f":"VLOOKUP($B164,Data!$A$2:$C$13,2,0)","v":"Ryan's Team"},639,{"$f":"IF(ISNA(VLOOKUP($E164,Data!$A$16:$B$1902,2,0)),\"\",VLOOKUP($E164,Data!$A$16:$B$1902,2,0))","v":"Willingham, Josh"}]
[14.08,4,{"$f":"VLOOKUP($B165,Data!$A$2:$C$13,3,0)","v":"Tim & Jeremy(?) (drafted by Will/Ray)"},{"$f":"VLOOKUP($B165,Data!$A$2:$C$13,2,0)","v":"Romeo Warriors(?)"},559,{"$f":"IF(ISNA(VLOOKUP($E165,Data!$A$16:$B$1902,2,0)),\"\",VLOOKUP($E165,Data!$A$16:$B$1902,2,0))","v":"Furcal, Rafael"}]
[14.09,10,{"$f":"VLOOKUP($B166,Data!$A$2:$C$13,3,0)","v":"Bill"},{"$f":"VLOOKUP($B166,Data!$A$2:$C$13,2,0)","v":"Reggae Rebels"},82,{"$f":"IF(ISNA(VLOOKUP($E166,Data!$A$16:$B$1902,2,0)),\"\",VLOOKUP($E166,Data!$A$16:$B$1902,2,0))","v":"Medlen, Kris"}]
[14.1,12,{"$f":"VLOOKUP($B167,Data!$A$2:$C$13,3,0)","v":"Mark"},{"$f":"VLOOKUP($B167,Data!$A$2:$C$13,2,0)","v":"W&S Life Insurers"},5,{"$f":"IF(ISNA(VLOOKUP($E167,Data!$A$16:$B$1902,2,0)),\"\",VLOOKUP($E167,Data!$A$16:$B$1902,2,0))","v":"Arroyo, Bronson"}]
[14.11,8,{"$f":"VLOOKUP($B168,Data!$A$2:$C$13,3,0)","v":"Duke & Josh"},{"$f":"VLOOKUP($B168,Data!$A$2:$C$13,2,0)","v":"Austin Ackbars"},599,{"$f":"IF(ISNA(VLOOKUP($E168,Data!$A$16:$B$1902,2,0)),\"\",VLOOKUP($E168,Data!$A$16:$B$1902,2,0))","v":"Castro, Starlin"}]
[14.12,7,{"$f":"VLOOKUP($B169,Data!$A$2:$C$13,3,0)","v":"Jess & Tim"},{"$f":"VLOOKUP($B169,Data!$A$2:$C$13,2,0)","v":"Resistance is Futile"},33,{"$f":"IF(ISNA(VLOOKUP($E169,Data!$A$16:$B$1902,2,0)),\"\",VLOOKUP($E169,Data!$A$16:$B$1902,2,0))","v":"Penny, Brad"}]
[15.01,6,{"$f":"VLOOKUP($B170,Data!$A$2:$C$13,3,0)","v":"Kevin"},{"$f":"VLOOKUP($B170,Data!$A$2:$C$13,2,0)","v":"The Luddites"},660,{"$f":"IF(ISNA(VLOOKUP($E170,Data!$A$16:$B$1902,2,0)),\"\",VLOOKUP($E170,Data!$A$16:$B$1902,2,0))","v":"Gomez, Carlos"}]
[15.02,5,{"$f":"VLOOKUP($B171,Data!$A$2:$C$13,3,0)","v":"Chris"},{"$f":"VLOOKUP($B171,Data!$A$2:$C$13,2,0)","v":"Memories of Mom"},389,{"$f":"IF(ISNA(VLOOKUP($E171,Data!$A$16:$B$1902,2,0)),\"\",VLOOKUP($E171,Data!$A$16:$B$1902,2,0))","v":"Ruiz, Carlos"}]
[15.03,2,{"$f":"VLOOKUP($B172,Data!$A$2:$C$13,3,0)","v":"Casey"},{"$f":"VLOOKUP($B172,Data!$A$2:$C$13,2,0)","v":"Tulsa Drillers"},487,{"$f":"IF(ISNA(VLOOKUP($E172,Data!$A$16:$B$1902,2,0)),\"\",VLOOKUP($E172,Data!$A$16:$B$1902,2,0))","v":"McGehee, Casey"}]
[15.04,3,{"$f":"VLOOKUP($B173,Data!$A$2:$C$13,3,0)","v":"Andy"},{"$f":"VLOOKUP($B173,Data!$A$2:$C$13,2,0)","v":"Cripplers"},336,{"$f":"IF(ISNA(VLOOKUP($E173,Data!$A$16:$B$1902,2,0)),\"\",VLOOKUP($E173,Data!$A$16:$B$1902,2,0))","v":"Wagner, Billy"},"Traded from Ray on 6.29.09 (with #44 in 2009 for 1.05 & An.LaRoche)"]
[15.05,3,{"$f":"VLOOKUP($B174,Data!$A$2:$C$13,3,0)","v":"Andy"},{"$f":"VLOOKUP($B174,Data!$A$2:$C$13,2,0)","v":"Cripplers"},656,{"$f":"IF(ISNA(VLOOKUP($E174,Data!$A$16:$B$1902,2,0)),\"\",VLOOKUP($E174,Data!$A$16:$B$1902,2,0))","v":"Smith, Seth"}]
[15.06,1,{"$f":"VLOOKUP($B175,Data!$A$2:$C$13,3,0)","v":"Jeremy"},{"$f":"VLOOKUP($B175,Data!$A$2:$C$13,2,0)","v":"Uninspired"},616,{"$f":"IF(ISNA(VLOOKUP($E175,Data!$A$16:$B$1902,2,0)),\"\",VLOOKUP($E175,Data!$A$16:$B$1902,2,0))","v":"Bourn, Michael"}]
[15.07,9,{"$f":"VLOOKUP($B176,Data!$A$2:$C$13,3,0)","v":"Ryan"},{"$f":"VLOOKUP($B176,Data!$A$2:$C$13,2,0)","v":"Ryan's Team"},91,{"$f":"IF(ISNA(VLOOKUP($E176,Data!$A$16:$B$1902,2,0)),\"\",VLOOKUP($E176,Data!$A$16:$B$1902,2,0))","v":"Norris, Bud"}]
[15.08,4,{"$f":"VLOOKUP($B177,Data!$A$2:$C$13,3,0)","v":"Tim & Jeremy(?) (drafted by Will/Ray)"},{"$f":"VLOOKUP($B177,Data!$A$2:$C$13,2,0)","v":"Romeo Warriors(?)"},479,{"$f":"IF(ISNA(VLOOKUP($E177,Data!$A$16:$B$1902,2,0)),\"\",VLOOKUP($E177,Data!$A$16:$B$1902,2,0))","v":"Schumaker, Skip"}]
[15.09,10,{"$f":"VLOOKUP($B178,Data!$A$2:$C$13,3,0)","v":"Bill"},{"$f":"VLOOKUP($B178,Data!$A$2:$C$13,2,0)","v":"Reggae Rebels"},252,{"$f":"IF(ISNA(VLOOKUP($E178,Data!$A$16:$B$1902,2,0)),\"\",VLOOKUP($E178,Data!$A$16:$B$1902,2,0))","v":"Wilson, Brian"}]
[15.1,12,{"$f":"VLOOKUP($B179,Data!$A$2:$C$13,3,0)","v":"Mark"},{"$f":"VLOOKUP($B179,Data!$A$2:$C$13,2,0)","v":"W&S Life Insurers"},519,{"$f":"IF(ISNA(VLOOKUP($E179,Data!$A$16:$B$1902,2,0)),\"\",VLOOKUP($E179,Data!$A$16:$B$1902,2,0))","v":"Cantu, Jorge"}]
[15.11,1,{"$f":"VLOOKUP($B180,Data!$A$2:$C$13,3,0)","v":"Jeremy"},{"$f":"VLOOKUP($B180,Data!$A$2:$C$13,2,0)","v":"Uninspired"},478,{"$f":"IF(ISNA(VLOOKUP($E180,Data!$A$16:$B$1902,2,0)),\"\",VLOOKUP($E180,Data!$A$16:$B$1902,2,0))","v":"Barmes, Clint"},"Traded from D&J on 9.7.09 (with Jo.Santana, A.Soriano, & N.Arenado for Jo.Johnson)"]
[15.12,5,{"$f":"VLOOKUP($B181,Data!$A$2:$C$13,3,0)","v":"Chris"},{"$f":"VLOOKUP($B181,Data!$A$2:$C$13,2,0)","v":"Memories of Mom"},527,{"$f":"IF(ISNA(VLOOKUP($E181,Data!$A$16:$B$1902,2,0)),\"\",VLOOKUP($E181,Data!$A$16:$B$1902,2,0))","v":"Blake, Casey"},"Traded from JTP on 8.12.09 (with T.Alderson for 12.02, 40.00, & #44-47 in 2009)"]
[16.010000000000002,6,{"$f":"VLOOKUP($B182,Data!$A$2:$C$13,3,0)","v":"Kevin"},{"$f":"VLOOKUP($B182,Data!$A$2:$C$13,2,0)","v":"The Luddites"},243,{"$f":"IF(ISNA(VLOOKUP($E182,Data!$A$16:$B$1902,2,0)),\"\",VLOOKUP($E182,Data!$A$16:$B$1902,2,0))","v":"Madson, Ryan"}]
[16.02,5,{"$f":"VLOOKUP($B183,Data!$A$2:$C$13,3,0)","v":"Chris"},{"$f":"VLOOKUP($B183,Data!$A$2:$C$13,2,0)","v":"Memories of Mom"},386,{"$f":"IF(ISNA(VLOOKUP($E183,Data!$A$16:$B$1902,2,0)),\"\",VLOOKUP($E183,Data!$A$16:$B$1902,2,0))","v":"Baker, John"}]
[16.03,2,{"$f":"VLOOKUP($B184,Data!$A$2:$C$13,3,0)","v":"Casey"},{"$f":"VLOOKUP($B184,Data!$A$2:$C$13,2,0)","v":"Tulsa Drillers"},536,{"$f":"IF(ISNA(VLOOKUP($E184,Data!$A$16:$B$1902,2,0)),\"\",VLOOKUP($E184,Data!$A$16:$B$1902,2,0))","v":"Gamel, Mathew"}]
[16.04,3,{"$f":"VLOOKUP($B185,Data!$A$2:$C$13,3,0)","v":"Andy"},{"$f":"VLOOKUP($B185,Data!$A$2:$C$13,2,0)","v":"Cripplers"},572,{"$f":"IF(ISNA(VLOOKUP($E185,Data!$A$16:$B$1902,2,0)),\"\",VLOOKUP($E185,Data!$A$16:$B$1902,2,0))","v":"Ryan, Brendan"}]
[16.05,11,{"$f":"VLOOKUP($B186,Data!$A$2:$C$13,3,0)","v":"Ray"},{"$f":"VLOOKUP($B186,Data!$A$2:$C$13,2,0)","v":"South Indy Thugs"},68,{"$f":"IF(ISNA(VLOOKUP($E186,Data!$A$16:$B$1902,2,0)),\"\",VLOOKUP($E186,Data!$A$16:$B$1902,2,0))","v":"Sanchez, Anibal"}]
[16.059999999999999,1,{"$f":"VLOOKUP($B187,Data!$A$2:$C$13,3,0)","v":"Jeremy"},{"$f":"VLOOKUP($B187,Data!$A$2:$C$13,2,0)","v":"Uninspired"},626,{"$f":"IF(ISNA(VLOOKUP($E187,Data!$A$16:$B$1902,2,0)),\"\",VLOOKUP($E187,Data!$A$16:$B$1902,2,0))","v":"Byrd, Marlon"}]
[16.07,9,{"$f":"VLOOKUP($B188,Data!$A$2:$C$13,3,0)","v":"Ryan"},{"$f":"VLOOKUP($B188,Data!$A$2:$C$13,2,0)","v":"Ryan's Team"},413,{"$f":"IF(ISNA(VLOOKUP($E188,Data!$A$16:$B$1902,2,0)),\"\",VLOOKUP($E188,Data!$A$16:$B$1902,2,0))","v":"Towles, J.R."}]
[16.079999999999998,4,{"$f":"VLOOKUP($B189,Data!$A$2:$C$13,3,0)","v":"Tim & Jeremy(?) (drafted by Will/Ray)"},{"$f":"VLOOKUP($B189,Data!$A$2:$C$13,2,0)","v":"Romeo Warriors(?)"},292,{"$f":"IF(ISNA(VLOOKUP($E189,Data!$A$16:$B$1902,2,0)),\"\",VLOOKUP($E189,Data!$A$16:$B$1902,2,0))","v":"Hoffman, Trevor"}]
[16.09,10,{"$f":"VLOOKUP($B190,Data!$A$2:$C$13,3,0)","v":"Bill"},{"$f":"VLOOKUP($B190,Data!$A$2:$C$13,2,0)","v":"Reggae Rebels"},485,{"$f":"IF(ISNA(VLOOKUP($E190,Data!$A$16:$B$1902,2,0)),\"\",VLOOKUP($E190,Data!$A$16:$B$1902,2,0))","v":"Fontenot, Mike"}]
[16.100000000000001,12,{"$f":"VLOOKUP($B191,Data!$A$2:$C$13,3,0)","v":"Mark"},{"$f":"VLOOKUP($B191,Data!$A$2:$C$13,2,0)","v":"W&S Life Insurers"},799,{"$f":"IF(ISNA(VLOOKUP($E191,Data!$A$16:$B$1902,2,0)),\"\",VLOOKUP($E191,Data!$A$16:$B$1902,2,0))","v":"Cabrera, Orlando"}]
[16.11,5,{"$f":"VLOOKUP($B192,Data!$A$2:$C$13,3,0)","v":"Chris"},{"$f":"VLOOKUP($B192,Data!$A$2:$C$13,2,0)","v":"Memories of Mom"},495,{"$f":"IF(ISNA(VLOOKUP($E192,Data!$A$16:$B$1902,2,0)),\"\",VLOOKUP($E192,Data!$A$16:$B$1902,2,0))","v":"Iwamura, Akinori"},"Traded from D&J on 6.10.09 (with Dom.Brown for S.Victorino)"]
[16.12,7,{"$f":"VLOOKUP($B193,Data!$A$2:$C$13,3,0)","v":"Jess & Tim"},{"$f":"VLOOKUP($B193,Data!$A$2:$C$13,2,0)","v":"Resistance is Futile"},570,{"$f":"IF(ISNA(VLOOKUP($E193,Data!$A$16:$B$1902,2,0)),\"\",VLOOKUP($E193,Data!$A$16:$B$1902,2,0))","v":"Uribe, Juan"}]
[17.010000000000002,6,{"$f":"VLOOKUP($B194,Data!$A$2:$C$13,3,0)","v":"Kevin"},{"$f":"VLOOKUP($B194,Data!$A$2:$C$13,2,0)","v":"The Luddites"},634,{"$f":"IF(ISNA(VLOOKUP($E194,Data!$A$16:$B$1902,2,0)),\"\",VLOOKUP($E194,Data!$A$16:$B$1902,2,0))","v":"Cabrera, Melky"}]
[17.02,5,{"$f":"VLOOKUP($B195,Data!$A$2:$C$13,3,0)","v":"Chris"},{"$f":"VLOOKUP($B195,Data!$A$2:$C$13,2,0)","v":"Memories of Mom"},31,{"$f":"IF(ISNA(VLOOKUP($E195,Data!$A$16:$B$1902,2,0)),\"\",VLOOKUP($E195,Data!$A$16:$B$1902,2,0))","v":"Hammel, Jason"}]
[17.03,2,{"$f":"VLOOKUP($B196,Data!$A$2:$C$13,3,0)","v":"Casey"},{"$f":"VLOOKUP($B196,Data!$A$2:$C$13,2,0)","v":"Tulsa Drillers"},488,{"$f":"IF(ISNA(VLOOKUP($E196,Data!$A$16:$B$1902,2,0)),\"\",VLOOKUP($E196,Data!$A$16:$B$1902,2,0))","v":"Young, Delwyn"}]
[17.04,11,{"$f":"VLOOKUP($B197,Data!$A$2:$C$13,3,0)","v":"Ray"},{"$f":"VLOOKUP($B197,Data!$A$2:$C$13,2,0)","v":"South Indy Thugs"},291,{"$f":"IF(ISNA(VLOOKUP($E197,Data!$A$16:$B$1902,2,0)),\"\",VLOOKUP($E197,Data!$A$16:$B$1902,2,0))","v":"Capps, Matt"}]
[17.05,3,{"$f":"VLOOKUP($B198,Data!$A$2:$C$13,3,0)","v":"Andy"},{"$f":"VLOOKUP($B198,Data!$A$2:$C$13,2,0)","v":"Cripplers"},94,{"$f":"IF(ISNA(VLOOKUP($E198,Data!$A$16:$B$1902,2,0)),\"\",VLOOKUP($E198,Data!$A$16:$B$1902,2,0))","v":"Volquez, Edinson"}]
[17.059999999999999,1,{"$f":"VLOOKUP($B199,Data!$A$2:$C$13,3,0)","v":"Jeremy"},{"$f":"VLOOKUP($B199,Data!$A$2:$C$13,2,0)","v":"Uninspired"},24,{"$f":"IF(ISNA(VLOOKUP($E199,Data!$A$16:$B$1902,2,0)),\"\",VLOOKUP($E199,Data!$A$16:$B$1902,2,0))","v":"Zito, Barry"}]
[17.07,9,{"$f":"VLOOKUP($B200,Data!$A$2:$C$13,3,0)","v":"Ryan"},{"$f":"VLOOKUP($B200,Data!$A$2:$C$13,2,0)","v":"Ryan's Team"},12,{"$f":"IF(ISNA(VLOOKUP($E200,Data!$A$16:$B$1902,2,0)),\"\",VLOOKUP($E200,Data!$A$16:$B$1902,2,0))","v":"Duke, Zach"}]
[17.079999999999998,4,{"$f":"VLOOKUP($B201,Data!$A$2:$C$13,3,0)","v":"Tim & Jeremy(?) (drafted by Will/Ray)"},{"$f":"VLOOKUP($B201,Data!$A$2:$C$13,2,0)","v":"Romeo Warriors(?)"},670,{"$f":"IF(ISNA(VLOOKUP($E201,Data!$A$16:$B$1902,2,0)),\"\",VLOOKUP($E201,Data!$A$16:$B$1902,2,0))","v":"Milledge, Lastings"}]
[17.09,10,{"$f":"VLOOKUP($B202,Data!$A$2:$C$13,3,0)","v":"Bill"},{"$f":"VLOOKUP($B202,Data!$A$2:$C$13,2,0)","v":"Reggae Rebels"},296,{"$f":"IF(ISNA(VLOOKUP($E202,Data!$A$16:$B$1902,2,0)),\"\",VLOOKUP($E202,Data!$A$16:$B$1902,2,0))","v":"Qualls, Chad"}]
[17.100000000000001,7,{"$f":"VLOOKUP($B203,Data!$A$2:$C$13,3,0)","v":"Jess & Tim"},{"$f":"VLOOKUP($B203,Data!$A$2:$C$13,2,0)","v":"Resistance is Futile"},748,{"$f":"IF(ISNA(VLOOKUP($E203,Data!$A$16:$B$1902,2,0)),\"\",VLOOKUP($E203,Data!$A$16:$B$1902,2,0))","v":"Padilla, Vicente"},"Traded from Mark on 3.21.10 (for R.Wolf)"]
[17.11,7,{"$f":"VLOOKUP($B204,Data!$A$2:$C$13,3,0)","v":"Jess & Tim"},{"$f":"VLOOKUP($B204,Data!$A$2:$C$13,2,0)","v":"Resistance is Futile"},153,{"$f":"IF(ISNA(VLOOKUP($E204,Data!$A$16:$B$1902,2,0)),\"\",VLOOKUP($E204,Data!$A$16:$B$1902,2,0))","v":"Kennedy, Ian"},"Traded from D&J on 6.19.09 (with M.Bumgarner for M.DeRosa, J.Tabata & #42/#43/#45 in 2009)"]
[17.12,5,{"$f":"VLOOKUP($B205,Data!$A$2:$C$13,3,0)","v":"Chris"},{"$f":"VLOOKUP($B205,Data!$A$2:$C$13,2,0)","v":"Memories of Mom"},625,{"$f":"IF(ISNA(VLOOKUP($E205,Data!$A$16:$B$1902,2,0)),\"\",VLOOKUP($E205,Data!$A$16:$B$1902,2,0))","v":"Fukudome, Kosuke"},"Traded from JTP on 5.27.09 (with 21.12 for N.Johnson, R.Madson, 13.02, & 36.02)"]
[18.010000000000002,6,{"$f":"VLOOKUP($B206,Data!$A$2:$C$13,3,0)","v":"Kevin"},{"$f":"VLOOKUP($B206,Data!$A$2:$C$13,2,0)","v":"The Luddites"},83,{"$f":"IF(ISNA(VLOOKUP($E206,Data!$A$16:$B$1902,2,0)),\"\",VLOOKUP($E206,Data!$A$16:$B$1902,2,0))","v":"Perez, Oliver"}]
[18.02,5,{"$f":"VLOOKUP($B207,Data!$A$2:$C$13,3,0)","v":"Chris"},{"$f":"VLOOKUP($B207,Data!$A$2:$C$13,2,0)","v":"Memories of Mom"},480,{"$f":"IF(ISNA(VLOOKUP($E207,Data!$A$16:$B$1902,2,0)),\"\",VLOOKUP($E207,Data!$A$16:$B$1902,2,0))","v":"Castillo, Luis"}]
[18.03,2,{"$f":"VLOOKUP($B208,Data!$A$2:$C$13,3,0)","v":"Casey"},{"$f":"VLOOKUP($B208,Data!$A$2:$C$13,2,0)","v":"Tulsa Drillers"},78,{"$f":"IF(ISNA(VLOOKUP($E208,Data!$A$16:$B$1902,2,0)),\"\",VLOOKUP($E208,Data!$A$16:$B$1902,2,0))","v":"Stauffer, Tim"}]
[18.04,3,{"$f":"VLOOKUP($B209,Data!$A$2:$C$13,3,0)","v":"Andy"},{"$f":"VLOOKUP($B209,Data!$A$2:$C$13,2,0)","v":"Cripplers"},59,{"$f":"IF(ISNA(VLOOKUP($E209,Data!$A$16:$B$1902,2,0)),\"\",VLOOKUP($E209,Data!$A$16:$B$1902,2,0))","v":"Paulino, Felipe"}]
[18.05,11,{"$f":"VLOOKUP($B210,Data!$A$2:$C$13,3,0)","v":"Ray"},{"$f":"VLOOKUP($B210,Data!$A$2:$C$13,2,0)","v":"South Indy Thugs"},768,{"$f":"IF(ISNA(VLOOKUP($E210,Data!$A$16:$B$1902,2,0)),\"\",VLOOKUP($E210,Data!$A$16:$B$1902,2,0))","v":"Garland, Jon"}]
[18.059999999999999,1,{"$f":"VLOOKUP($B211,Data!$A$2:$C$13,3,0)","v":"Jeremy"},{"$f":"VLOOKUP($B211,Data!$A$2:$C$13,2,0)","v":"Uninspired"},260,{"$f":"IF(ISNA(VLOOKUP($E211,Data!$A$16:$B$1902,2,0)),\"\",VLOOKUP($E211,Data!$A$16:$B$1902,2,0))","v":"Sherrill, George"}]
[18.07,9,{"$f":"VLOOKUP($B212,Data!$A$2:$C$13,3,0)","v":"Ryan"},{"$f":"VLOOKUP($B212,Data!$A$2:$C$13,2,0)","v":"Ryan's Team"},4047,{"$f":"IF(ISNA(VLOOKUP($E212,Data!$A$16:$B$1902,2,0)),\"\",VLOOKUP($E212,Data!$A$16:$B$1902,2,0))","v":"Kennedy, Adam"}]
[18.079999999999998,4,{"$f":"VLOOKUP($B213,Data!$A$2:$C$13,3,0)","v":"Tim & Jeremy(?) (drafted by Will/Ray)"},{"$f":"VLOOKUP($B213,Data!$A$2:$C$13,2,0)","v":"Romeo Warriors(?)"},248,{"$f":"IF(ISNA(VLOOKUP($E213,Data!$A$16:$B$1902,2,0)),\"\",VLOOKUP($E213,Data!$A$16:$B$1902,2,0))","v":"Marmol, Carlos"}]
[18.09,10,{"$f":"VLOOKUP($B214,Data!$A$2:$C$13,3,0)","v":"Bill"},{"$f":"VLOOKUP($B214,Data!$A$2:$C$13,2,0)","v":"Reggae Rebels"},247,{"$f":"IF(ISNA(VLOOKUP($E214,Data!$A$16:$B$1902,2,0)),\"\",VLOOKUP($E214,Data!$A$16:$B$1902,2,0))","v":"Gregerson, Luke"}]
[18.100000000000001,12,{"$f":"VLOOKUP($B215,Data!$A$2:$C$13,3,0)","v":"Mark"},{"$f":"VLOOKUP($B215,Data!$A$2:$C$13,2,0)","v":"W&S Life Insurers"},71,{"$f":"IF(ISNA(VLOOKUP($E215,Data!$A$16:$B$1902,2,0)),\"\",VLOOKUP($E215,Data!$A$16:$B$1902,2,0))","v":"Maine, John"}]
[18.11,6,{"$f":"VLOOKUP($B216,Data!$A$2:$C$13,3,0)","v":"Kevin"},{"$f":"VLOOKUP($B216,Data!$A$2:$C$13,2,0)","v":"The Luddites"},409,{"$f":"IF(ISNA(VLOOKUP($E216,Data!$A$16:$B$1902,2,0)),\"\",VLOOKUP($E216,Data!$A$16:$B$1902,2,0))","v":"Flores, Jesus"},"Traded from D&J on 6.25.09 (with Jo.Tabata & #47 in 2009 for #41/#42/#43/#42(T8) in 2009)"]
[18.12,7,{"$f":"VLOOKUP($B217,Data!$A$2:$C$13,3,0)","v":"Jess & Tim"},{"$f":"VLOOKUP($B217,Data!$A$2:$C$13,2,0)","v":"Resistance is Futile"},196,{"$f":"IF(ISNA(VLOOKUP($E217,Data!$A$16:$B$1902,2,0)),\"\",VLOOKUP($E217,Data!$A$16:$B$1902,2,0))","v":"Withrow, Christopher"}]
[19.010000000000002,6,{"$f":"VLOOKUP($B218,Data!$A$2:$C$13,3,0)","v":"Kevin"},{"$f":"VLOOKUP($B218,Data!$A$2:$C$13,2,0)","v":"The Luddites"},450,{"$f":"IF(ISNA(VLOOKUP($E218,Data!$A$16:$B$1902,2,0)),\"\",VLOOKUP($E218,Data!$A$16:$B$1902,2,0))","v":"Murphy, Daniel"}]
[19.02,5,{"$f":"VLOOKUP($B219,Data!$A$2:$C$13,3,0)","v":"Chris"},{"$f":"VLOOKUP($B219,Data!$A$2:$C$13,2,0)","v":"Memories of Mom"},665,{"$f":"IF(ISNA(VLOOKUP($E219,Data!$A$16:$B$1902,2,0)),\"\",VLOOKUP($E219,Data!$A$16:$B$1902,2,0))","v":"Schierholtz, Nate"}]
[19.03,2,{"$f":"VLOOKUP($B220,Data!$A$2:$C$13,3,0)","v":"Casey"},{"$f":"VLOOKUP($B220,Data!$A$2:$C$13,2,0)","v":"Tulsa Drillers"},571,{"$f":"IF(ISNA(VLOOKUP($E220,Data!$A$16:$B$1902,2,0)),\"\",VLOOKUP($E220,Data!$A$16:$B$1902,2,0))","v":"Hairston, Jerry"}]
[19.04,11,{"$f":"VLOOKUP($B221,Data!$A$2:$C$13,3,0)","v":"Ray"},{"$f":"VLOOKUP($B221,Data!$A$2:$C$13,2,0)","v":"South Indy Thugs"},270,{"$f":"IF(ISNA(VLOOKUP($E221,Data!$A$16:$B$1902,2,0)),\"\",VLOOKUP($E221,Data!$A$16:$B$1902,2,0))","v":"Affeldt, Jeremy"}]
[19.05,3,{"$f":"VLOOKUP($B222,Data!$A$2:$C$13,3,0)","v":"Andy"},{"$f":"VLOOKUP($B222,Data!$A$2:$C$13,2,0)","v":"Cripplers"},403,{"$f":"IF(ISNA(VLOOKUP($E222,Data!$A$16:$B$1902,2,0)),\"\",VLOOKUP($E222,Data!$A$16:$B$1902,2,0))","v":"Snyder, Chris"}]
[19.059999999999999,1,{"$f":"VLOOKUP($B223,Data!$A$2:$C$13,3,0)","v":"Jeremy"},{"$f":"VLOOKUP($B223,Data!$A$2:$C$13,2,0)","v":"Uninspired"},590,{"$f":"IF(ISNA(VLOOKUP($E223,Data!$A$16:$B$1902,2,0)),\"\",VLOOKUP($E223,Data!$A$16:$B$1902,2,0))","v":"Desmond, Ian"}]
[19.07,9,{"$f":"VLOOKUP($B224,Data!$A$2:$C$13,3,0)","v":"Ryan"},{"$f":"VLOOKUP($B224,Data!$A$2:$C$13,2,0)","v":"Ryan's Team"},60,{"$f":"IF(ISNA(VLOOKUP($E224,Data!$A$16:$B$1902,2,0)),\"\",VLOOKUP($E224,Data!$A$16:$B$1902,2,0))","v":"Morton, Charlie"}]
[19.079999999999998,4,{"$f":"VLOOKUP($B225,Data!$A$2:$C$13,3,0)","v":"Tim & Jeremy(?) (drafted by Will/Ray)"},{"$f":"VLOOKUP($B225,Data!$A$2:$C$13,2,0)","v":"Romeo Warriors(?)"},385,{"$f":"IF(ISNA(VLOOKUP($E225,Data!$A$16:$B$1902,2,0)),\"\",VLOOKUP($E225,Data!$A$16:$B$1902,2,0))","v":"Rodriguez, Ivan"}]
[19.09,10,{"$f":"VLOOKUP($B226,Data!$A$2:$C$13,3,0)","v":"Bill"},{"$f":"VLOOKUP($B226,Data!$A$2:$C$13,2,0)","v":"Reggae Rebels"},45,{"$f":"IF(ISNA(VLOOKUP($E226,Data!$A$16:$B$1902,2,0)),\"\",VLOOKUP($E226,Data!$A$16:$B$1902,2,0))","v":"Cook, Aaron"}]
[19.100000000000001,12,{"$f":"VLOOKUP($B227,Data!$A$2:$C$13,3,0)","v":"Mark"},{"$f":"VLOOKUP($B227,Data!$A$2:$C$13,2,0)","v":"W&S Life Insurers"},387,{"$f":"IF(ISNA(VLOOKUP($E227,Data!$A$16:$B$1902,2,0)),\"\",VLOOKUP($E227,Data!$A$16:$B$1902,2,0))","v":"Olivo, Miguel"}]
[19.11,5,{"$f":"VLOOKUP($B228,Data!$A$2:$C$13,3,0)","v":"Chris"},{"$f":"VLOOKUP($B228,Data!$A$2:$C$13,2,0)","v":"Memories of Mom"},749,{"$f":"IF(ISNA(VLOOKUP($E228,Data!$A$16:$B$1902,2,0)),\"\",VLOOKUP($E228,Data!$A$16:$B$1902,2,0))","v":"Dotel, Octavio"},"Traded from D&J on 5.28.09 (with 21.11 for An.Sanchez & J.Happ)"]
[19.12,7,{"$f":"VLOOKUP($B229,Data!$A$2:$C$13,3,0)","v":"Jess & Tim"},{"$f":"VLOOKUP($B229,Data!$A$2:$C$13,2,0)","v":"Resistance is Futile"},221,{"$f":"IF(ISNA(VLOOKUP($E229,Data!$A$16:$B$1902,2,0)),\"\",VLOOKUP($E229,Data!$A$16:$B$1902,2,0))","v":"Castro, Simon"}]
[20.010000000000002,6,{"$f":"VLOOKUP($B230,Data!$A$2:$C$13,3,0)","v":"Kevin"},{"$f":"VLOOKUP($B230,Data!$A$2:$C$13,2,0)","v":"The Luddites"},323,{"$f":"IF(ISNA(VLOOKUP($E230,Data!$A$16:$B$1902,2,0)),\"\",VLOOKUP($E230,Data!$A$16:$B$1902,2,0))","v":"Kuo, Hong-Chih"}]
[20.02,5,{"$f":"VLOOKUP($B231,Data!$A$2:$C$13,3,0)","v":"Chris"},{"$f":"VLOOKUP($B231,Data!$A$2:$C$13,2,0)","v":"Memories of Mom"},288,{"$f":"IF(ISNA(VLOOKUP($E231,Data!$A$16:$B$1902,2,0)),\"\",VLOOKUP($E231,Data!$A$16:$B$1902,2,0))","v":"Saito, Takashi"}]
[20.03,2,{"$f":"VLOOKUP($B232,Data!$A$2:$C$13,3,0)","v":"Casey"},{"$f":"VLOOKUP($B232,Data!$A$2:$C$13,2,0)","v":"Tulsa Drillers"},271,{"$f":"IF(ISNA(VLOOKUP($E232,Data!$A$16:$B$1902,2,0)),\"\",VLOOKUP($E232,Data!$A$16:$B$1902,2,0))","v":"Street, Huston"}]
[20.04,3,{"$f":"VLOOKUP($B233,Data!$A$2:$C$13,3,0)","v":"Andy"},{"$f":"VLOOKUP($B233,Data!$A$2:$C$13,2,0)","v":"Cripplers"},318,{"$f":"IF(ISNA(VLOOKUP($E233,Data!$A$16:$B$1902,2,0)),\"\",VLOOKUP($E233,Data!$A$16:$B$1902,2,0))","v":"Adams, Mike"}]
[20.05,11,{"$f":"VLOOKUP($B234,Data!$A$2:$C$13,3,0)","v":"Ray"},{"$f":"VLOOKUP($B234,Data!$A$2:$C$13,2,0)","v":"South Indy Thugs"},396,{"$f":"IF(ISNA(VLOOKUP($E234,Data!$A$16:$B$1902,2,0)),\"\",VLOOKUP($E234,Data!$A$16:$B$1902,2,0))","v":"Hundley, Nick"}]
[20.059999999999999,1,{"$f":"VLOOKUP($B235,Data!$A$2:$C$13,3,0)","v":"Jeremy"},{"$f":"VLOOKUP($B235,Data!$A$2:$C$13,2,0)","v":"Uninspired"},293,{"$f":"IF(ISNA(VLOOKUP($E235,Data!$A$16:$B$1902,2,0)),\"\",VLOOKUP($E235,Data!$A$16:$B$1902,2,0))","v":"Rhodes, Arthur"}]
[20.07,9,{"$f":"VLOOKUP($B236,Data!$A$2:$C$13,3,0)","v":"Ryan"},{"$f":"VLOOKUP($B236,Data!$A$2:$C$13,2,0)","v":"Ryan's Team"},463,{"$f":"IF(ISNA(VLOOKUP($E236,Data!$A$16:$B$1902,2,0)),\"\",VLOOKUP($E236,Data!$A$16:$B$1902,2,0))","v":"Clement, Jeff"}]
[20.079999999999998,4,{"$f":"VLOOKUP($B237,Data!$A$2:$C$13,3,0)","v":"Tim & Jeremy(?) (drafted by Will/Ray)"},{"$f":"VLOOKUP($B237,Data!$A$2:$C$13,2,0)","v":"Romeo Warriors(?)"},112,{"$f":"IF(ISNA(VLOOKUP($E237,Data!$A$16:$B$1902,2,0)),\"\",VLOOKUP($E237,Data!$A$16:$B$1902,2,0))","v":"Kendrick, Kyle"}]
[20.09,10,{"$f":"VLOOKUP($B238,Data!$A$2:$C$13,3,0)","v":"Bill"},{"$f":"VLOOKUP($B238,Data!$A$2:$C$13,2,0)","v":"Reggae Rebels"},398,{"$f":"IF(ISNA(VLOOKUP($E238,Data!$A$16:$B$1902,2,0)),\"\",VLOOKUP($E238,Data!$A$16:$B$1902,2,0))","v":"Paulino, Ronny"}]
[20.100000000000001,1,{"$f":"VLOOKUP($B239,Data!$A$2:$C$13,3,0)","v":"Jeremy"},{"$f":"VLOOKUP($B239,Data!$A$2:$C$13,2,0)","v":"Uninspired"},273,{"$f":"IF(ISNA(VLOOKUP($E239,Data!$A$16:$B$1902,2,0)),\"\",VLOOKUP($E239,Data!$A$16:$B$1902,2,0))","v":"Byrdak, Tim"},"Traded from Mark on 9.6.09 (with J.Maine, T.Glaus, C.Villanueva, & J.Burton for T.Hoffman, Mi.Gonzalez, & J.Thurston)"]
[20.11,5,{"$f":"VLOOKUP($B240,Data!$A$2:$C$13,3,0)","v":"Chris"},{"$f":"VLOOKUP($B240,Data!$A$2:$C$13,2,0)","v":"Memories of Mom"},309,{"$f":"IF(ISNA(VLOOKUP($E240,Data!$A$16:$B$1902,2,0)),\"\",VLOOKUP($E240,Data!$A$16:$B$1902,2,0))","v":"Miller, Trever"},"Traded from D&J on 5.13.09 (with W.Silva for J.Affeldt & G.Blum)"]
[20.12,10,{"$f":"VLOOKUP($B241,Data!$A$2:$C$13,3,0)","v":"Bill"},{"$f":"VLOOKUP($B241,Data!$A$2:$C$13,2,0)","v":"Reggae Rebels"},306,{"$f":"IF(ISNA(VLOOKUP($E241,Data!$A$16:$B$1902,2,0)),\"\",VLOOKUP($E241,Data!$A$16:$B$1902,2,0))","v":"Thatcher, Joe"},"Traded from JTP on 3.22.10 (with 12.12 for 2.09)"]
[21.01,6,{"$f":"VLOOKUP($B242,Data!$A$2:$C$13,3,0)","v":"Kevin"},{"$f":"VLOOKUP($B242,Data!$A$2:$C$13,2,0)","v":"The Luddites"},468,{"$f":"IF(ISNA(VLOOKUP($E242,Data!$A$16:$B$1902,2,0)),\"\",VLOOKUP($E242,Data!$A$16:$B$1902,2,0))","v":"Davis, Ike"}]
[21.02,5,{"$f":"VLOOKUP($B243,Data!$A$2:$C$13,3,0)","v":"Chris"},{"$f":"VLOOKUP($B243,Data!$A$2:$C$13,2,0)","v":"Memories of Mom"},244,{"$f":"IF(ISNA(VLOOKUP($E243,Data!$A$16:$B$1902,2,0)),\"\",VLOOKUP($E243,Data!$A$16:$B$1902,2,0))","v":"Lyon, Brandon"}]
[21.03,2,{"$f":"VLOOKUP($B244,Data!$A$2:$C$13,3,0)","v":"Casey"},{"$f":"VLOOKUP($B244,Data!$A$2:$C$13,2,0)","v":"Tulsa Drillers"},766,{"$f":"IF(ISNA(VLOOKUP($E244,Data!$A$16:$B$1902,2,0)),\"\",VLOOKUP($E244,Data!$A$16:$B$1902,2,0))","v":"Belliard, Ronnie"}]
[21.04,11,{"$f":"VLOOKUP($B245,Data!$A$2:$C$13,3,0)","v":"Ray"},{"$f":"VLOOKUP($B245,Data!$A$2:$C$13,2,0)","v":"South Indy Thugs"},581,{"$f":"IF(ISNA(VLOOKUP($E245,Data!$A$16:$B$1902,2,0)),\"\",VLOOKUP($E245,Data!$A$16:$B$1902,2,0))","v":"Infante, Omar"}]
[21.05,3,{"$f":"VLOOKUP($B246,Data!$A$2:$C$13,3,0)","v":"Andy"},{"$f":"VLOOKUP($B246,Data!$A$2:$C$13,2,0)","v":"Cripplers"},568,{"$f":"IF(ISNA(VLOOKUP($E246,Data!$A$16:$B$1902,2,0)),\"\",VLOOKUP($E246,Data!$A$16:$B$1902,2,0))","v":"Counsell, Craig"}]
[21.06,1,{"$f":"VLOOKUP($B247,Data!$A$2:$C$13,3,0)","v":"Jeremy"},{"$f":"VLOOKUP($B247,Data!$A$2:$C$13,2,0)","v":"Uninspired"},730,{"$f":"IF(ISNA(VLOOKUP($E247,Data!$A$16:$B$1902,2,0)),\"\",VLOOKUP($E247,Data!$A$16:$B$1902,2,0))","v":"Tabata, Jose"}]
[21.07,9,{"$f":"VLOOKUP($B248,Data!$A$2:$C$13,3,0)","v":"Ryan"},{"$f":"VLOOKUP($B248,Data!$A$2:$C$13,2,0)","v":"Ryan's Team"},285,{"$f":"IF(ISNA(VLOOKUP($E248,Data!$A$16:$B$1902,2,0)),\"\",VLOOKUP($E248,Data!$A$16:$B$1902,2,0))","v":"O'Flaherty, Eric"}]
[21.08,12,{"$f":"VLOOKUP($B249,Data!$A$2:$C$13,3,0)","v":"Mark"},{"$f":"VLOOKUP($B249,Data!$A$2:$C$13,2,0)","v":"W&S Life Insurers"},623,{"$f":"IF(ISNA(VLOOKUP($E249,Data!$A$16:$B$1902,2,0)),\"\",VLOOKUP($E249,Data!$A$16:$B$1902,2,0))","v":"Francoeur, Jeff"},"Francoeur traded from T&J during the draft with S.Drew for E.Andrus"]
[21.09,10,{"$f":"VLOOKUP($B250,Data!$A$2:$C$13,3,0)","v":"Bill"},{"$f":"VLOOKUP($B250,Data!$A$2:$C$13,2,0)","v":"Reggae Rebels"},521,{"$f":"IF(ISNA(VLOOKUP($E250,Data!$A$16:$B$1902,2,0)),\"\",VLOOKUP($E250,Data!$A$16:$B$1902,2,0))","v":"Feliz, Pedro"}]
[21.1,12,{"$f":"VLOOKUP($B251,Data!$A$2:$C$13,3,0)","v":"Mark"},{"$f":"VLOOKUP($B251,Data!$A$2:$C$13,2,0)","v":"W&S Life Insurers"},275,{"$f":"IF(ISNA(VLOOKUP($E251,Data!$A$16:$B$1902,2,0)),\"\",VLOOKUP($E251,Data!$A$16:$B$1902,2,0))","v":"Franklin, Ryan"}]
[21.11,5,{"$f":"VLOOKUP($B252,Data!$A$2:$C$13,3,0)","v":"Chris"},{"$f":"VLOOKUP($B252,Data!$A$2:$C$13,2,0)","v":"Memories of Mom"},394,{"$f":"IF(ISNA(VLOOKUP($E252,Data!$A$16:$B$1902,2,0)),\"\",VLOOKUP($E252,Data!$A$16:$B$1902,2,0))","v":"Zaun, Gregg"},"Traded from D&J on 5.28.09 (with 19.11 for An.Sanchez & J.Happ)"]
[21.12,5,{"$f":"VLOOKUP($B253,Data!$A$2:$C$13,3,0)","v":"Chris"},{"$f":"VLOOKUP($B253,Data!$A$2:$C$13,2,0)","v":"Memories of Mom"},566,{"$f":"IF(ISNA(VLOOKUP($E253,Data!$A$16:$B$1902,2,0)),\"\",VLOOKUP($E253,Data!$A$16:$B$1902,2,0))","v":"Renteria, Edgar"},"Traded from JTP on 5.27.09 (with 17.12 for N.Johnson, R.Madson, 13.02, & 36.02)"]
[22.01,6,{"$f":"VLOOKUP($B254,Data!$A$2:$C$13,3,0)","v":"Kevin"},{"$f":"VLOOKUP($B254,Data!$A$2:$C$13,2,0)","v":"The Luddites"},73,{"$f":"IF(ISNA(VLOOKUP($E254,Data!$A$16:$B$1902,2,0)),\"\",VLOOKUP($E254,Data!$A$16:$B$1902,2,0))","v":"Miller, Andrew"}]
[22.02,5,{"$f":"VLOOKUP($B255,Data!$A$2:$C$13,3,0)","v":"Chris"},{"$f":"VLOOKUP($B255,Data!$A$2:$C$13,2,0)","v":"Memories of Mom"},246,{"$f":"IF(ISNA(VLOOKUP($E255,Data!$A$16:$B$1902,2,0)),\"\",VLOOKUP($E255,Data!$A$16:$B$1902,2,0))","v":"Masset, Nick"}]
[22.03,2,{"$f":"VLOOKUP($B256,Data!$A$2:$C$13,3,0)","v":"Casey"},{"$f":"VLOOKUP($B256,Data!$A$2:$C$13,2,0)","v":"Tulsa Drillers"},274,{"$f":"IF(ISNA(VLOOKUP($E256,Data!$A$16:$B$1902,2,0)),\"\",VLOOKUP($E256,Data!$A$16:$B$1902,2,0))","v":"Pinto, Renyel"}]
[22.04,3,{"$f":"VLOOKUP($B257,Data!$A$2:$C$13,3,0)","v":"Andy"},{"$f":"VLOOKUP($B257,Data!$A$2:$C$13,2,0)","v":"Cripplers"},4065,{"$f":"IF(ISNA(VLOOKUP($E257,Data!$A$16:$B$1902,2,0)),\"\",VLOOKUP($E257,Data!$A$16:$B$1902,2,0))","v":"Gomes, Jonny"}]
[22.05,11,{"$f":"VLOOKUP($B258,Data!$A$2:$C$13,3,0)","v":"Ray"},{"$f":"VLOOKUP($B258,Data!$A$2:$C$13,2,0)","v":"South Indy Thugs"},241,{"$f":"IF(ISNA(VLOOKUP($E258,Data!$A$16:$B$1902,2,0)),\"\",VLOOKUP($E258,Data!$A$16:$B$1902,2,0))","v":"Troncoso, Ramon"}]
[22.06,1,{"$f":"VLOOKUP($B259,Data!$A$2:$C$13,3,0)","v":"Jeremy"},{"$f":"VLOOKUP($B259,Data!$A$2:$C$13,2,0)","v":"Uninspired"},261,{"$f":"IF(ISNA(VLOOKUP($E259,Data!$A$16:$B$1902,2,0)),\"\",VLOOKUP($E259,Data!$A$16:$B$1902,2,0))","v":"Nunez, Leo"}]
[22.07,9,{"$f":"VLOOKUP($B260,Data!$A$2:$C$13,3,0)","v":"Ryan"},{"$f":"VLOOKUP($B260,Data!$A$2:$C$13,2,0)","v":"Ryan's Team"},320,{"$f":"IF(ISNA(VLOOKUP($E260,Data!$A$16:$B$1902,2,0)),\"\",VLOOKUP($E260,Data!$A$16:$B$1902,2,0))","v":"Romo, Sergio"}]
[22.08,4,{"$f":"VLOOKUP($B261,Data!$A$2:$C$13,3,0)","v":"Tim & Jeremy(?) (drafted by Will/Ray)"},{"$f":"VLOOKUP($B261,Data!$A$2:$C$13,2,0)","v":"Romeo Warriors(?)"},177,{"$f":"IF(ISNA(VLOOKUP($E261,Data!$A$16:$B$1902,2,0)),\"\",VLOOKUP($E261,Data!$A$16:$B$1902,2,0))","v":"Teheran, Julio"}]
[22.09,10,{"$f":"VLOOKUP($B262,Data!$A$2:$C$13,3,0)","v":"Bill"},{"$f":"VLOOKUP($B262,Data!$A$2:$C$13,2,0)","v":"Reggae Rebels"},287,{"$f":"IF(ISNA(VLOOKUP($E262,Data!$A$16:$B$1902,2,0)),\"\",VLOOKUP($E262,Data!$A$16:$B$1902,2,0))","v":"Betancourt, Rafael"}]
[22.1,11,{"$f":"VLOOKUP($B263,Data!$A$2:$C$13,3,0)","v":"Ray"},{"$f":"VLOOKUP($B263,Data!$A$2:$C$13,2,0)","v":"South Indy Thugs"},70,{"$f":"IF(ISNA(VLOOKUP($E263,Data!$A$16:$B$1902,2,0)),\"\",VLOOKUP($E263,Data!$A$16:$B$1902,2,0))","v":"Marshall, Sean"},"Traded from Mark prior to 8.31.09 (for D.Eckstein)"]
[22.11,8,{"$f":"VLOOKUP($B264,Data!$A$2:$C$13,3,0)","v":"Duke & Josh"},{"$f":"VLOOKUP($B264,Data!$A$2:$C$13,2,0)","v":"Austin Ackbars"},300,{"$f":"IF(ISNA(VLOOKUP($E264,Data!$A$16:$B$1902,2,0)),\"\",VLOOKUP($E264,Data!$A$16:$B$1902,2,0))","v":"Lindstrom, Matthew"}]
[22.12,7,{"$f":"VLOOKUP($B265,Data!$A$2:$C$13,3,0)","v":"Jess & Tim"},{"$f":"VLOOKUP($B265,Data!$A$2:$C$13,2,0)","v":"Resistance is Futile"},644,{"$f":"IF(ISNA(VLOOKUP($E265,Data!$A$16:$B$1902,2,0)),\"\",VLOOKUP($E265,Data!$A$16:$B$1902,2,0))","v":"Hairston, Scott"}]
[23.01,6,{"$f":"VLOOKUP($B266,Data!$A$2:$C$13,3,0)","v":"Kevin"},{"$f":"VLOOKUP($B266,Data!$A$2:$C$13,2,0)","v":"The Luddites"},249,{"$f":"IF(ISNA(VLOOKUP($E266,Data!$A$16:$B$1902,2,0)),\"\",VLOOKUP($E266,Data!$A$16:$B$1902,2,0))","v":"Moylan, Peter"}]
[23.02,5,{"$f":"VLOOKUP($B267,Data!$A$2:$C$13,3,0)","v":"Chris"},{"$f":"VLOOKUP($B267,Data!$A$2:$C$13,2,0)","v":"Memories of Mom"},76,{"$f":"IF(ISNA(VLOOKUP($E267,Data!$A$16:$B$1902,2,0)),\"\",VLOOKUP($E267,Data!$A$16:$B$1902,2,0))","v":"Young(SD), Chris"}]
[23.03,2,{"$f":"VLOOKUP($B268,Data!$A$2:$C$13,3,0)","v":"Casey"},{"$f":"VLOOKUP($B268,Data!$A$2:$C$13,2,0)","v":"Tulsa Drillers"},111,{"$f":"IF(ISNA(VLOOKUP($E268,Data!$A$16:$B$1902,2,0)),\"\",VLOOKUP($E268,Data!$A$16:$B$1902,2,0))","v":"Reyes(Atl), Jo-Jo"}]
[23.04,11,{"$f":"VLOOKUP($B269,Data!$A$2:$C$13,3,0)","v":"Ray"},{"$f":"VLOOKUP($B269,Data!$A$2:$C$13,2,0)","v":"South Indy Thugs"},184,{"$f":"IF(ISNA(VLOOKUP($E269,Data!$A$16:$B$1902,2,0)),\"\",VLOOKUP($E269,Data!$A$16:$B$1902,2,0))","v":"Wood, Travis"}]
[23.05,3,{"$f":"VLOOKUP($B270,Data!$A$2:$C$13,3,0)","v":"Andy"},{"$f":"VLOOKUP($B270,Data!$A$2:$C$13,2,0)","v":"Cripplers"},506,{"$f":"IF(ISNA(VLOOKUP($E270,Data!$A$16:$B$1902,2,0)),\"\",VLOOKUP($E270,Data!$A$16:$B$1902,2,0))","v":"DeWitt, Blake"}]
[23.06,1,{"$f":"VLOOKUP($B271,Data!$A$2:$C$13,3,0)","v":"Jeremy"},{"$f":"VLOOKUP($B271,Data!$A$2:$C$13,2,0)","v":"Uninspired"},119,{"$f":"IF(ISNA(VLOOKUP($E271,Data!$A$16:$B$1902,2,0)),\"\",VLOOKUP($E271,Data!$A$16:$B$1902,2,0))","v":"Gallagher, Sean"}]
[23.07,9,{"$f":"VLOOKUP($B272,Data!$A$2:$C$13,3,0)","v":"Ryan"},{"$f":"VLOOKUP($B272,Data!$A$2:$C$13,2,0)","v":"Ryan's Team"},657,{"$f":"IF(ISNA(VLOOKUP($E272,Data!$A$16:$B$1902,2,0)),\"\",VLOOKUP($E272,Data!$A$16:$B$1902,2,0))","v":"Pagan, Angel"}]
[23.08,4,{"$f":"VLOOKUP($B273,Data!$A$2:$C$13,3,0)","v":"Tim & Jeremy(?) (drafted by Will/Ray)"},{"$f":"VLOOKUP($B273,Data!$A$2:$C$13,2,0)","v":"Romeo Warriors(?)"},103,{"$f":"IF(ISNA(VLOOKUP($E273,Data!$A$16:$B$1902,2,0)),\"\",VLOOKUP($E273,Data!$A$16:$B$1902,2,0))","v":"McCutchen, Daniel"}]
[23.09,10,{"$f":"VLOOKUP($B274,Data!$A$2:$C$13,3,0)","v":"Bill"},{"$f":"VLOOKUP($B274,Data!$A$2:$C$13,2,0)","v":"Reggae Rebels"},32,{"$f":"IF(ISNA(VLOOKUP($E274,Data!$A$16:$B$1902,2,0)),\"\",VLOOKUP($E274,Data!$A$16:$B$1902,2,0))","v":"Ohlendorf, Ross"}]
[23.1,12,{"$f":"VLOOKUP($B275,Data!$A$2:$C$13,3,0)","v":"Mark"},{"$f":"VLOOKUP($B275,Data!$A$2:$C$13,2,0)","v":"W&S Life Insurers"},565,{"$f":"IF(ISNA(VLOOKUP($E275,Data!$A$16:$B$1902,2,0)),\"\",VLOOKUP($E275,Data!$A$16:$B$1902,2,0))","v":"Guzman, Cristian"}]
[23.11,8,{"$f":"VLOOKUP($B276,Data!$A$2:$C$13,3,0)","v":"Duke & Josh"},{"$f":"VLOOKUP($B276,Data!$A$2:$C$13,2,0)","v":"Austin Ackbars"},484,{"$f":"IF(ISNA(VLOOKUP($E276,Data!$A$16:$B$1902,2,0)),\"\",VLOOKUP($E276,Data!$A$16:$B$1902,2,0))","v":"Sanchez, Freddy"}]
[23.12,7,{"$f":"VLOOKUP($B277,Data!$A$2:$C$13,3,0)","v":"Jess & Tim"},{"$f":"VLOOKUP($B277,Data!$A$2:$C$13,2,0)","v":"Resistance is Futile"},448,{"$f":"IF(ISNA(VLOOKUP($E277,Data!$A$16:$B$1902,2,0)),\"\",VLOOKUP($E277,Data!$A$16:$B$1902,2,0))","v":"Huff, Aubrey"}]
[24.01,6,{"$f":"VLOOKUP($B278,Data!$A$2:$C$13,3,0)","v":"Kevin"},{"$f":"VLOOKUP($B278,Data!$A$2:$C$13,2,0)","v":"The Luddites"},116,{"$f":"IF(ISNA(VLOOKUP($E278,Data!$A$16:$B$1902,2,0)),\"\",VLOOKUP($E278,Data!$A$16:$B$1902,2,0))","v":"Bastardo, Antonio"}]
[24.02,5,{"$f":"VLOOKUP($B279,Data!$A$2:$C$13,3,0)","v":"Chris"},{"$f":"VLOOKUP($B279,Data!$A$2:$C$13,2,0)","v":"Memories of Mom"},181,{"$f":"IF(ISNA(VLOOKUP($E279,Data!$A$16:$B$1902,2,0)),\"\",VLOOKUP($E279,Data!$A$16:$B$1902,2,0))","v":"Cashner, Andrew"}]
[24.03,2,{"$f":"VLOOKUP($B280,Data!$A$2:$C$13,3,0)","v":"Casey"},{"$f":"VLOOKUP($B280,Data!$A$2:$C$13,2,0)","v":"Tulsa Drillers"},279,{"$f":"IF(ISNA(VLOOKUP($E280,Data!$A$16:$B$1902,2,0)),\"\",VLOOKUP($E280,Data!$A$16:$B$1902,2,0))","v":"Feliciano, Pedro"}]
[24.04,3,{"$f":"VLOOKUP($B281,Data!$A$2:$C$13,3,0)","v":"Andy"},{"$f":"VLOOKUP($B281,Data!$A$2:$C$13,2,0)","v":"Cripplers"},79,{"$f":"IF(ISNA(VLOOKUP($E281,Data!$A$16:$B$1902,2,0)),\"\",VLOOKUP($E281,Data!$A$16:$B$1902,2,0))","v":"Badenhop, Burke"}]
[24.05,11,{"$f":"VLOOKUP($B282,Data!$A$2:$C$13,3,0)","v":"Ray"},{"$f":"VLOOKUP($B282,Data!$A$2:$C$13,2,0)","v":"South Indy Thugs"},283,{"$f":"IF(ISNA(VLOOKUP($E282,Data!$A$16:$B$1902,2,0)),\"\",VLOOKUP($E282,Data!$A$16:$B$1902,2,0))","v":"Burnett, Sean"}]
[24.06,1,{"$f":"VLOOKUP($B283,Data!$A$2:$C$13,3,0)","v":"Jeremy"},{"$f":"VLOOKUP($B283,Data!$A$2:$C$13,2,0)","v":"Uninspired"},266,{"$f":"IF(ISNA(VLOOKUP($E283,Data!$A$16:$B$1902,2,0)),\"\",VLOOKUP($E283,Data!$A$16:$B$1902,2,0))","v":"McClellan, Kyle"}]
[24.07,9,{"$f":"VLOOKUP($B284,Data!$A$2:$C$13,3,0)","v":"Ryan"},{"$f":"VLOOKUP($B284,Data!$A$2:$C$13,2,0)","v":"Ryan's Team"},66,{"$f":"IF(ISNA(VLOOKUP($E284,Data!$A$16:$B$1902,2,0)),\"\",VLOOKUP($E284,Data!$A$16:$B$1902,2,0))","v":"Zimmermann, Jordan"}]
[24.08,4,{"$f":"VLOOKUP($B285,Data!$A$2:$C$13,3,0)","v":"Tim & Jeremy(?) (drafted by Will/Ray)"},{"$f":"VLOOKUP($B285,Data!$A$2:$C$13,2,0)","v":"Romeo Warriors(?)"},null,"Lasker, Maverick"]
[24.09,10,{"$f":"VLOOKUP($B286,Data!$A$2:$C$13,3,0)","v":"Bill"},{"$f":"VLOOKUP($B286,Data!$A$2:$C$13,2,0)","v":"Reggae Rebels"},645,{"$f":"IF(ISNA(VLOOKUP($E286,Data!$A$16:$B$1902,2,0)),\"\",VLOOKUP($E286,Data!$A$16:$B$1902,2,0))","v":"Francisco, Ben"}]
[24.1,12,{"$f":"VLOOKUP($B287,Data!$A$2:$C$13,3,0)","v":"Mark"},{"$f":"VLOOKUP($B287,Data!$A$2:$C$13,2,0)","v":"W&S Life Insurers"},298,{"$f":"IF(ISNA(VLOOKUP($E287,Data!$A$16:$B$1902,2,0)),\"\",VLOOKUP($E287,Data!$A$16:$B$1902,2,0))","v":"Zavada, Clay"}]
[24.11,1,{"$f":"VLOOKUP($B288,Data!$A$2:$C$13,3,0)","v":"Jeremy"},{"$f":"VLOOKUP($B288,Data!$A$2:$C$13,2,0)","v":"Uninspired"},406,{"$f":"IF(ISNA(VLOOKUP($E288,Data!$A$16:$B$1902,2,0)),\"\",VLOOKUP($E288,Data!$A$16:$B$1902,2,0))","v":"Ross, David"},"Traded from D&J on 9.1.09 (for H.Bell)"]
[24.12,7,{"$f":"VLOOKUP($B289,Data!$A$2:$C$13,3,0)","v":"Jess & Tim"},{"$f":"VLOOKUP($B289,Data!$A$2:$C$13,2,0)","v":"Resistance is Futile"},347,{"$f":"IF(ISNA(VLOOKUP($E289,Data!$A$16:$B$1902,2,0)),\"\",VLOOKUP($E289,Data!$A$16:$B$1902,2,0))","v":"Runzler, Daniel"}]
[25.01,8,{"$f":"VLOOKUP($B290,Data!$A$2:$C$13,3,0)","v":"Duke & Josh"},{"$f":"VLOOKUP($B290,Data!$A$2:$C$13,2,0)","v":"Austin Ackbars"},697,{"$f":"IF(ISNA(VLOOKUP($E290,Data!$A$16:$B$1902,2,0)),\"\",VLOOKUP($E290,Data!$A$16:$B$1902,2,0))","v":"Colvin, Tyler"},"Traded from Kevin on 3.28.10 with 26.01 & 27.01 for 38.00, 39.00, 42.00, & 43.00"]
[25.02,5,{"$f":"VLOOKUP($B291,Data!$A$2:$C$13,3,0)","v":"Chris"},{"$f":"VLOOKUP($B291,Data!$A$2:$C$13,2,0)","v":"Memories of Mom"},194,{"$f":"IF(ISNA(VLOOKUP($E291,Data!$A$16:$B$1902,2,0)),\"\",VLOOKUP($E291,Data!$A$16:$B$1902,2,0))","v":"Martin, Ethan"}]
[25.03,2,{"$f":"VLOOKUP($B292,Data!$A$2:$C$13,3,0)","v":"Casey"},{"$f":"VLOOKUP($B292,Data!$A$2:$C$13,2,0)","v":"Tulsa Drillers"},269,{"$f":"IF(ISNA(VLOOKUP($E292,Data!$A$16:$B$1902,2,0)),\"\",VLOOKUP($E292,Data!$A$16:$B$1902,2,0))","v":"Hawkins, LaTroy"}]
[25.04,11,{"$f":"VLOOKUP($B293,Data!$A$2:$C$13,3,0)","v":"Ray"},{"$f":"VLOOKUP($B293,Data!$A$2:$C$13,2,0)","v":"South Indy Thugs"},179,{"$f":"IF(ISNA(VLOOKUP($E293,Data!$A$16:$B$1902,2,0)),\"\",VLOOKUP($E293,Data!$A$16:$B$1902,2,0))","v":"Minor, Michael"}]
[25.05,3,{"$f":"VLOOKUP($B294,Data!$A$2:$C$13,3,0)","v":"Andy"},{"$f":"VLOOKUP($B294,Data!$A$2:$C$13,2,0)","v":"Cripplers"},724,{"$f":"IF(ISNA(VLOOKUP($E294,Data!$A$16:$B$1902,2,0)),\"\",VLOOKUP($E294,Data!$A$16:$B$1902,2,0))","v":"Garcia, Jonathan"}]
[25.06,1,{"$f":"VLOOKUP($B295,Data!$A$2:$C$13,3,0)","v":"Jeremy"},{"$f":"VLOOKUP($B295,Data!$A$2:$C$13,2,0)","v":"Uninspired"},543,{"$f":"IF(ISNA(VLOOKUP($E295,Data!$A$16:$B$1902,2,0)),\"\",VLOOKUP($E295,Data!$A$16:$B$1902,2,0))","v":"Johnson, Chris"}]
[25.07,9,{"$f":"VLOOKUP($B296,Data!$A$2:$C$13,3,0)","v":"Ryan"},{"$f":"VLOOKUP($B296,Data!$A$2:$C$13,2,0)","v":"Ryan's Team"},573,{"$f":"IF(ISNA(VLOOKUP($E296,Data!$A$16:$B$1902,2,0)),\"\",VLOOKUP($E296,Data!$A$16:$B$1902,2,0))","v":"Cedeno, Ronny"}]
[25.08,4,{"$f":"VLOOKUP($B297,Data!$A$2:$C$13,3,0)","v":"Tim & Jeremy(?) (drafted by Will/Ray)"},{"$f":"VLOOKUP($B297,Data!$A$2:$C$13,2,0)","v":"Romeo Warriors(?)"},206,{"$f":"IF(ISNA(VLOOKUP($E297,Data!$A$16:$B$1902,2,0)),\"\",VLOOKUP($E297,Data!$A$16:$B$1902,2,0))","v":"Aumont, Phillippe"}]
[25.09,10,{"$f":"VLOOKUP($B298,Data!$A$2:$C$13,3,0)","v":"Bill"},{"$f":"VLOOKUP($B298,Data!$A$2:$C$13,2,0)","v":"Reggae Rebels"},496,{"$f":"IF(ISNA(VLOOKUP($E298,Data!$A$16:$B$1902,2,0)),\"\",VLOOKUP($E298,Data!$A$16:$B$1902,2,0))","v":"Baker, Jeff"}]
[25.1,12,{"$f":"VLOOKUP($B299,Data!$A$2:$C$13,3,0)","v":"Mark"},{"$f":"VLOOKUP($B299,Data!$A$2:$C$13,2,0)","v":"W&S Life Insurers"},482,{"$f":"IF(ISNA(VLOOKUP($E299,Data!$A$16:$B$1902,2,0)),\"\",VLOOKUP($E299,Data!$A$16:$B$1902,2,0))","v":"Matsui, Kazuo"}]
[25.11,1,{"$f":"VLOOKUP($B300,Data!$A$2:$C$13,3,0)","v":"Jeremy"},{"$f":"VLOOKUP($B300,Data!$A$2:$C$13,2,0)","v":"Uninspired"},667,{"$f":"IF(ISNA(VLOOKUP($E300,Data!$A$16:$B$1902,2,0)),\"\",VLOOKUP($E300,Data!$A$16:$B$1902,2,0))","v":"Dickerson, Chris"},"Traded from D&J on 9.6.09 (for J.Willingham)"]
[25.12,7,{"$f":"VLOOKUP($B301,Data!$A$2:$C$13,3,0)","v":"Jess & Tim"},{"$f":"VLOOKUP($B301,Data!$A$2:$C$13,2,0)","v":"Resistance is Futile"},240,{"$f":"IF(ISNA(VLOOKUP($E301,Data!$A$16:$B$1902,2,0)),\"\",VLOOKUP($E301,Data!$A$16:$B$1902,2,0))","v":"Coffey, Todd"}]
[26.01,8,{"$f":"VLOOKUP($B302,Data!$A$2:$C$13,3,0)","v":"Duke & Josh"},{"$f":"VLOOKUP($B302,Data!$A$2:$C$13,2,0)","v":"Austin Ackbars"},54,{"$f":"IF(ISNA(VLOOKUP($E302,Data!$A$16:$B$1902,2,0)),\"\",VLOOKUP($E302,Data!$A$16:$B$1902,2,0))","v":"Bush, Dave"},"Traded from Kevin on 3.28.10 with 25.01 & 27.01 for 38.00, 39.00, 42.00, & 43.00"]
[26.02,5,{"$f":"VLOOKUP($B303,Data!$A$2:$C$13,3,0)","v":"Chris"},{"$f":"VLOOKUP($B303,Data!$A$2:$C$13,2,0)","v":"Memories of Mom"},210,{"$f":"IF(ISNA(VLOOKUP($E303,Data!$A$16:$B$1902,2,0)),\"\",VLOOKUP($E303,Data!$A$16:$B$1902,2,0))","v":"Alderson, Tim"}]
[26.03,2,{"$f":"VLOOKUP($B304,Data!$A$2:$C$13,3,0)","v":"Casey"},{"$f":"VLOOKUP($B304,Data!$A$2:$C$13,2,0)","v":"Tulsa Drillers"},251,{"$f":"IF(ISNA(VLOOKUP($E304,Data!$A$16:$B$1902,2,0)),\"\",VLOOKUP($E304,Data!$A$16:$B$1902,2,0))","v":"Grabow, John"}]
[26.04,3,{"$f":"VLOOKUP($B305,Data!$A$2:$C$13,3,0)","v":"Andy"},{"$f":"VLOOKUP($B305,Data!$A$2:$C$13,2,0)","v":"Cripplers"},62,{"$f":"IF(ISNA(VLOOKUP($E305,Data!$A$16:$B$1902,2,0)),\"\",VLOOKUP($E305,Data!$A$16:$B$1902,2,0))","v":"Mujica, Edward"}]
[26.05,11,{"$f":"VLOOKUP($B306,Data!$A$2:$C$13,3,0)","v":"Ray"},{"$f":"VLOOKUP($B306,Data!$A$2:$C$13,2,0)","v":"South Indy Thugs"},203,{"$f":"IF(ISNA(VLOOKUP($E306,Data!$A$16:$B$1902,2,0)),\"\",VLOOKUP($E306,Data!$A$16:$B$1902,2,0))","v":"Mejia, Jenrry"}]
[26.06,1,{"$f":"VLOOKUP($B307,Data!$A$2:$C$13,3,0)","v":"Jeremy"},{"$f":"VLOOKUP($B307,Data!$A$2:$C$13,2,0)","v":"Uninspired"},4051,{"$f":"IF(ISNA(VLOOKUP($E307,Data!$A$16:$B$1902,2,0)),\"\",VLOOKUP($E307,Data!$A$16:$B$1902,2,0))","v":"Wellemeyer, Todd"}]
[26.07,9,{"$f":"VLOOKUP($B308,Data!$A$2:$C$13,3,0)","v":"Ryan"},{"$f":"VLOOKUP($B308,Data!$A$2:$C$13,2,0)","v":"Ryan's Team"},282,{"$f":"IF(ISNA(VLOOKUP($E308,Data!$A$16:$B$1902,2,0)),\"\",VLOOKUP($E308,Data!$A$16:$B$1902,2,0))","v":"Meyer, Dan"}]
[26.08,4,{"$f":"VLOOKUP($B309,Data!$A$2:$C$13,3,0)","v":"Tim & Jeremy(?) (drafted by Will/Ray)"},{"$f":"VLOOKUP($B309,Data!$A$2:$C$13,2,0)","v":"Romeo Warriors(?)"},509,{"$f":"IF(ISNA(VLOOKUP($E309,Data!$A$16:$B$1902,2,0)),\"\",VLOOKUP($E309,Data!$A$16:$B$1902,2,0))","v":"Abreu, Tony"}]
[26.09,10,{"$f":"VLOOKUP($B310,Data!$A$2:$C$13,3,0)","v":"Bill"},{"$f":"VLOOKUP($B310,Data!$A$2:$C$13,2,0)","v":"Reggae Rebels"},312,{"$f":"IF(ISNA(VLOOKUP($E310,Data!$A$16:$B$1902,2,0)),\"\",VLOOKUP($E310,Data!$A$16:$B$1902,2,0))","v":"Reyes, Dennys"}]
[26.1,12,{"$f":"VLOOKUP($B311,Data!$A$2:$C$13,3,0)","v":"Mark"},{"$f":"VLOOKUP($B311,Data!$A$2:$C$13,2,0)","v":"W&S Life Insurers"},1748,{"$f":"IF(ISNA(VLOOKUP($E311,Data!$A$16:$B$1902,2,0)),\"\",VLOOKUP($E311,Data!$A$16:$B$1902,2,0))","v":"Barajas, Rod"}]
[26.11,8,{"$f":"VLOOKUP($B312,Data!$A$2:$C$13,3,0)","v":"Duke & Josh"},{"$f":"VLOOKUP($B312,Data!$A$2:$C$13,2,0)","v":"Austin Ackbars"},154,{"$f":"IF(ISNA(VLOOKUP($E312,Data!$A$16:$B$1902,2,0)),\"\",VLOOKUP($E312,Data!$A$16:$B$1902,2,0))","v":"Francis, Jeff"}]
[26.12,7,{"$f":"VLOOKUP($B313,Data!$A$2:$C$13,3,0)","v":"Jess & Tim"},{"$f":"VLOOKUP($B313,Data!$A$2:$C$13,2,0)","v":"Resistance is Futile"},65,{"$f":"IF(ISNA(VLOOKUP($E313,Data!$A$16:$B$1902,2,0)),\"\",VLOOKUP($E313,Data!$A$16:$B$1902,2,0))","v":"Mock, Garrett"}]
[27.01,8,{"$f":"VLOOKUP($B314,Data!$A$2:$C$13,3,0)","v":"Duke & Josh"},{"$f":"VLOOKUP($B314,Data!$A$2:$C$13,2,0)","v":"Austin Ackbars"},4060,{"$f":"IF(ISNA(VLOOKUP($E314,Data!$A$16:$B$1902,2,0)),\"\",VLOOKUP($E314,Data!$A$16:$B$1902,2,0))","v":"Torrealba, Yorvit"},"Traded from Kevin on 3.28.10 with 25.01 & 26.01 for 38.00, 39.00, 42.00, & 43.00"]
[27.02,5,{"$f":"VLOOKUP($B315,Data!$A$2:$C$13,3,0)","v":"Chris"},{"$f":"VLOOKUP($B315,Data!$A$2:$C$13,2,0)","v":"Memories of Mom"},211,{"$f":"IF(ISNA(VLOOKUP($E315,Data!$A$16:$B$1902,2,0)),\"\",VLOOKUP($E315,Data!$A$16:$B$1902,2,0))","v":"Lincoln, Brad"}]
[27.03,2,{"$f":"VLOOKUP($B316,Data!$A$2:$C$13,3,0)","v":"Casey"},{"$f":"VLOOKUP($B316,Data!$A$2:$C$13,2,0)","v":"Tulsa Drillers"},654,{"$f":"IF(ISNA(VLOOKUP($E316,Data!$A$16:$B$1902,2,0)),\"\",VLOOKUP($E316,Data!$A$16:$B$1902,2,0))","v":"Spilborghs, Ryan"}]
[27.04,11,{"$f":"VLOOKUP($B317,Data!$A$2:$C$13,3,0)","v":"Ray"},{"$f":"VLOOKUP($B317,Data!$A$2:$C$13,2,0)","v":"South Indy Thugs"},218,{"$f":"IF(ISNA(VLOOKUP($E317,Data!$A$16:$B$1902,2,0)),\"\",VLOOKUP($E317,Data!$A$16:$B$1902,2,0))","v":"Miller, Shelby"}]
[27.05,3,{"$f":"VLOOKUP($B318,Data!$A$2:$C$13,3,0)","v":"Andy"},{"$f":"VLOOKUP($B318,Data!$A$2:$C$13,2,0)","v":"Cripplers"},4153,{"$f":"IF(ISNA(VLOOKUP($E318,Data!$A$16:$B$1902,2,0)),\"\",VLOOKUP($E318,Data!$A$16:$B$1902,2,0))","v":"Santana, Domingo"}]
[27.06,1,{"$f":"VLOOKUP($B319,Data!$A$2:$C$13,3,0)","v":"Jeremy"},{"$f":"VLOOKUP($B319,Data!$A$2:$C$13,2,0)","v":"Uninspired"},734,{"$f":"IF(ISNA(VLOOKUP($E319,Data!$A$16:$B$1902,2,0)),\"\",VLOOKUP($E319,Data!$A$16:$B$1902,2,0))","v":"Jones, Daryl"}]
[27.07,9,{"$f":"VLOOKUP($B320,Data!$A$2:$C$13,3,0)","v":"Ryan"},{"$f":"VLOOKUP($B320,Data!$A$2:$C$13,2,0)","v":"Ryan's Team"},120,{"$f":"IF(ISNA(VLOOKUP($E320,Data!$A$16:$B$1902,2,0)),\"\",VLOOKUP($E320,Data!$A$16:$B$1902,2,0))","v":"Elbert, Scott"}]
[27.08,4,{"$f":"VLOOKUP($B321,Data!$A$2:$C$13,3,0)","v":"Tim & Jeremy(?) (drafted by Will/Ray)"},{"$f":"VLOOKUP($B321,Data!$A$2:$C$13,2,0)","v":"Romeo Warriors(?)"},542,{"$f":"IF(ISNA(VLOOKUP($E321,Data!$A$16:$B$1902,2,0)),\"\",VLOOKUP($E321,Data!$A$16:$B$1902,2,0))","v":"Francisco, Juan"}]
[27.09,10,{"$f":"VLOOKUP($B322,Data!$A$2:$C$13,3,0)","v":"Bill"},{"$f":"VLOOKUP($B322,Data!$A$2:$C$13,2,0)","v":"Reggae Rebels"},332,{"$f":"IF(ISNA(VLOOKUP($E322,Data!$A$16:$B$1902,2,0)),\"\",VLOOKUP($E322,Data!$A$16:$B$1902,2,0))","v":"Gervacio, Sammy"}]
[27.1,12,{"$f":"VLOOKUP($B323,Data!$A$2:$C$13,3,0)","v":"Mark"},{"$f":"VLOOKUP($B323,Data!$A$2:$C$13,2,0)","v":"W&S Life Insurers"},794,{"$f":"IF(ISNA(VLOOKUP($E323,Data!$A$16:$B$1902,2,0)),\"\",VLOOKUP($E323,Data!$A$16:$B$1902,2,0))","v":"Nady, Xavier"}]
[27.11,11,{"$f":"VLOOKUP($B324,Data!$A$2:$C$13,3,0)","v":"Ray"},{"$f":"VLOOKUP($B324,Data!$A$2:$C$13,2,0)","v":"South Indy Thugs"},307,{"$f":"IF(ISNA(VLOOKUP($E324,Data!$A$16:$B$1902,2,0)),\"\",VLOOKUP($E324,Data!$A$16:$B$1902,2,0))","v":"Stetter, Mitch"},"Traded from D&J on 2.23.10 (with H.Bell for B.Molina)"]
[27.12,7,{"$f":"VLOOKUP($B325,Data!$A$2:$C$13,3,0)","v":"Jess & Tim"},{"$f":"VLOOKUP($B325,Data!$A$2:$C$13,2,0)","v":"Resistance is Futile"},646,{"$f":"IF(ISNA(VLOOKUP($E325,Data!$A$16:$B$1902,2,0)),\"\",VLOOKUP($E325,Data!$A$16:$B$1902,2,0))","v":"Gwynn, Tony"}]
[28.01,6,{"$f":"VLOOKUP($B326,Data!$A$2:$C$13,3,0)","v":"Kevin"},{"$f":"VLOOKUP($B326,Data!$A$2:$C$13,2,0)","v":"The Luddites"},133,{"$f":"IF(ISNA(VLOOKUP($E326,Data!$A$16:$B$1902,2,0)),\"\",VLOOKUP($E326,Data!$A$16:$B$1902,2,0))","v":"Chacin, Jhoulys"}]
[28.02,5,{"$f":"VLOOKUP($B327,Data!$A$2:$C$13,3,0)","v":"Chris"},{"$f":"VLOOKUP($B327,Data!$A$2:$C$13,2,0)","v":"Memories of Mom"},227,{"$f":"IF(ISNA(VLOOKUP($E327,Data!$A$16:$B$1902,2,0)),\"\",VLOOKUP($E327,Data!$A$16:$B$1902,2,0))","v":"Wheeler, Zach"}]
[28.03,2,{"$f":"VLOOKUP($B328,Data!$A$2:$C$13,3,0)","v":"Casey"},{"$f":"VLOOKUP($B328,Data!$A$2:$C$13,2,0)","v":"Tulsa Drillers"},652,{"$f":"IF(ISNA(VLOOKUP($E328,Data!$A$16:$B$1902,2,0)),\"\",VLOOKUP($E328,Data!$A$16:$B$1902,2,0))","v":"Church, Ryan"}]
[28.04,3,{"$f":"VLOOKUP($B329,Data!$A$2:$C$13,3,0)","v":"Andy"},{"$f":"VLOOKUP($B329,Data!$A$2:$C$13,2,0)","v":"Cripplers"},532,{"$f":"IF(ISNA(VLOOKUP($E329,Data!$A$16:$B$1902,2,0)),\"\",VLOOKUP($E329,Data!$A$16:$B$1902,2,0))","v":"Crosby, Bobby"}]
[28.05,11,{"$f":"VLOOKUP($B330,Data!$A$2:$C$13,3,0)","v":"Ray"},{"$f":"VLOOKUP($B330,Data!$A$2:$C$13,2,0)","v":"South Indy Thugs"},224,{"$f":"IF(ISNA(VLOOKUP($E330,Data!$A$16:$B$1902,2,0)),\"\",VLOOKUP($E330,Data!$A$16:$B$1902,2,0))","v":"Sosa, Henry"}]
[28.06,1,{"$f":"VLOOKUP($B331,Data!$A$2:$C$13,3,0)","v":"Jeremy"},{"$f":"VLOOKUP($B331,Data!$A$2:$C$13,2,0)","v":"Uninspired"},197,{"$f":"IF(ISNA(VLOOKUP($E331,Data!$A$16:$B$1902,2,0)),\"\",VLOOKUP($E331,Data!$A$16:$B$1902,2,0))","v":"Miller, Aaron"}]
[28.07,9,{"$f":"VLOOKUP($B332,Data!$A$2:$C$13,3,0)","v":"Ryan"},{"$f":"VLOOKUP($B332,Data!$A$2:$C$13,2,0)","v":"Ryan's Team"},259,{"$f":"IF(ISNA(VLOOKUP($E332,Data!$A$16:$B$1902,2,0)),\"\",VLOOKUP($E332,Data!$A$16:$B$1902,2,0))","v":"Green, Sean"}]
[28.08,4,{"$f":"VLOOKUP($B333,Data!$A$2:$C$13,3,0)","v":"Tim & Jeremy(?) (drafted by Will/Ray)"},{"$f":"VLOOKUP($B333,Data!$A$2:$C$13,2,0)","v":"Romeo Warriors(?)"},675,{"$f":"IF(ISNA(VLOOKUP($E333,Data!$A$16:$B$1902,2,0)),\"\",VLOOKUP($E333,Data!$A$16:$B$1902,2,0))","v":"Schafer, Jordan"}]
[28.09,5,{"$f":"VLOOKUP($B334,Data!$A$2:$C$13,3,0)","v":"Chris"},{"$f":"VLOOKUP($B334,Data!$A$2:$C$13,2,0)","v":"Memories of Mom"},250,{"$f":"IF(ISNA(VLOOKUP($E334,Data!$A$16:$B$1902,2,0)),\"\",VLOOKUP($E334,Data!$A$16:$B$1902,2,0))","v":"Heilman, Aaron"},"Traded from Bill on 3.28.10 for 37.00 & 42.00"]
[28.1,12,{"$f":"VLOOKUP($B335,Data!$A$2:$C$13,3,0)","v":"Mark"},{"$f":"VLOOKUP($B335,Data!$A$2:$C$13,2,0)","v":"W&S Life Insurers"},281,{"$f":"IF(ISNA(VLOOKUP($E335,Data!$A$16:$B$1902,2,0)),\"\",VLOOKUP($E335,Data!$A$16:$B$1902,2,0))","v":"Lidge, Brad"}]
[28.11,8,{"$f":"VLOOKUP($B336,Data!$A$2:$C$13,3,0)","v":"Duke & Josh"},{"$f":"VLOOKUP($B336,Data!$A$2:$C$13,2,0)","v":"Austin Ackbars"},663,{"$f":"IF(ISNA(VLOOKUP($E336,Data!$A$16:$B$1902,2,0)),\"\",VLOOKUP($E336,Data!$A$16:$B$1902,2,0))","v":"Venable, Will"}]
[28.12,7,{"$f":"VLOOKUP($B337,Data!$A$2:$C$13,3,0)","v":"Jess & Tim"},{"$f":"VLOOKUP($B337,Data!$A$2:$C$13,2,0)","v":"Resistance is Futile"},800,{"$f":"IF(ISNA(VLOOKUP($E337,Data!$A$16:$B$1902,2,0)),\"\",VLOOKUP($E337,Data!$A$16:$B$1902,2,0))","v":"Johnson, Reed"}]
[29.01,6,{"$f":"VLOOKUP($B338,Data!$A$2:$C$13,3,0)","v":"Kevin"},{"$f":"VLOOKUP($B338,Data!$A$2:$C$13,2,0)","v":"The Luddites"},167,{"$f":"IF(ISNA(VLOOKUP($E338,Data!$A$16:$B$1902,2,0)),\"\",VLOOKUP($E338,Data!$A$16:$B$1902,2,0))","v":"Garcia, Jaime"}]
[29.02,5,{"$f":"VLOOKUP($B339,Data!$A$2:$C$13,3,0)","v":"Chris"},{"$f":"VLOOKUP($B339,Data!$A$2:$C$13,2,0)","v":"Memories of Mom"},230,{"$f":"IF(ISNA(VLOOKUP($E339,Data!$A$16:$B$1902,2,0)),\"\",VLOOKUP($E339,Data!$A$16:$B$1902,2,0))","v":"Matzek, Tyler"}]
[29.03,2,{"$f":"VLOOKUP($B340,Data!$A$2:$C$13,3,0)","v":"Casey"},{"$f":"VLOOKUP($B340,Data!$A$2:$C$13,2,0)","v":"Tulsa Drillers"},648,{"$f":"IF(ISNA(VLOOKUP($E340,Data!$A$16:$B$1902,2,0)),\"\",VLOOKUP($E340,Data!$A$16:$B$1902,2,0))","v":"Taveras, Willy"}]
[29.04,11,{"$f":"VLOOKUP($B341,Data!$A$2:$C$13,3,0)","v":"Ray"},{"$f":"VLOOKUP($B341,Data!$A$2:$C$13,2,0)","v":"South Indy Thugs"},417,{"$f":"IF(ISNA(VLOOKUP($E341,Data!$A$16:$B$1902,2,0)),\"\",VLOOKUP($E341,Data!$A$16:$B$1902,2,0))","v":"Posey, Buster"}]
[29.05,3,{"$f":"VLOOKUP($B342,Data!$A$2:$C$13,3,0)","v":"Andy"},{"$f":"VLOOKUP($B342,Data!$A$2:$C$13,2,0)","v":"Cripplers"},4181,{"$f":"IF(ISNA(VLOOKUP($E342,Data!$A$16:$B$1902,2,0)),\"\",VLOOKUP($E342,Data!$A$16:$B$1902,2,0))","v":"Lopez, Rod"}]
[29.06,1,{"$f":"VLOOKUP($B343,Data!$A$2:$C$13,3,0)","v":"Jeremy"},{"$f":"VLOOKUP($B343,Data!$A$2:$C$13,2,0)","v":"Uninspired"},234,{"$f":"IF(ISNA(VLOOKUP($E343,Data!$A$16:$B$1902,2,0)),\"\",VLOOKUP($E343,Data!$A$16:$B$1902,2,0))","v":"James, Chad"}]
[29.07,9,{"$f":"VLOOKUP($B344,Data!$A$2:$C$13,3,0)","v":"Ryan"},{"$f":"VLOOKUP($B344,Data!$A$2:$C$13,2,0)","v":"Ryan's Team"},669,{"$f":"IF(ISNA(VLOOKUP($E344,Data!$A$16:$B$1902,2,0)),\"\",VLOOKUP($E344,Data!$A$16:$B$1902,2,0))","v":"Balentien, Wladimir"}]
[29.08,4,{"$f":"VLOOKUP($B345,Data!$A$2:$C$13,3,0)","v":"Tim & Jeremy(?) (drafted by Will/Ray)"},{"$f":"VLOOKUP($B345,Data!$A$2:$C$13,2,0)","v":"Romeo Warriors(?)"},595,{"$f":"IF(ISNA(VLOOKUP($E345,Data!$A$16:$B$1902,2,0)),\"\",VLOOKUP($E345,Data!$A$16:$B$1902,2,0))","v":"Manzella, Tommy"}]
[29.09,10,{"$f":"VLOOKUP($B346,Data!$A$2:$C$13,3,0)","v":"Bill"},{"$f":"VLOOKUP($B346,Data!$A$2:$C$13,2,0)","v":"Reggae Rebels"},492,{"$f":"IF(ISNA(VLOOKUP($E346,Data!$A$16:$B$1902,2,0)),\"\",VLOOKUP($E346,Data!$A$16:$B$1902,2,0))","v":"Keppinger, Jeff"}]
[29.1,12,{"$f":"VLOOKUP($B347,Data!$A$2:$C$13,3,0)","v":"Mark"},{"$f":"VLOOKUP($B347,Data!$A$2:$C$13,2,0)","v":"W&S Life Insurers"},277,{"$f":"IF(ISNA(VLOOKUP($E347,Data!$A$16:$B$1902,2,0)),\"\",VLOOKUP($E347,Data!$A$16:$B$1902,2,0))","v":"Clippard, Tyler"}]
[29.11,8,{"$f":"VLOOKUP($B348,Data!$A$2:$C$13,3,0)","v":"Duke & Josh"},{"$f":"VLOOKUP($B348,Data!$A$2:$C$13,2,0)","v":"Austin Ackbars"},121,{"$f":"IF(ISNA(VLOOKUP($E348,Data!$A$16:$B$1902,2,0)),\"\",VLOOKUP($E348,Data!$A$16:$B$1902,2,0))","v":"Caridad, Esmailin"}]
[29.12,7,{"$f":"VLOOKUP($B349,Data!$A$2:$C$13,3,0)","v":"Jess & Tim"},{"$f":"VLOOKUP($B349,Data!$A$2:$C$13,2,0)","v":"Resistance is Futile"},114,{"$f":"IF(ISNA(VLOOKUP($E349,Data!$A$16:$B$1902,2,0)),\"\",VLOOKUP($E349,Data!$A$16:$B$1902,2,0))","v":"Niese, Jonathon"}]
[30.01,6,{"$f":"VLOOKUP($B350,Data!$A$2:$C$13,3,0)","v":"Kevin"},{"$f":"VLOOKUP($B350,Data!$A$2:$C$13,2,0)","v":"The Luddites"},188,{"$f":"IF(ISNA(VLOOKUP($E350,Data!$A$16:$B$1902,2,0)),\"\",VLOOKUP($E350,Data!$A$16:$B$1902,2,0))","v":"Lyles, Jordan"}]
[30.02,5,{"$f":"VLOOKUP($B351,Data!$A$2:$C$13,3,0)","v":"Chris"},{"$f":"VLOOKUP($B351,Data!$A$2:$C$13,2,0)","v":"Memories of Mom"},236,{"$f":"IF(ISNA(VLOOKUP($E351,Data!$A$16:$B$1902,2,0)),\"\",VLOOKUP($E351,Data!$A$16:$B$1902,2,0))","v":"Parker, Jarrod"}]
[30.03,2,{"$f":"VLOOKUP($B352,Data!$A$2:$C$13,3,0)","v":"Casey"},{"$f":"VLOOKUP($B352,Data!$A$2:$C$13,2,0)","v":"Tulsa Drillers"},481,{"$f":"IF(ISNA(VLOOKUP($E352,Data!$A$16:$B$1902,2,0)),\"\",VLOOKUP($E352,Data!$A$16:$B$1902,2,0))","v":"Eckstein, David"}]
[30.04,3,{"$f":"VLOOKUP($B353,Data!$A$2:$C$13,3,0)","v":"Andy"},{"$f":"VLOOKUP($B353,Data!$A$2:$C$13,2,0)","v":"Cripplers"},371,{"$f":"IF(ISNA(VLOOKUP($E353,Data!$A$16:$B$1902,2,0)),\"\",VLOOKUP($E353,Data!$A$16:$B$1902,2,0))","v":"Kimbrel, Craig"}]
[30.05,11,{"$f":"VLOOKUP($B354,Data!$A$2:$C$13,3,0)","v":"Ray"},{"$f":"VLOOKUP($B354,Data!$A$2:$C$13,2,0)","v":"South Indy Thugs"},425,{"$f":"IF(ISNA(VLOOKUP($E354,Data!$A$16:$B$1902,2,0)),\"\",VLOOKUP($E354,Data!$A$16:$B$1902,2,0))","v":"Salome, Angel"}]
[30.06,1,{"$f":"VLOOKUP($B355,Data!$A$2:$C$13,3,0)","v":"Jeremy"},{"$f":"VLOOKUP($B355,Data!$A$2:$C$13,2,0)","v":"Uninspired"},459,{"$f":"IF(ISNA(VLOOKUP($E355,Data!$A$16:$B$1902,2,0)),\"\",VLOOKUP($E355,Data!$A$16:$B$1902,2,0))","v":"Sanchez, Gaby"}]
[30.07,9,{"$f":"VLOOKUP($B356,Data!$A$2:$C$13,3,0)","v":"Ryan"},{"$f":"VLOOKUP($B356,Data!$A$2:$C$13,2,0)","v":"Ryan's Team"},776,{"$f":"IF(ISNA(VLOOKUP($E356,Data!$A$16:$B$1902,2,0)),\"\",VLOOKUP($E356,Data!$A$16:$B$1902,2,0))","v":"Contreras, Jose"}]
[30.08,4,{"$f":"VLOOKUP($B357,Data!$A$2:$C$13,3,0)","v":"Tim & Jeremy(?) (drafted by Will/Ray)"},{"$f":"VLOOKUP($B357,Data!$A$2:$C$13,2,0)","v":"Romeo Warriors(?)"},791,{"$f":"IF(ISNA(VLOOKUP($E357,Data!$A$16:$B$1902,2,0)),\"\",VLOOKUP($E357,Data!$A$16:$B$1902,2,0))","v":"Jeffress, Jeremy"}]
[30.09,10,{"$f":"VLOOKUP($B358,Data!$A$2:$C$13,3,0)","v":"Bill"},{"$f":"VLOOKUP($B358,Data!$A$2:$C$13,2,0)","v":"Reggae Rebels"},89,{"$f":"IF(ISNA(VLOOKUP($E358,Data!$A$16:$B$1902,2,0)),\"\",VLOOKUP($E358,Data!$A$16:$B$1902,2,0))","v":"VandenHurk, Rick"}]
[30.1,12,{"$f":"VLOOKUP($B359,Data!$A$2:$C$13,3,0)","v":"Mark"},{"$f":"VLOOKUP($B359,Data!$A$2:$C$13,2,0)","v":"W&S Life Insurers"},4056,{"$f":"IF(ISNA(VLOOKUP($E359,Data!$A$16:$B$1902,2,0)),\"\",VLOOKUP($E359,Data!$A$16:$B$1902,2,0))","v":"Calero, Kiko"}]
[30.11,8,{"$f":"VLOOKUP($B360,Data!$A$2:$C$13,3,0)","v":"Duke & Josh"},{"$f":"VLOOKUP($B360,Data!$A$2:$C$13,2,0)","v":"Austin Ackbars"},585,{"$f":"IF(ISNA(VLOOKUP($E360,Data!$A$16:$B$1902,2,0)),\"\",VLOOKUP($E360,Data!$A$16:$B$1902,2,0))","v":"Castro, Juan"}]
[30.12,7,{"$f":"VLOOKUP($B361,Data!$A$2:$C$13,3,0)","v":"Jess & Tim"},{"$f":"VLOOKUP($B361,Data!$A$2:$C$13,2,0)","v":"Resistance is Futile"},132,{"$f":"IF(ISNA(VLOOKUP($E361,Data!$A$16:$B$1902,2,0)),\"\",VLOOKUP($E361,Data!$A$16:$B$1902,2,0))","v":"Poreda, Aaron"}]
[31.01,6,{"$f":"VLOOKUP($B362,Data!$A$2:$C$13,3,0)","v":"Kevin"},{"$f":"VLOOKUP($B362,Data!$A$2:$C$13,2,0)","v":"The Luddites"},201,{"$f":"IF(ISNA(VLOOKUP($E362,Data!$A$16:$B$1902,2,0)),\"\",VLOOKUP($E362,Data!$A$16:$B$1902,2,0))","v":"Strasburg, Stephen"}]
[31.02,5,{"$f":"VLOOKUP($B363,Data!$A$2:$C$13,3,0)","v":"Chris"},{"$f":"VLOOKUP($B363,Data!$A$2:$C$13,2,0)","v":"Memories of Mom"},437,{"$f":"IF(ISNA(VLOOKUP($E363,Data!$A$16:$B$1902,2,0)),\"\",VLOOKUP($E363,Data!$A$16:$B$1902,2,0))","v":"Rosario, Wilin"}]
[31.03,2,{"$f":"VLOOKUP($B364,Data!$A$2:$C$13,3,0)","v":"Casey"},{"$f":"VLOOKUP($B364,Data!$A$2:$C$13,2,0)","v":"Tulsa Drillers"},253,{"$f":"IF(ISNA(VLOOKUP($E364,Data!$A$16:$B$1902,2,0)),\"\",VLOOKUP($E364,Data!$A$16:$B$1902,2,0))","v":"Baez, Danys"}]
[31.04,11,{"$f":"VLOOKUP($B365,Data!$A$2:$C$13,3,0)","v":"Ray"},{"$f":"VLOOKUP($B365,Data!$A$2:$C$13,2,0)","v":"South Indy Thugs"},512,{"$f":"IF(ISNA(VLOOKUP($E365,Data!$A$16:$B$1902,2,0)),\"\",VLOOKUP($E365,Data!$A$16:$B$1902,2,0))","v":"Antonelli, Matt"}]
[31.05,3,{"$f":"VLOOKUP($B366,Data!$A$2:$C$13,3,0)","v":"Andy"},{"$f":"VLOOKUP($B366,Data!$A$2:$C$13,2,0)","v":"Cripplers"},429,{"$f":"IF(ISNA(VLOOKUP($E366,Data!$A$16:$B$1902,2,0)),\"\",VLOOKUP($E366,Data!$A$16:$B$1902,2,0))","v":"Castro, Jason"}]
[31.06,1,{"$f":"VLOOKUP($B367,Data!$A$2:$C$13,3,0)","v":"Jeremy"},{"$f":"VLOOKUP($B367,Data!$A$2:$C$13,2,0)","v":"Uninspired"},467,{"$f":"IF(ISNA(VLOOKUP($E367,Data!$A$16:$B$1902,2,0)),\"\",VLOOKUP($E367,Data!$A$16:$B$1902,2,0))","v":"Marrero, Chris"}]
[31.07,9,{"$f":"VLOOKUP($B368,Data!$A$2:$C$13,3,0)","v":"Ryan"},{"$f":"VLOOKUP($B368,Data!$A$2:$C$13,2,0)","v":"Ryan's Team"},452,{"$f":"IF(ISNA(VLOOKUP($E368,Data!$A$16:$B$1902,2,0)),\"\",VLOOKUP($E368,Data!$A$16:$B$1902,2,0))","v":"Ishikawa, Travis"}]
[31.08,4,{"$f":"VLOOKUP($B369,Data!$A$2:$C$13,3,0)","v":"Tim & Jeremy(?) (drafted by Will/Ray)"},{"$f":"VLOOKUP($B369,Data!$A$2:$C$13,2,0)","v":"Romeo Warriors(?)"},653,{"$f":"IF(ISNA(VLOOKUP($E369,Data!$A$16:$B$1902,2,0)),\"\",VLOOKUP($E369,Data!$A$16:$B$1902,2,0))","v":"Harris, Willie"}]
[31.09,10,{"$f":"VLOOKUP($B370,Data!$A$2:$C$13,3,0)","v":"Bill"},{"$f":"VLOOKUP($B370,Data!$A$2:$C$13,2,0)","v":"Reggae Rebels"},421,{"$f":"IF(ISNA(VLOOKUP($E370,Data!$A$16:$B$1902,2,0)),\"\",VLOOKUP($E370,Data!$A$16:$B$1902,2,0))","v":"Ellis, A.J."}]
[31.1,12,{"$f":"VLOOKUP($B371,Data!$A$2:$C$13,3,0)","v":"Mark"},{"$f":"VLOOKUP($B371,Data!$A$2:$C$13,2,0)","v":"W&S Life Insurers"},101,{"$f":"IF(ISNA(VLOOKUP($E371,Data!$A$16:$B$1902,2,0)),\"\",VLOOKUP($E371,Data!$A$16:$B$1902,2,0))","v":"Hawksworth, Blake"}]
[31.11,8,{"$f":"VLOOKUP($B372,Data!$A$2:$C$13,3,0)","v":"Duke & Josh"},{"$f":"VLOOKUP($B372,Data!$A$2:$C$13,2,0)","v":"Austin Ackbars"},775,{"$f":"IF(ISNA(VLOOKUP($E372,Data!$A$16:$B$1902,2,0)),\"\",VLOOKUP($E372,Data!$A$16:$B$1902,2,0))","v":"Edmonds, Jim"}]
[31.12,7,{"$f":"VLOOKUP($B373,Data!$A$2:$C$13,3,0)","v":"Jess & Tim"},{"$f":"VLOOKUP($B373,Data!$A$2:$C$13,2,0)","v":"Resistance is Futile"},135,{"$f":"IF(ISNA(VLOOKUP($E373,Data!$A$16:$B$1902,2,0)),\"\",VLOOKUP($E373,Data!$A$16:$B$1902,2,0))","v":"Bumgarner, Madison"}]
[32.01,6,{"$f":"VLOOKUP($B374,Data!$A$2:$C$13,3,0)","v":"Kevin"},{"$f":"VLOOKUP($B374,Data!$A$2:$C$13,2,0)","v":"The Luddites"},426,{"$f":"IF(ISNA(VLOOKUP($E374,Data!$A$16:$B$1902,2,0)),\"\",VLOOKUP($E374,Data!$A$16:$B$1902,2,0))","v":"Lucroy, Jonathon"}]
[32.020000000000003,5,{"$f":"VLOOKUP($B375,Data!$A$2:$C$13,3,0)","v":"Chris"},{"$f":"VLOOKUP($B375,Data!$A$2:$C$13,2,0)","v":"Memories of Mom"},513,{"$f":"IF(ISNA(VLOOKUP($E375,Data!$A$16:$B$1902,2,0)),\"\",VLOOKUP($E375,Data!$A$16:$B$1902,2,0))","v":"Lawrie, Brett"}]
[32.03,2,{"$f":"VLOOKUP($B376,Data!$A$2:$C$13,3,0)","v":"Casey"},{"$f":"VLOOKUP($B376,Data!$A$2:$C$13,2,0)","v":"Tulsa Drillers"},489,{"$f":"IF(ISNA(VLOOKUP($E376,Data!$A$16:$B$1902,2,0)),\"\",VLOOKUP($E376,Data!$A$16:$B$1902,2,0))","v":"Carroll, Jamey"}]
[32.04,3,{"$f":"VLOOKUP($B377,Data!$A$2:$C$13,3,0)","v":"Andy"},{"$f":"VLOOKUP($B377,Data!$A$2:$C$13,2,0)","v":"Cripplers"},466,{"$f":"IF(ISNA(VLOOKUP($E377,Data!$A$16:$B$1902,2,0)),\"\",VLOOKUP($E377,Data!$A$16:$B$1902,2,0))","v":"Alonso, Yonder"}]
[32.049999999999997,11,{"$f":"VLOOKUP($B378,Data!$A$2:$C$13,3,0)","v":"Ray"},{"$f":"VLOOKUP($B378,Data!$A$2:$C$13,2,0)","v":"South Indy Thugs"},556,{"$f":"IF(ISNA(VLOOKUP($E378,Data!$A$16:$B$1902,2,0)),\"\",VLOOKUP($E378,Data!$A$16:$B$1902,2,0))","v":"Borchering, Robert"}]
[32.06,1,{"$f":"VLOOKUP($B379,Data!$A$2:$C$13,3,0)","v":"Jeremy"},{"$f":"VLOOKUP($B379,Data!$A$2:$C$13,2,0)","v":"Uninspired"},548,{"$f":"IF(ISNA(VLOOKUP($E379,Data!$A$16:$B$1902,2,0)),\"\",VLOOKUP($E379,Data!$A$16:$B$1902,2,0))","v":"Vitters, Joshua"}]
[32.07,9,{"$f":"VLOOKUP($B380,Data!$A$2:$C$13,3,0)","v":"Ryan"},{"$f":"VLOOKUP($B380,Data!$A$2:$C$13,2,0)","v":"Ryan's Team"},272,{"$f":"IF(ISNA(VLOOKUP($E380,Data!$A$16:$B$1902,2,0)),\"\",VLOOKUP($E380,Data!$A$16:$B$1902,2,0))","v":"Herrera, DannyRay"}]
[32.08,4,{"$f":"VLOOKUP($B381,Data!$A$2:$C$13,3,0)","v":"Tim & Jeremy(?) (drafted by Will/Ray)"},{"$f":"VLOOKUP($B381,Data!$A$2:$C$13,2,0)","v":"Romeo Warriors(?)"},597,{"$f":"IF(ISNA(VLOOKUP($E381,Data!$A$16:$B$1902,2,0)),\"\",VLOOKUP($E381,Data!$A$16:$B$1902,2,0))","v":"Lee, Hak-Ju"}]
[32.090000000000003,10,{"$f":"VLOOKUP($B382,Data!$A$2:$C$13,3,0)","v":"Bill"},{"$f":"VLOOKUP($B382,Data!$A$2:$C$13,2,0)","v":"Reggae Rebels"},605,{"$f":"IF(ISNA(VLOOKUP($E382,Data!$A$16:$B$1902,2,0)),\"\",VLOOKUP($E382,Data!$A$16:$B$1902,2,0))","v":"Espinosa, Danny"}]
[32.1,12,{"$f":"VLOOKUP($B383,Data!$A$2:$C$13,3,0)","v":"Mark"},{"$f":"VLOOKUP($B383,Data!$A$2:$C$13,2,0)","v":"W&S Life Insurers"},228,{"$f":"IF(ISNA(VLOOKUP($E383,Data!$A$16:$B$1902,2,0)),\"\",VLOOKUP($E383,Data!$A$16:$B$1902,2,0))","v":"Friedrich, Christian"}]
[32.11,8,{"$f":"VLOOKUP($B384,Data!$A$2:$C$13,3,0)","v":"Duke & Josh"},{"$f":"VLOOKUP($B384,Data!$A$2:$C$13,2,0)","v":"Austin Ackbars"},185,{"$f":"IF(ISNA(VLOOKUP($E384,Data!$A$16:$B$1902,2,0)),\"\",VLOOKUP($E384,Data!$A$16:$B$1902,2,0))","v":"Leake, Michael"}]
[32.119999999999997,7,{"$f":"VLOOKUP($B385,Data!$A$2:$C$13,3,0)","v":"Jess & Tim"},{"$f":"VLOOKUP($B385,Data!$A$2:$C$13,2,0)","v":"Resistance is Futile"},456,{"$f":"IF(ISNA(VLOOKUP($E385,Data!$A$16:$B$1902,2,0)),\"\",VLOOKUP($E385,Data!$A$16:$B$1902,2,0))","v":"Allen, Brandon"}]
[33.01,6,{"$f":"VLOOKUP($B386,Data!$A$2:$C$13,3,0)","v":"Kevin"},{"$f":"VLOOKUP($B386,Data!$A$2:$C$13,2,0)","v":"The Luddites"},472,{"$f":"IF(ISNA(VLOOKUP($E386,Data!$A$16:$B$1902,2,0)),\"\",VLOOKUP($E386,Data!$A$16:$B$1902,2,0))","v":"Morrison, Logan"}]
[33.020000000000003,5,{"$f":"VLOOKUP($B387,Data!$A$2:$C$13,3,0)","v":"Chris"},{"$f":"VLOOKUP($B387,Data!$A$2:$C$13,2,0)","v":"Memories of Mom"},725,{"$f":"IF(ISNA(VLOOKUP($E387,Data!$A$16:$B$1902,2,0)),\"\",VLOOKUP($E387,Data!$A$16:$B$1902,2,0))","v":"Brown, Dominic"}]
[33.03,2,{"$f":"VLOOKUP($B388,Data!$A$2:$C$13,3,0)","v":"Casey"},{"$f":"VLOOKUP($B388,Data!$A$2:$C$13,2,0)","v":"Tulsa Drillers"},514,{"$f":"IF(ISNA(VLOOKUP($E388,Data!$A$16:$B$1902,2,0)),\"\",VLOOKUP($E388,Data!$A$16:$B$1902,2,0))","v":"Frazier, Todd"}]
[33.04,11,{"$f":"VLOOKUP($B389,Data!$A$2:$C$13,3,0)","v":"Ray"},{"$f":"VLOOKUP($B389,Data!$A$2:$C$13,2,0)","v":"South Indy Thugs"},602,{"$f":"IF(ISNA(VLOOKUP($E389,Data!$A$16:$B$1902,2,0)),\"\",VLOOKUP($E389,Data!$A$16:$B$1902,2,0))","v":"Mier, Jiovanni"}]
[33.049999999999997,3,{"$f":"VLOOKUP($B390,Data!$A$2:$C$13,3,0)","v":"Andy"},{"$f":"VLOOKUP($B390,Data!$A$2:$C$13,2,0)","v":"Cripplers"},550,{"$f":"IF(ISNA(VLOOKUP($E390,Data!$A$16:$B$1902,2,0)),\"\",VLOOKUP($E390,Data!$A$16:$B$1902,2,0))","v":"Alvarez, Pedro"}]
[33.06,1,{"$f":"VLOOKUP($B391,Data!$A$2:$C$13,3,0)","v":"Jeremy"},{"$f":"VLOOKUP($B391,Data!$A$2:$C$13,2,0)","v":"Uninspired"},713,{"$f":"IF(ISNA(VLOOKUP($E391,Data!$A$16:$B$1902,2,0)),\"\",VLOOKUP($E391,Data!$A$16:$B$1902,2,0))","v":"Davis, Kentrall"}]
[33.07,9,{"$f":"VLOOKUP($B392,Data!$A$2:$C$13,3,0)","v":"Ryan"},{"$f":"VLOOKUP($B392,Data!$A$2:$C$13,2,0)","v":"Ryan's Team"},375,{"$f":"IF(ISNA(VLOOKUP($E392,Data!$A$16:$B$1902,2,0)),\"\",VLOOKUP($E392,Data!$A$16:$B$1902,2,0))","v":"Storen, Drew"}]
[33.08,4,{"$f":"VLOOKUP($B393,Data!$A$2:$C$13,3,0)","v":"Tim & Jeremy(?) (drafted by Will/Ray)"},{"$f":"VLOOKUP($B393,Data!$A$2:$C$13,2,0)","v":"Romeo Warriors(?)"},465,{"$f":"IF(ISNA(VLOOKUP($E393,Data!$A$16:$B$1902,2,0)),\"\",VLOOKUP($E393,Data!$A$16:$B$1902,2,0))","v":"Freeman, Frederick"}]
[33.090000000000003,10,{"$f":"VLOOKUP($B394,Data!$A$2:$C$13,3,0)","v":"Bill"},{"$f":"VLOOKUP($B394,Data!$A$2:$C$13,2,0)","v":"Reggae Rebels"},432,{"$f":"IF(ISNA(VLOOKUP($E394,Data!$A$16:$B$1902,2,0)),\"\",VLOOKUP($E394,Data!$A$16:$B$1902,2,0))","v":"Norris, Derek"}]
[33.1,12,{"$f":"VLOOKUP($B395,Data!$A$2:$C$13,3,0)","v":"Mark"},{"$f":"VLOOKUP($B395,Data!$A$2:$C$13,2,0)","v":"W&S Life Insurers"},540,{"$f":"IF(ISNA(VLOOKUP($E395,Data!$A$16:$B$1902,2,0)),\"\",VLOOKUP($E395,Data!$A$16:$B$1902,2,0))","v":"Freese, David"}]
[33.11,8,{"$f":"VLOOKUP($B396,Data!$A$2:$C$13,3,0)","v":"Duke & Josh"},{"$f":"VLOOKUP($B396,Data!$A$2:$C$13,2,0)","v":"Austin Ackbars"},433,{"$f":"IF(ISNA(VLOOKUP($E396,Data!$A$16:$B$1902,2,0)),\"\",VLOOKUP($E396,Data!$A$16:$B$1902,2,0))","v":"Sanchez, Jorge(Tony)"}]
[33.119999999999997,7,{"$f":"VLOOKUP($B397,Data!$A$2:$C$13,3,0)","v":"Jess & Tim"},{"$f":"VLOOKUP($B397,Data!$A$2:$C$13,2,0)","v":"Resistance is Futile"},604,{"$f":"IF(ISNA(VLOOKUP($E397,Data!$A$16:$B$1902,2,0)),\"\",VLOOKUP($E397,Data!$A$16:$B$1902,2,0))","v":"Gordon, Devaris"}]
[34.01,6,{"$f":"VLOOKUP($B398,Data!$A$2:$C$13,3,0)","v":"Kevin"},{"$f":"VLOOKUP($B398,Data!$A$2:$C$13,2,0)","v":"The Luddites"},606,{"$f":"IF(ISNA(VLOOKUP($E398,Data!$A$16:$B$1902,2,0)),\"\",VLOOKUP($E398,Data!$A$16:$B$1902,2,0))","v":"Havens, Reese"}]
[34.020000000000003,5,{"$f":"VLOOKUP($B399,Data!$A$2:$C$13,3,0)","v":"Chris"},{"$f":"VLOOKUP($B399,Data!$A$2:$C$13,2,0)","v":"Memories of Mom"},1217,{"$f":"IF(ISNA(VLOOKUP($E399,Data!$A$16:$B$1902,2,0)),\"\",VLOOKUP($E399,Data!$A$16:$B$1902,2,0))","v":"Drabek, Kyle"}]
[34.03,2,{"$f":"VLOOKUP($B400,Data!$A$2:$C$13,3,0)","v":"Casey"},{"$f":"VLOOKUP($B400,Data!$A$2:$C$13,2,0)","v":"Tulsa Drillers"},502,{"$f":"IF(ISNA(VLOOKUP($E400,Data!$A$16:$B$1902,2,0)),\"\",VLOOKUP($E400,Data!$A$16:$B$1902,2,0))","v":"Young, Eric"}]
[34.04,3,{"$f":"VLOOKUP($B401,Data!$A$2:$C$13,3,0)","v":"Andy"},{"$f":"VLOOKUP($B401,Data!$A$2:$C$13,2,0)","v":"Cripplers"},584,{"$f":"IF(ISNA(VLOOKUP($E401,Data!$A$16:$B$1902,2,0)),\"\",VLOOKUP($E401,Data!$A$16:$B$1902,2,0))","v":"Escobar, Alcides"}]
[34.049999999999997,11,{"$f":"VLOOKUP($B402,Data!$A$2:$C$13,3,0)","v":"Ray"},{"$f":"VLOOKUP($B402,Data!$A$2:$C$13,2,0)","v":"South Indy Thugs"},729,{"$f":"IF(ISNA(VLOOKUP($E402,Data!$A$16:$B$1902,2,0)),\"\",VLOOKUP($E402,Data!$A$16:$B$1902,2,0))","v":"Hernandez, Gorkys"}]
[34.06,1,{"$f":"VLOOKUP($B403,Data!$A$2:$C$13,3,0)","v":"Jeremy"},{"$f":"VLOOKUP($B403,Data!$A$2:$C$13,2,0)","v":"Uninspired"},717,{"$f":"IF(ISNA(VLOOKUP($E403,Data!$A$16:$B$1902,2,0)),\"\",VLOOKUP($E403,Data!$A$16:$B$1902,2,0))","v":"Jackson, Brett"}]
[34.07,9,{"$f":"VLOOKUP($B404,Data!$A$2:$C$13,3,0)","v":"Ryan"},{"$f":"VLOOKUP($B404,Data!$A$2:$C$13,2,0)","v":"Ryan's Team"},1304,{"$f":"IF(ISNA(VLOOKUP($E404,Data!$A$16:$B$1902,2,0)),\"\",VLOOKUP($E404,Data!$A$16:$B$1902,2,0))","v":"Schlereth, Daniel"}]
[34.08,4,{"$f":"VLOOKUP($B405,Data!$A$2:$C$13,3,0)","v":"Tim & Jeremy(?) (drafted by Will/Ray)"},{"$f":"VLOOKUP($B405,Data!$A$2:$C$13,2,0)","v":"Romeo Warriors(?)"},1114,{"$f":"IF(ISNA(VLOOKUP($E405,Data!$A$16:$B$1902,2,0)),\"\",VLOOKUP($E405,Data!$A$16:$B$1902,2,0))","v":"Carrasco, Carlos"}]
[34.090000000000003,10,{"$f":"VLOOKUP($B406,Data!$A$2:$C$13,3,0)","v":"Bill"},{"$f":"VLOOKUP($B406,Data!$A$2:$C$13,2,0)","v":"Reggae Rebels"},554,{"$f":"IF(ISNA(VLOOKUP($E406,Data!$A$16:$B$1902,2,0)),\"\",VLOOKUP($E406,Data!$A$16:$B$1902,2,0))","v":"Dominguez, Matthew"}]
[34.1,12,{"$f":"VLOOKUP($B407,Data!$A$2:$C$13,3,0)","v":"Mark"},{"$f":"VLOOKUP($B407,Data!$A$2:$C$13,2,0)","v":"W&S Life Insurers"},738,{"$f":"IF(ISNA(VLOOKUP($E407,Data!$A$16:$B$1902,2,0)),\"\",VLOOKUP($E407,Data!$A$16:$B$1902,2,0))","v":"Tate, Donavan"}]
[34.11,8,{"$f":"VLOOKUP($B408,Data!$A$2:$C$13,3,0)","v":"Duke & Josh"},{"$f":"VLOOKUP($B408,Data!$A$2:$C$13,2,0)","v":"Austin Ackbars"},436,{"$f":"IF(ISNA(VLOOKUP($E408,Data!$A$16:$B$1902,2,0)),\"\",VLOOKUP($E408,Data!$A$16:$B$1902,2,0))","v":"Joseph, Thomas"}]
[34.119999999999997,7,{"$f":"VLOOKUP($B409,Data!$A$2:$C$13,3,0)","v":"Jess & Tim"},{"$f":"VLOOKUP($B409,Data!$A$2:$C$13,2,0)","v":"Resistance is Futile"},742,{"$f":"IF(ISNA(VLOOKUP($E409,Data!$A$16:$B$1902,2,0)),\"\",VLOOKUP($E409,Data!$A$16:$B$1902,2,0))","v":"Wheeler, Tim"}]
[35.01,6,{"$f":"VLOOKUP($B410,Data!$A$2:$C$13,3,0)","v":"Kevin"},{"$f":"VLOOKUP($B410,Data!$A$2:$C$13,2,0)","v":"The Luddites"},743,{"$f":"IF(ISNA(VLOOKUP($E410,Data!$A$16:$B$1902,2,0)),\"\",VLOOKUP($E410,Data!$A$16:$B$1902,2,0))","v":"Stanton(Flo), Michael"}]
[35.020000000000003,5,{"$f":"VLOOKUP($B411,Data!$A$2:$C$13,3,0)","v":"Chris"},{"$f":"VLOOKUP($B411,Data!$A$2:$C$13,2,0)","v":"Memories of Mom"},1505,{"$f":"IF(ISNA(VLOOKUP($E411,Data!$A$16:$B$1902,2,0)),\"\",VLOOKUP($E411,Data!$A$16:$B$1902,2,0))","v":"Wallace, Brett"}]
[35.03,2,{"$f":"VLOOKUP($B412,Data!$A$2:$C$13,3,0)","v":"Casey"},{"$f":"VLOOKUP($B412,Data!$A$2:$C$13,2,0)","v":"Tulsa Drillers"},1152,{"$f":"IF(ISNA(VLOOKUP($E412,Data!$A$16:$B$1902,2,0)),\"\",VLOOKUP($E412,Data!$A$16:$B$1902,2,0))","v":"Patton, Troy"}]
[35.04,8,{"$f":"VLOOKUP($B413,Data!$A$2:$C$13,3,0)","v":"Duke & Josh"},{"$f":"VLOOKUP($B413,Data!$A$2:$C$13,2,0)","v":"Austin Ackbars"},175,{"$f":"IF(ISNA(VLOOKUP($E413,Data!$A$16:$B$1902,2,0)),\"\",VLOOKUP($E413,Data!$A$16:$B$1902,2,0))","v":"Vizcaino, Arodys"},"Traded from Ray on 5.29.09 (with Br.Ryan for A.Beltre)"]
[35.049999999999997,3,{"$f":"VLOOKUP($B414,Data!$A$2:$C$13,3,0)","v":"Andy"},{"$f":"VLOOKUP($B414,Data!$A$2:$C$13,2,0)","v":"Cripplers"},686,{"$f":"IF(ISNA(VLOOKUP($E414,Data!$A$16:$B$1902,2,0)),\"\",VLOOKUP($E414,Data!$A$16:$B$1902,2,0))","v":"Martinez, Fernando(Jesus)"}]
[35.06,1,{"$f":"VLOOKUP($B415,Data!$A$2:$C$13,3,0)","v":"Jeremy"},{"$f":"VLOOKUP($B415,Data!$A$2:$C$13,2,0)","v":"Uninspired"},719,{"$f":"IF(ISNA(VLOOKUP($E415,Data!$A$16:$B$1902,2,0)),\"\",VLOOKUP($E415,Data!$A$16:$B$1902,2,0))","v":"Heisey, Chris"}]
[35.07,9,{"$f":"VLOOKUP($B416,Data!$A$2:$C$13,3,0)","v":"Ryan"},{"$f":"VLOOKUP($B416,Data!$A$2:$C$13,2,0)","v":"Ryan's Team"},1670,{"$f":"IF(ISNA(VLOOKUP($E416,Data!$A$16:$B$1902,2,0)),\"\",VLOOKUP($E416,Data!$A$16:$B$1902,2,0))","v":"Taylor, Michael"}]
[35.08,4,{"$f":"VLOOKUP($B417,Data!$A$2:$C$13,3,0)","v":"Tim & Jeremy(?) (drafted by Will/Ray)"},{"$f":"VLOOKUP($B417,Data!$A$2:$C$13,2,0)","v":"Romeo Warriors(?)"},1552,{"$f":"IF(ISNA(VLOOKUP($E417,Data!$A$16:$B$1902,2,0)),\"\",VLOOKUP($E417,Data!$A$16:$B$1902,2,0))","v":"Cardenas, Adrian"}]
[35.090000000000003,10,{"$f":"VLOOKUP($B418,Data!$A$2:$C$13,3,0)","v":"Bill"},{"$f":"VLOOKUP($B418,Data!$A$2:$C$13,2,0)","v":"Reggae Rebels"},715,{"$f":"IF(ISNA(VLOOKUP($E418,Data!$A$16:$B$1902,2,0)),\"\",VLOOKUP($E418,Data!$A$16:$B$1902,2,0))","v":"Heyward, Jason"}]
[35.1,12,{"$f":"VLOOKUP($B419,Data!$A$2:$C$13,3,0)","v":"Mark"},{"$f":"VLOOKUP($B419,Data!$A$2:$C$13,2,0)","v":"W&S Life Insurers"},1186,{"$f":"IF(ISNA(VLOOKUP($E419,Data!$A$16:$B$1902,2,0)),\"\",VLOOKUP($E419,Data!$A$16:$B$1902,2,0))","v":"Crow, Aaron"}]
[35.11,8,{"$f":"VLOOKUP($B420,Data!$A$2:$C$13,3,0)","v":"Duke & Josh"},{"$f":"VLOOKUP($B420,Data!$A$2:$C$13,2,0)","v":"Austin Ackbars"},721,{"$f":"IF(ISNA(VLOOKUP($E420,Data!$A$16:$B$1902,2,0)),\"\",VLOOKUP($E420,Data!$A$16:$B$1902,2,0))","v":"Lambo, Andrew"}]
[35.119999999999997,7,{"$f":"VLOOKUP($B421,Data!$A$2:$C$13,3,0)","v":"Jess & Tim"},{"$f":"VLOOKUP($B421,Data!$A$2:$C$13,2,0)","v":"Resistance is Futile"},1367,{"$f":"IF(ISNA(VLOOKUP($E421,Data!$A$16:$B$1902,2,0)),\"\",VLOOKUP($E421,Data!$A$16:$B$1902,2,0))","v":"Marson, Lou"}]
[36,6,{"$f":"VLOOKUP($B422,Data!$A$2:$C$13,3,0)","v":"Kevin"},{"$f":"VLOOKUP($B422,Data!$A$2:$C$13,2,0)","v":"The Luddites"},null,{"$f":"IF(E422=\"\",\"\",VLOOKUP(E422,Data!$A$16:$B$2773,2,0))","v":""},"1st supplemental - First full week of May (tentative)"]
[36,7,{"$f":"VLOOKUP($B423,Data!$A$2:$C$13,3,0)","v":"Jess & Tim"},{"$f":"VLOOKUP($B423,Data!$A$2:$C$13,2,0)","v":"Resistance is Futile"},null,{"$f":"IF(E423=\"\",\"\",VLOOKUP(E423,Data!$A$16:$B$2773,2,0))","v":""},"Traded from Chris on 5.27.09 (with N.Johnson, R.Madson, & 13.02 for 17.12 & 21.12)"]
[36,2,{"$f":"VLOOKUP($B424,Data!$A$2:$C$13,3,0)","v":"Casey"},{"$f":"VLOOKUP($B424,Data!$A$2:$C$13,2,0)","v":"Tulsa Drillers"},null,{"$f":"IF(E424=\"\",\"\",VLOOKUP(E424,Data!$A$16:$B$2773,2,0))","v":""}]
[36,3,{"$f":"VLOOKUP($B425,Data!$A$2:$C$13,3,0)","v":"Andy"},{"$f":"VLOOKUP($B425,Data!$A$2:$C$13,2,0)","v":"Cripplers"},null,{"$f":"IF(E425=\"\",\"\",VLOOKUP(E425,Data!$A$16:$B$2773,2,0))","v":""}]
[36,11,{"$f":"VLOOKUP($B426,Data!$A$2:$C$13,3,0)","v":"Ray"},{"$f":"VLOOKUP($B426,Data!$A$2:$C$13,2,0)","v":"South Indy Thugs"},null,{"$f":"IF(E426=\"\",\"\",VLOOKUP(E426,Data!$A$16:$B$2773,2,0))","v":""}]
[36,1,{"$f":"VLOOKUP($B427,Data!$A$2:$C$13,3,0)","v":"Jeremy"},{"$f":"VLOOKUP($B427,Data!$A$2:$C$13,2,0)","v":"Uninspired"},null,{"$f":"IF(E427=\"\",\"\",VLOOKUP(E427,Data!$A$16:$B$2773,2,0))","v":""}]
[36,9,{"$f":"VLOOKUP($B428,Data!$A$2:$C$13,3,0)","v":"Ryan"},{"$f":"VLOOKUP($B428,Data!$A$2:$C$13,2,0)","v":"Ryan's Team"},null,{"$f":"IF(E428=\"\",\"\",VLOOKUP(E428,Data!$A$16:$B$2773,2,0))","v":""}]
[36,4,{"$f":"VLOOKUP($B429,Data!$A$2:$C$13,3,0)","v":"Tim & Jeremy(?) (drafted by Will/Ray)"},{"$f":"VLOOKUP($B429,Data!$A$2:$C$13,2,0)","v":"Romeo Warriors(?)"},null,{"$f":"IF(E429=\"\",\"\",VLOOKUP(E429,Data!$A$16:$B$2773,2,0))","v":""}]
[36,10,{"$f":"VLOOKUP($B430,Data!$A$2:$C$13,3,0)","v":"Bill"},{"$f":"VLOOKUP($B430,Data!$A$2:$C$13,2,0)","v":"Reggae Rebels"},null,{"$f":"IF(E430=\"\",\"\",VLOOKUP(E430,Data!$A$16:$B$2773,2,0))","v":""}]
[36,12,{"$f":"VLOOKUP($B431,Data!$A$2:$C$13,3,0)","v":"Mark"},{"$f":"VLOOKUP($B431,Data!$A$2:$C$13,2,0)","v":"W&S Life Insurers"},null,{"$f":"IF(E431=\"\",\"\",VLOOKUP(E431,Data!$A$16:$B$2773,2,0))","v":""}]
[36,8,{"$f":"VLOOKUP($B432,Data!$A$2:$C$13,3,0)","v":"Duke & Josh"},{"$f":"VLOOKUP($B432,Data!$A$2:$C$13,2,0)","v":"Austin Ackbars"},null,{"$f":"IF(E432=\"\",\"\",VLOOKUP(E432,Data!$A$16:$B$2773,2,0))","v":""}]
[36,7,{"$f":"VLOOKUP($B433,Data!$A$2:$C$13,3,0)","v":"Jess & Tim"},{"$f":"VLOOKUP($B433,Data!$A$2:$C$13,2,0)","v":"Resistance is Futile"},null,{"$f":"IF(E433=\"\",\"\",VLOOKUP(E433,Data!$A$16:$B$2773,2,0))","v":""}]
[37,7,{"$f":"VLOOKUP($B434,Data!$A$2:$C$13,3,0)","v":"Jess & Tim"},{"$f":"VLOOKUP($B434,Data!$A$2:$C$13,2,0)","v":"Resistance is Futile"},null,{"$f":"IF(E434=\"\",\"\",VLOOKUP(E434,Data!$A$16:$B$2773,2,0))","v":""}]
[37,8,{"$f":"VLOOKUP($B435,Data!$A$2:$C$13,3,0)","v":"Duke & Josh"},{"$f":"VLOOKUP($B435,Data!$A$2:$C$13,2,0)","v":"Austin Ackbars"},null,{"$f":"IF(E435=\"\",\"\",VLOOKUP(E435,Data!$A$16:$B$2773,2,0))","v":""}]
[37,12,{"$f":"VLOOKUP($B436,Data!$A$2:$C$13,3,0)","v":"Mark"},{"$f":"VLOOKUP($B436,Data!$A$2:$C$13,2,0)","v":"W&S Life Insurers"},null,{"$f":"IF(E436=\"\",\"\",VLOOKUP(E436,Data!$A$16:$B$2773,2,0))","v":""}]
[37,10,{"$f":"VLOOKUP($B437,Data!$A$2:$C$13,3,0)","v":"Bill"},{"$f":"VLOOKUP($B437,Data!$A$2:$C$13,2,0)","v":"Reggae Rebels"},null,{"$f":"IF(E437=\"\",\"\",VLOOKUP(E437,Data!$A$16:$B$2773,2,0))","v":""}]
[37,4,{"$f":"VLOOKUP($B438,Data!$A$2:$C$13,3,0)","v":"Tim & Jeremy(?) (drafted by Will/Ray)"},{"$f":"VLOOKUP($B438,Data!$A$2:$C$13,2,0)","v":"Romeo Warriors(?)"},null,{"$f":"IF(E438=\"\",\"\",VLOOKUP(E438,Data!$A$16:$B$2773,2,0))","v":""}]
[37,9,{"$f":"VLOOKUP($B439,Data!$A$2:$C$13,3,0)","v":"Ryan"},{"$f":"VLOOKUP($B439,Data!$A$2:$C$13,2,0)","v":"Ryan's Team"},null,{"$f":"IF(E439=\"\",\"\",VLOOKUP(E439,Data!$A$16:$B$2773,2,0))","v":""}]
[37,1,{"$f":"VLOOKUP($B440,Data!$A$2:$C$13,3,0)","v":"Jeremy"},{"$f":"VLOOKUP($B440,Data!$A$2:$C$13,2,0)","v":"Uninspired"},null,{"$f":"IF(E440=\"\",\"\",VLOOKUP(E440,Data!$A$16:$B$2773,2,0))","v":""}]
[37,11,{"$f":"VLOOKUP($B441,Data!$A$2:$C$13,3,0)","v":"Ray"},{"$f":"VLOOKUP($B441,Data!$A$2:$C$13,2,0)","v":"South Indy Thugs"},null,{"$f":"IF(E441=\"\",\"\",VLOOKUP(E441,Data!$A$16:$B$2773,2,0))","v":""}]
[37,3,{"$f":"VLOOKUP($B442,Data!$A$2:$C$13,3,0)","v":"Andy"},{"$f":"VLOOKUP($B442,Data!$A$2:$C$13,2,0)","v":"Cripplers"},null,{"$f":"IF(E442=\"\",\"\",VLOOKUP(E442,Data!$A$16:$B$2773,2,0))","v":""}]
[37,2,{"$f":"VLOOKUP($B443,Data!$A$2:$C$13,3,0)","v":"Casey"},{"$f":"VLOOKUP($B443,Data!$A$2:$C$13,2,0)","v":"Tulsa Drillers"},null,{"$f":"IF(E443=\"\",\"\",VLOOKUP(E443,Data!$A$16:$B$2773,2,0))","v":""}]
[37,10,{"$f":"VLOOKUP($B444,Data!$A$2:$C$13,3,0)","v":"Bill"},{"$f":"VLOOKUP($B444,Data!$A$2:$C$13,2,0)","v":"Reggae Rebels"},null,{"$f":"IF(E444=\"\",\"\",VLOOKUP(E444,Data!$A$16:$B$2773,2,0))","v":""},"Traded from Chris on 3.28.10 with 42.00 for 28.09"]
[37,6,{"$f":"VLOOKUP($B445,Data!$A$2:$C$13,3,0)","v":"Kevin"},{"$f":"VLOOKUP($B445,Data!$A$2:$C$13,2,0)","v":"The Luddites"},null,{"$f":"IF(E445=\"\",\"\",VLOOKUP(E445,Data!$A$16:$B$2773,2,0))","v":""}]
[38,6,{"$f":"VLOOKUP($B446,Data!$A$2:$C$13,3,0)","v":"Kevin"},{"$f":"VLOOKUP($B446,Data!$A$2:$C$13,2,0)","v":"The Luddites"},null,{"$f":"IF(E446=\"\",\"\",VLOOKUP(E446,Data!$A$16:$B$2773,2,0))","v":""}]
[38,5,{"$f":"VLOOKUP($B447,Data!$A$2:$C$13,3,0)","v":"Chris"},{"$f":"VLOOKUP($B447,Data!$A$2:$C$13,2,0)","v":"Memories of Mom"},null,{"$f":"IF(E447=\"\",\"\",VLOOKUP(E447,Data!$A$16:$B$2773,2,0))","v":""}]
[38,2,{"$f":"VLOOKUP($B448,Data!$A$2:$C$13,3,0)","v":"Casey"},{"$f":"VLOOKUP($B448,Data!$A$2:$C$13,2,0)","v":"Tulsa Drillers"},null,{"$f":"IF(E448=\"\",\"\",VLOOKUP(E448,Data!$A$16:$B$2773,2,0))","v":""}]
[38,3,{"$f":"VLOOKUP($B449,Data!$A$2:$C$13,3,0)","v":"Andy"},{"$f":"VLOOKUP($B449,Data!$A$2:$C$13,2,0)","v":"Cripplers"},null,{"$f":"IF(E449=\"\",\"\",VLOOKUP(E449,Data!$A$16:$B$2773,2,0))","v":""}]
[38,11,{"$f":"VLOOKUP($B450,Data!$A$2:$C$13,3,0)","v":"Ray"},{"$f":"VLOOKUP($B450,Data!$A$2:$C$13,2,0)","v":"South Indy Thugs"},null,{"$f":"IF(E450=\"\",\"\",VLOOKUP(E450,Data!$A$16:$B$2773,2,0))","v":""}]
[38,1,{"$f":"VLOOKUP($B451,Data!$A$2:$C$13,3,0)","v":"Jeremy"},{"$f":"VLOOKUP($B451,Data!$A$2:$C$13,2,0)","v":"Uninspired"},null,{"$f":"IF(E451=\"\",\"\",VLOOKUP(E451,Data!$A$16:$B$2773,2,0))","v":""}]
[38,9,{"$f":"VLOOKUP($B452,Data!$A$2:$C$13,3,0)","v":"Ryan"},{"$f":"VLOOKUP($B452,Data!$A$2:$C$13,2,0)","v":"Ryan's Team"},null,{"$f":"IF(E452=\"\",\"\",VLOOKUP(E452,Data!$A$16:$B$2773,2,0))","v":""}]
[38,4,{"$f":"VLOOKUP($B453,Data!$A$2:$C$13,3,0)","v":"Tim & Jeremy(?) (drafted by Will/Ray)"},{"$f":"VLOOKUP($B453,Data!$A$2:$C$13,2,0)","v":"Romeo Warriors(?)"},null,{"$f":"IF(E453=\"\",\"\",VLOOKUP(E453,Data!$A$16:$B$2773,2,0))","v":""}]
[38,10,{"$f":"VLOOKUP($B454,Data!$A$2:$C$13,3,0)","v":"Bill"},{"$f":"VLOOKUP($B454,Data!$A$2:$C$13,2,0)","v":"Reggae Rebels"},null,{"$f":"IF(E454=\"\",\"\",VLOOKUP(E454,Data!$A$16:$B$2773,2,0))","v":""}]
[38,12,{"$f":"VLOOKUP($B455,Data!$A$2:$C$13,3,0)","v":"Mark"},{"$f":"VLOOKUP($B455,Data!$A$2:$C$13,2,0)","v":"W&S Life Insurers"},null,{"$f":"IF(E455=\"\",\"\",VLOOKUP(E455,Data!$A$16:$B$2773,2,0))","v":""}]
[38,6,{"$f":"VLOOKUP($B456,Data!$A$2:$C$13,3,0)","v":"Kevin"},{"$f":"VLOOKUP($B456,Data!$A$2:$C$13,2,0)","v":"The Luddites"},null,{"$f":"IF(E456=\"\",\"\",VLOOKUP(E456,Data!$A$16:$B$2773,2,0))","v":""},"Traded from D&J on 3.28.10 with 39.00, 42.00, & 43.00 for 25.01, 26.01, & 27.01"]
[38,7,{"$f":"VLOOKUP($B457,Data!$A$2:$C$13,3,0)","v":"Jess & Tim"},{"$f":"VLOOKUP($B457,Data!$A$2:$C$13,2,0)","v":"Resistance is Futile"},null,{"$f":"IF(E457=\"\",\"\",VLOOKUP(E457,Data!$A$16:$B$2773,2,0))","v":""}]
[39,7,{"$f":"VLOOKUP($B458,Data!$A$2:$C$13,3,0)","v":"Jess & Tim"},{"$f":"VLOOKUP($B458,Data!$A$2:$C$13,2,0)","v":"Resistance is Futile"},null,{"$f":"IF(E458=\"\",\"\",VLOOKUP(E458,Data!$A$16:$B$2773,2,0))","v":""}]
[39,6,{"$f":"VLOOKUP($B459,Data!$A$2:$C$13,3,0)","v":"Kevin"},{"$f":"VLOOKUP($B459,Data!$A$2:$C$13,2,0)","v":"The Luddites"},null,{"$f":"IF(E459=\"\",\"\",VLOOKUP(E459,Data!$A$16:$B$2773,2,0))","v":""},"Traded from D&J on 3.28.10 with 38.00, 42.00, & 43.00 for 25.01, 26.01, & 27.01"]
[39,12,{"$f":"VLOOKUP($B460,Data!$A$2:$C$13,3,0)","v":"Mark"},{"$f":"VLOOKUP($B460,Data!$A$2:$C$13,2,0)","v":"W&S Life Insurers"},null,{"$f":"IF(E460=\"\",\"\",VLOOKUP(E460,Data!$A$16:$B$2773,2,0))","v":""}]
[39,10,{"$f":"VLOOKUP($B461,Data!$A$2:$C$13,3,0)","v":"Bill"},{"$f":"VLOOKUP($B461,Data!$A$2:$C$13,2,0)","v":"Reggae Rebels"},null,{"$f":"IF(E461=\"\",\"\",VLOOKUP(E461,Data!$A$16:$B$2773,2,0))","v":""}]
[39,4,{"$f":"VLOOKUP($B462,Data!$A$2:$C$13,3,0)","v":"Tim & Jeremy(?) (drafted by Will/Ray)"},{"$f":"VLOOKUP($B462,Data!$A$2:$C$13,2,0)","v":"Romeo Warriors(?)"},null,{"$f":"IF(E462=\"\",\"\",VLOOKUP(E462,Data!$A$16:$B$2773,2,0))","v":""}]
[39,9,{"$f":"VLOOKUP($B463,Data!$A$2:$C$13,3,0)","v":"Ryan"},{"$f":"VLOOKUP($B463,Data!$A$2:$C$13,2,0)","v":"Ryan's Team"},null,{"$f":"IF(E463=\"\",\"\",VLOOKUP(E463,Data!$A$16:$B$2773,2,0))","v":""}]
[39,1,{"$f":"VLOOKUP($B464,Data!$A$2:$C$13,3,0)","v":"Jeremy"},{"$f":"VLOOKUP($B464,Data!$A$2:$C$13,2,0)","v":"Uninspired"},null,{"$f":"IF(E464=\"\",\"\",VLOOKUP(E464,Data!$A$16:$B$2773,2,0))","v":""}]
[39,11,{"$f":"VLOOKUP($B465,Data!$A$2:$C$13,3,0)","v":"Ray"},{"$f":"VLOOKUP($B465,Data!$A$2:$C$13,2,0)","v":"South Indy Thugs"},null,{"$f":"IF(E465=\"\",\"\",VLOOKUP(E465,Data!$A$16:$B$2773,2,0))","v":""}]
[39,3,{"$f":"VLOOKUP($B466,Data!$A$2:$C$13,3,0)","v":"Andy"},{"$f":"VLOOKUP($B466,Data!$A$2:$C$13,2,0)","v":"Cripplers"},null,{"$f":"IF(E466=\"\",\"\",VLOOKUP(E466,Data!$A$16:$B$2773,2,0))","v":""}]
[39,2,{"$f":"VLOOKUP($B467,Data!$A$2:$C$13,3,0)","v":"Casey"},{"$f":"VLOOKUP($B467,Data!$A$2:$C$13,2,0)","v":"Tulsa Drillers"},null,{"$f":"IF(E467=\"\",\"\",VLOOKUP(E467,Data!$A$16:$B$2773,2,0))","v":""}]
[39,5,{"$f":"VLOOKUP($B468,Data!$A$2:$C$13,3,0)","v":"Chris"},{"$f":"VLOOKUP($B468,Data!$A$2:$C$13,2,0)","v":"Memories of Mom"},null,{"$f":"IF(E468=\"\",\"\",VLOOKUP(E468,Data!$A$16:$B$2773,2,0))","v":""}]
[39,6,{"$f":"VLOOKUP($B469,Data!$A$2:$C$13,3,0)","v":"Kevin"},{"$f":"VLOOKUP($B469,Data!$A$2:$C$13,2,0)","v":"The Luddites"},null,{"$f":"IF(E469=\"\",\"\",VLOOKUP(E469,Data!$A$16:$B$2773,2,0))","v":""}]
[40,1,{"$f":"VLOOKUP($B470,Data!$A$2:$C$13,3,0)","v":"Jeremy"},{"$f":"VLOOKUP($B470,Data!$A$2:$C$13,2,0)","v":"Uninspired"},null,{"$f":"IF(E470=\"\",\"\",VLOOKUP(E470,Data!$A$16:$B$2773,2,0))","v":""},"2nd supplemental - Last week of June (tentative)"]
[41,1,{"$f":"VLOOKUP($B471,Data!$A$2:$C$13,3,0)","v":"Jeremy"},{"$f":"VLOOKUP($B471,Data!$A$2:$C$13,2,0)","v":"Uninspired"},null,{"$f":"IF(E471=\"\",\"\",VLOOKUP(E471,Data!$A$16:$B$2773,2,0))","v":""},"2nd supplemental - Last week of June (tentative)"]
[42,1,{"$f":"VLOOKUP($B472,Data!$A$2:$C$13,3,0)","v":"Jeremy"},{"$f":"VLOOKUP($B472,Data!$A$2:$C$13,2,0)","v":"Uninspired"},null,{"$f":"IF(E472=\"\",\"\",VLOOKUP(E472,Data!$A$16:$B$2773,2,0))","v":""},"2nd supplemental - Last week of June (tentative)"]
[43,1,{"$f":"VLOOKUP($B473,Data!$A$2:$C$13,3,0)","v":"Jeremy"},{"$f":"VLOOKUP($B473,Data!$A$2:$C$13,2,0)","v":"Uninspired"},null,{"$f":"IF(E473=\"\",\"\",VLOOKUP(E473,Data!$A$16:$B$2773,2,0))","v":""},"2nd supplemental - Last week of June (tentative)"]
[40,2,{"$f":"VLOOKUP($B474,Data!$A$2:$C$13,3,0)","v":"Casey"},{"$f":"VLOOKUP($B474,Data!$A$2:$C$13,2,0)","v":"Tulsa Drillers"},null,{"$f":"IF(E474=\"\",\"\",VLOOKUP(E474,Data!$A$16:$B$2773,2,0))","v":""},"2nd supplemental - Last week of June (tentative)"]
[41,2,{"$f":"VLOOKUP($B475,Data!$A$2:$C$13,3,0)","v":"Casey"},{"$f":"VLOOKUP($B475,Data!$A$2:$C$13,2,0)","v":"Tulsa Drillers"},null,{"$f":"IF(E475=\"\",\"\",VLOOKUP(E475,Data!$A$16:$B$2773,2,0))","v":""},"2nd supplemental - Last week of June (tentative)"]
[42,2,{"$f":"VLOOKUP($B476,Data!$A$2:$C$13,3,0)","v":"Casey"},{"$f":"VLOOKUP($B476,Data!$A$2:$C$13,2,0)","v":"Tulsa Drillers"},null,{"$f":"IF(E476=\"\",\"\",VLOOKUP(E476,Data!$A$16:$B$2773,2,0))","v":""},"2nd supplemental - Last week of June (tentative)"]
[43,2,{"$f":"VLOOKUP($B477,Data!$A$2:$C$13,3,0)","v":"Casey"},{"$f":"VLOOKUP($B477,Data!$A$2:$C$13,2,0)","v":"Tulsa Drillers"},null,{"$f":"IF(E477=\"\",\"\",VLOOKUP(E477,Data!$A$16:$B$2773,2,0))","v":""},"2nd supplemental - Last week of June (tentative)"]
[40,3,{"$f":"VLOOKUP($B478,Data!$A$2:$C$13,3,0)","v":"Andy"},{"$f":"VLOOKUP($B478,Data!$A$2:$C$13,2,0)","v":"Cripplers"},null,{"$f":"IF(E478=\"\",\"\",VLOOKUP(E478,Data!$A$16:$B$2773,2,0))","v":""},"2nd supplemental - Last week of June (tentative)"]
[41,3,{"$f":"VLOOKUP($B479,Data!$A$2:$C$13,3,0)","v":"Andy"},{"$f":"VLOOKUP($B479,Data!$A$2:$C$13,2,0)","v":"Cripplers"},null,{"$f":"IF(E479=\"\",\"\",VLOOKUP(E479,Data!$A$16:$B$2773,2,0))","v":""},"2nd supplemental - Last week of June (tentative)"]
[42,3,{"$f":"VLOOKUP($B480,Data!$A$2:$C$13,3,0)","v":"Andy"},{"$f":"VLOOKUP($B480,Data!$A$2:$C$13,2,0)","v":"Cripplers"},null,{"$f":"IF(E480=\"\",\"\",VLOOKUP(E480,Data!$A$16:$B$2773,2,0))","v":""},"2nd supplemental - Last week of June (tentative)"]
[43,3,{"$f":"VLOOKUP($B481,Data!$A$2:$C$13,3,0)","v":"Andy"},{"$f":"VLOOKUP($B481,Data!$A$2:$C$13,2,0)","v":"Cripplers"},null,{"$f":"IF(E481=\"\",\"\",VLOOKUP(E481,Data!$A$16:$B$2773,2,0))","v":""},"2nd supplemental - Last week of June (tentative)"]
[40,4,{"$f":"VLOOKUP($B482,Data!$A$2:$C$13,3,0)","v":"Tim & Jeremy(?) (drafted by Will/Ray)"},{"$f":"VLOOKUP($B482,Data!$A$2:$C$13,2,0)","v":"Romeo Warriors(?)"},null,{"$f":"IF(E482=\"\",\"\",VLOOKUP(E482,Data!$A$16:$B$2773,2,0))","v":""},"2nd supplemental - Last week of June (tentative)"]
[41,4,{"$f":"VLOOKUP($B483,Data!$A$2:$C$13,3,0)","v":"Tim & Jeremy(?) (drafted by Will/Ray)"},{"$f":"VLOOKUP($B483,Data!$A$2:$C$13,2,0)","v":"Romeo Warriors(?)"},null,{"$f":"IF(E483=\"\",\"\",VLOOKUP(E483,Data!$A$16:$B$2773,2,0))","v":""},"2nd supplemental - Last week of June (tentative)"]
[42,4,{"$f":"VLOOKUP($B484,Data!$A$2:$C$13,3,0)","v":"Tim & Jeremy(?) (drafted by Will/Ray)"},{"$f":"VLOOKUP($B484,Data!$A$2:$C$13,2,0)","v":"Romeo Warriors(?)"},null,{"$f":"IF(E484=\"\",\"\",VLOOKUP(E484,Data!$A$16:$B$2773,2,0))","v":""},"2nd supplemental - Last week of June (tentative)"]
[43,4,{"$f":"VLOOKUP($B485,Data!$A$2:$C$13,3,0)","v":"Tim & Jeremy(?) (drafted by Will/Ray)"},{"$f":"VLOOKUP($B485,Data!$A$2:$C$13,2,0)","v":"Romeo Warriors(?)"},null,{"$f":"IF(E485=\"\",\"\",VLOOKUP(E485,Data!$A$16:$B$2773,2,0))","v":""},"2nd supplemental - Last week of June (tentative)"]
[41,5,{"$f":"VLOOKUP($B486,Data!$A$2:$C$13,3,0)","v":"Chris"},{"$f":"VLOOKUP($B486,Data!$A$2:$C$13,2,0)","v":"Memories of Mom"},null,{"$f":"IF(E486=\"\",\"\",VLOOKUP(E486,Data!$A$16:$B$2773,2,0))","v":""},"2nd supplemental - Last week of June (tentative)"]
[43,5,{"$f":"VLOOKUP($B487,Data!$A$2:$C$13,3,0)","v":"Chris"},{"$f":"VLOOKUP($B487,Data!$A$2:$C$13,2,0)","v":"Memories of Mom"},null,{"$f":"IF(E487=\"\",\"\",VLOOKUP(E487,Data!$A$16:$B$2773,2,0))","v":""},"2nd supplemental - Last week of June (tentative)"]
[40,6,{"$f":"VLOOKUP($B488,Data!$A$2:$C$13,3,0)","v":"Kevin"},{"$f":"VLOOKUP($B488,Data!$A$2:$C$13,2,0)","v":"The Luddites"},null,{"$f":"IF(E488=\"\",\"\",VLOOKUP(E488,Data!$A$16:$B$2773,2,0))","v":""},"2nd supplemental - Last week of June (tentative)"]
[41,6,{"$f":"VLOOKUP($B489,Data!$A$2:$C$13,3,0)","v":"Kevin"},{"$f":"VLOOKUP($B489,Data!$A$2:$C$13,2,0)","v":"The Luddites"},null,{"$f":"IF(E489=\"\",\"\",VLOOKUP(E489,Data!$A$16:$B$2773,2,0))","v":""},"2nd supplemental - Last week of June (tentative)"]
[42,6,{"$f":"VLOOKUP($B490,Data!$A$2:$C$13,3,0)","v":"Kevin"},{"$f":"VLOOKUP($B490,Data!$A$2:$C$13,2,0)","v":"The Luddites"},null,{"$f":"IF(E490=\"\",\"\",VLOOKUP(E490,Data!$A$16:$B$2773,2,0))","v":""},"2nd supplemental - Last week of June (tentative)"]
[43,6,{"$f":"VLOOKUP($B491,Data!$A$2:$C$13,3,0)","v":"Kevin"},{"$f":"VLOOKUP($B491,Data!$A$2:$C$13,2,0)","v":"The Luddites"},null,{"$f":"IF(E491=\"\",\"\",VLOOKUP(E491,Data!$A$16:$B$2773,2,0))","v":""},"2nd supplemental - Last week of June (tentative)"]
[40,7,{"$f":"VLOOKUP($B492,Data!$A$2:$C$13,3,0)","v":"Jess & Tim"},{"$f":"VLOOKUP($B492,Data!$A$2:$C$13,2,0)","v":"Resistance is Futile"},null,{"$f":"IF(E492=\"\",\"\",VLOOKUP(E492,Data!$A$16:$B$2773,2,0))","v":""},"Traded from Chris on 8.12.09 (with 12.2 & #44-47 in 2009 for T.Alderson & 15.12)"]
[40,7,{"$f":"VLOOKUP($B493,Data!$A$2:$C$13,3,0)","v":"Jess & Tim"},{"$f":"VLOOKUP($B493,Data!$A$2:$C$13,2,0)","v":"Resistance is Futile"},null,{"$f":"IF(E493=\"\",\"\",VLOOKUP(E493,Data!$A$16:$B$2773,2,0))","v":""},"2nd supplemental - Last week of June (tentative)"]
[41,7,{"$f":"VLOOKUP($B494,Data!$A$2:$C$13,3,0)","v":"Jess & Tim"},{"$f":"VLOOKUP($B494,Data!$A$2:$C$13,2,0)","v":"Resistance is Futile"},null,{"$f":"IF(E494=\"\",\"\",VLOOKUP(E494,Data!$A$16:$B$2773,2,0))","v":""},"2nd supplemental - Last week of June (tentative)"]
[42,7,{"$f":"VLOOKUP($B495,Data!$A$2:$C$13,3,0)","v":"Jess & Tim"},{"$f":"VLOOKUP($B495,Data!$A$2:$C$13,2,0)","v":"Resistance is Futile"},null,{"$f":"IF(E495=\"\",\"\",VLOOKUP(E495,Data!$A$16:$B$2773,2,0))","v":""},"2nd supplemental - Last week of June (tentative)"]
[43,7,{"$f":"VLOOKUP($B496,Data!$A$2:$C$13,3,0)","v":"Jess & Tim"},{"$f":"VLOOKUP($B496,Data!$A$2:$C$13,2,0)","v":"Resistance is Futile"},null,{"$f":"IF(E496=\"\",\"\",VLOOKUP(E496,Data!$A$16:$B$2773,2,0))","v":""},"2nd supplemental - Last week of June (tentative)"]
[40,8,{"$f":"VLOOKUP($B497,Data!$A$2:$C$13,3,0)","v":"Duke & Josh"},{"$f":"VLOOKUP($B497,Data!$A$2:$C$13,2,0)","v":"Austin Ackbars"},null,{"$f":"IF(E497=\"\",\"\",VLOOKUP(E497,Data!$A$16:$B$2773,2,0))","v":""},"2nd supplemental - Last week of June (tentative)"]
[41,8,{"$f":"VLOOKUP($B498,Data!$A$2:$C$13,3,0)","v":"Duke & Josh"},{"$f":"VLOOKUP($B498,Data!$A$2:$C$13,2,0)","v":"Austin Ackbars"},null,{"$f":"IF(E498=\"\",\"\",VLOOKUP(E498,Data!$A$16:$B$2773,2,0))","v":""},"2nd supplemental - Last week of June (tentative)"]
[42,8,{"$f":"VLOOKUP($B499,Data!$A$2:$C$13,3,0)","v":"Duke & Josh"},{"$f":"VLOOKUP($B499,Data!$A$2:$C$13,2,0)","v":"Austin Ackbars"},null,{"$f":"IF(E499=\"\",\"\",VLOOKUP(E499,Data!$A$16:$B$2773,2,0))","v":""},"Traded from D&J on 3.28.10 with 38.00, 39.00, & 43.00 for 25.01, 26.01, & 27.01"]
[43,8,{"$f":"VLOOKUP($B500,Data!$A$2:$C$13,3,0)","v":"Duke & Josh"},{"$f":"VLOOKUP($B500,Data!$A$2:$C$13,2,0)","v":"Austin Ackbars"},null,{"$f":"IF(E500=\"\",\"\",VLOOKUP(E500,Data!$A$16:$B$2773,2,0))","v":""},"Traded from D&J on 3.28.10 with 38.00, 39.00, & 42.00 for 25.01, 26.01, & 27.01"]
[40,9,{"$f":"VLOOKUP($B501,Data!$A$2:$C$13,3,0)","v":"Ryan"},{"$f":"VLOOKUP($B501,Data!$A$2:$C$13,2,0)","v":"Ryan's Team"},null,{"$f":"IF(E501=\"\",\"\",VLOOKUP(E501,Data!$A$16:$B$2773,2,0))","v":""},"2nd supplemental - Last week of June (tentative)"]
[41,9,{"$f":"VLOOKUP($B502,Data!$A$2:$C$13,3,0)","v":"Ryan"},{"$f":"VLOOKUP($B502,Data!$A$2:$C$13,2,0)","v":"Ryan's Team"},null,{"$f":"IF(E502=\"\",\"\",VLOOKUP(E502,Data!$A$16:$B$2773,2,0))","v":""},"2nd supplemental - Last week of June (tentative)"]
[42,9,{"$f":"VLOOKUP($B503,Data!$A$2:$C$13,3,0)","v":"Ryan"},{"$f":"VLOOKUP($B503,Data!$A$2:$C$13,2,0)","v":"Ryan's Team"},null,{"$f":"IF(E503=\"\",\"\",VLOOKUP(E503,Data!$A$16:$B$2773,2,0))","v":""},"2nd supplemental - Last week of June (tentative)"]
[43,9,{"$f":"VLOOKUP($B504,Data!$A$2:$C$13,3,0)","v":"Ryan"},{"$f":"VLOOKUP($B504,Data!$A$2:$C$13,2,0)","v":"Ryan's Team"},null,{"$f":"IF(E504=\"\",\"\",VLOOKUP(E504,Data!$A$16:$B$2773,2,0))","v":""},"2nd supplemental - Last week of June (tentative)"]
[40,10,{"$f":"VLOOKUP($B505,Data!$A$2:$C$13,3,0)","v":"Bill"},{"$f":"VLOOKUP($B505,Data!$A$2:$C$13,2,0)","v":"Reggae Rebels"},null,{"$f":"IF(E505=\"\",\"\",VLOOKUP(E505,Data!$A$16:$B$2773,2,0))","v":""},"2nd supplemental - Last week of June (tentative)"]
[41,10,{"$f":"VLOOKUP($B506,Data!$A$2:$C$13,3,0)","v":"Bill"},{"$f":"VLOOKUP($B506,Data!$A$2:$C$13,2,0)","v":"Reggae Rebels"},null,{"$f":"IF(E506=\"\",\"\",VLOOKUP(E506,Data!$A$16:$B$2773,2,0))","v":""},"2nd supplemental - Last week of June (tentative)"]
[42,10,{"$f":"VLOOKUP($B507,Data!$A$2:$C$13,3,0)","v":"Bill"},{"$f":"VLOOKUP($B507,Data!$A$2:$C$13,2,0)","v":"Reggae Rebels"},null,{"$f":"IF(E507=\"\",\"\",VLOOKUP(E507,Data!$A$16:$B$2773,2,0))","v":""},"Traded from Chris on 3.28.10 with 37.00 for 28.09"]
[42,10,{"$f":"VLOOKUP($B508,Data!$A$2:$C$13,3,0)","v":"Bill"},{"$f":"VLOOKUP($B508,Data!$A$2:$C$13,2,0)","v":"Reggae Rebels"},null,{"$f":"IF(E508=\"\",\"\",VLOOKUP(E508,Data!$A$16:$B$2773,2,0))","v":""},"2nd supplemental - Last week of June (tentative)"]
[43,10,{"$f":"VLOOKUP($B509,Data!$A$2:$C$13,3,0)","v":"Bill"},{"$f":"VLOOKUP($B509,Data!$A$2:$C$13,2,0)","v":"Reggae Rebels"},null,{"$f":"IF(E509=\"\",\"\",VLOOKUP(E509,Data!$A$16:$B$2773,2,0))","v":""},"2nd supplemental - Last week of June (tentative)"]
[40,11,{"$f":"VLOOKUP($B510,Data!$A$2:$C$13,3,0)","v":"Ray"},{"$f":"VLOOKUP($B510,Data!$A$2:$C$13,2,0)","v":"South Indy Thugs"},null,{"$f":"IF(E510=\"\",\"\",VLOOKUP(E510,Data!$A$16:$B$2773,2,0))","v":""},"2nd supplemental - Last week of June (tentative)"]
[41,11,{"$f":"VLOOKUP($B511,Data!$A$2:$C$13,3,0)","v":"Ray"},{"$f":"VLOOKUP($B511,Data!$A$2:$C$13,2,0)","v":"South Indy Thugs"},null,{"$f":"IF(E511=\"\",\"\",VLOOKUP(E511,Data!$A$16:$B$2773,2,0))","v":""},"2nd supplemental - Last week of June (tentative)"]
[42,11,{"$f":"VLOOKUP($B512,Data!$A$2:$C$13,3,0)","v":"Ray"},{"$f":"VLOOKUP($B512,Data!$A$2:$C$13,2,0)","v":"South Indy Thugs"},null,{"$f":"IF(E512=\"\",\"\",VLOOKUP(E512,Data!$A$16:$B$2773,2,0))","v":""},"2nd supplemental - Last week of June (tentative)"]
[43,11,{"$f":"VLOOKUP($B513,Data!$A$2:$C$13,3,0)","v":"Ray"},{"$f":"VLOOKUP($B513,Data!$A$2:$C$13,2,0)","v":"South Indy Thugs"},null,{"$f":"IF(E513=\"\",\"\",VLOOKUP(E513,Data!$A$16:$B$2773,2,0))","v":""},"2nd supplemental - Last week of June (tentative)"]
[40,12,{"$f":"VLOOKUP($B514,Data!$A$2:$C$13,3,0)","v":"Mark"},{"$f":"VLOOKUP($B514,Data!$A$2:$C$13,2,0)","v":"W&S Life Insurers"},null,{"$f":"IF(E514=\"\",\"\",VLOOKUP(E514,Data!$A$16:$B$2773,2,0))","v":""},"2nd supplemental - Last week of June (tentative)"]
[41,12,{"$f":"VLOOKUP($B515,Data!$A$2:$C$13,3,0)","v":"Mark"},{"$f":"VLOOKUP($B515,Data!$A$2:$C$13,2,0)","v":"W&S Life Insurers"},null,{"$f":"IF(E515=\"\",\"\",VLOOKUP(E515,Data!$A$16:$B$2773,2,0))","v":""},"2nd supplemental - Last week of June (tentative)"]
[42,12,{"$f":"VLOOKUP($B516,Data!$A$2:$C$13,3,0)","v":"Mark"},{"$f":"VLOOKUP($B516,Data!$A$2:$C$13,2,0)","v":"W&S Life Insurers"},null,{"$f":"IF(E516=\"\",\"\",VLOOKUP(E516,Data!$A$16:$B$2773,2,0))","v":""},"2nd supplemental - Last week of June (tentative)"]
[43,12,{"$f":"VLOOKUP($B517,Data!$A$2:$C$13,3,0)","v":"Mark"},{"$f":"VLOOKUP($B517,Data!$A$2:$C$13,2,0)","v":"W&S Life Insurers"},null,{"$f":"IF(E517=\"\",\"\",VLOOKUP(E517,Data!$A$16:$B$2773,2,0))","v":""},"2nd supplemental - Last week of June (tentative)"]
[44,1,{"$f":"VLOOKUP($B518,Data!$A$2:$C$13,3,0)","v":"Jeremy"},{"$f":"VLOOKUP($B518,Data!$A$2:$C$13,2,0)","v":"Uninspired"},null,{"$f":"IF(E518=\"\",\"\",VLOOKUP(E518,Data!$A$16:$B$2773,2,0))","v":""},"3rd supplemental - First week of August (tentative)"]
[45,1,{"$f":"VLOOKUP($B519,Data!$A$2:$C$13,3,0)","v":"Jeremy"},{"$f":"VLOOKUP($B519,Data!$A$2:$C$13,2,0)","v":"Uninspired"},null,{"$f":"IF(E519=\"\",\"\",VLOOKUP(E519,Data!$A$16:$B$2773,2,0))","v":""},"3rd supplemental - First week of August (tentative)"]
[46,1,{"$f":"VLOOKUP($B520,Data!$A$2:$C$13,3,0)","v":"Jeremy"},{"$f":"VLOOKUP($B520,Data!$A$2:$C$13,2,0)","v":"Uninspired"},null,{"$f":"IF(E520=\"\",\"\",VLOOKUP(E520,Data!$A$16:$B$2773,2,0))","v":""},"3rd supplemental - First week of August (tentative)"]
[47,1,{"$f":"VLOOKUP($B521,Data!$A$2:$C$13,3,0)","v":"Jeremy"},{"$f":"VLOOKUP($B521,Data!$A$2:$C$13,2,0)","v":"Uninspired"},null,{"$f":"IF(E521=\"\",\"\",VLOOKUP(E521,Data!$A$16:$B$2773,2,0))","v":""},"3rd supplemental - First week of August (tentative)"]
[44,2,{"$f":"VLOOKUP($B522,Data!$A$2:$C$13,3,0)","v":"Casey"},{"$f":"VLOOKUP($B522,Data!$A$2:$C$13,2,0)","v":"Tulsa Drillers"},null,{"$f":"IF(E522=\"\",\"\",VLOOKUP(E522,Data!$A$16:$B$2773,2,0))","v":""},"3rd supplemental - First week of August (tentative)"]
[45,2,{"$f":"VLOOKUP($B523,Data!$A$2:$C$13,3,0)","v":"Casey"},{"$f":"VLOOKUP($B523,Data!$A$2:$C$13,2,0)","v":"Tulsa Drillers"},null,{"$f":"IF(E523=\"\",\"\",VLOOKUP(E523,Data!$A$16:$B$2773,2,0))","v":""},"3rd supplemental - First week of August (tentative)"]
[46,2,{"$f":"VLOOKUP($B524,Data!$A$2:$C$13,3,0)","v":"Casey"},{"$f":"VLOOKUP($B524,Data!$A$2:$C$13,2,0)","v":"Tulsa Drillers"},null,{"$f":"IF(E524=\"\",\"\",VLOOKUP(E524,Data!$A$16:$B$2773,2,0))","v":""},"3rd supplemental - First week of August (tentative)"]
[47,2,{"$f":"VLOOKUP($B525,Data!$A$2:$C$13,3,0)","v":"Casey"},{"$f":"VLOOKUP($B525,Data!$A$2:$C$13,2,0)","v":"Tulsa Drillers"},null,{"$f":"IF(E525=\"\",\"\",VLOOKUP(E525,Data!$A$16:$B$2773,2,0))","v":""},"3rd supplemental - First week of August (tentative)"]
[44,3,{"$f":"VLOOKUP($B526,Data!$A$2:$C$13,3,0)","v":"Andy"},{"$f":"VLOOKUP($B526,Data!$A$2:$C$13,2,0)","v":"Cripplers"},null,{"$f":"IF(E526=\"\",\"\",VLOOKUP(E526,Data!$A$16:$B$2773,2,0))","v":""},"3rd supplemental - First week of August (tentative)"]
[45,3,{"$f":"VLOOKUP($B527,Data!$A$2:$C$13,3,0)","v":"Andy"},{"$f":"VLOOKUP($B527,Data!$A$2:$C$13,2,0)","v":"Cripplers"},null,{"$f":"IF(E527=\"\",\"\",VLOOKUP(E527,Data!$A$16:$B$2773,2,0))","v":""},"3rd supplemental - First week of August (tentative)"]
[46,3,{"$f":"VLOOKUP($B528,Data!$A$2:$C$13,3,0)","v":"Andy"},{"$f":"VLOOKUP($B528,Data!$A$2:$C$13,2,0)","v":"Cripplers"},null,{"$f":"IF(E528=\"\",\"\",VLOOKUP(E528,Data!$A$16:$B$2773,2,0))","v":""},"3rd supplemental - First week of August (tentative)"]
[47,3,{"$f":"VLOOKUP($B529,Data!$A$2:$C$13,3,0)","v":"Andy"},{"$f":"VLOOKUP($B529,Data!$A$2:$C$13,2,0)","v":"Cripplers"},null,{"$f":"IF(E529=\"\",\"\",VLOOKUP(E529,Data!$A$16:$B$2773,2,0))","v":""},"3rd supplemental - First week of August (tentative)"]
[44,4,{"$f":"VLOOKUP($B530,Data!$A$2:$C$13,3,0)","v":"Tim & Jeremy(?) (drafted by Will/Ray)"},{"$f":"VLOOKUP($B530,Data!$A$2:$C$13,2,0)","v":"Romeo Warriors(?)"},null,{"$f":"IF(E530=\"\",\"\",VLOOKUP(E530,Data!$A$16:$B$2773,2,0))","v":""},"3rd supplemental - First week of August (tentative)"]
[45,4,{"$f":"VLOOKUP($B531,Data!$A$2:$C$13,3,0)","v":"Tim & Jeremy(?) (drafted by Will/Ray)"},{"$f":"VLOOKUP($B531,Data!$A$2:$C$13,2,0)","v":"Romeo Warriors(?)"},null,{"$f":"IF(E531=\"\",\"\",VLOOKUP(E531,Data!$A$16:$B$2773,2,0))","v":""},"3rd supplemental - First week of August (tentative)"]
[46,4,{"$f":"VLOOKUP($B532,Data!$A$2:$C$13,3,0)","v":"Tim & Jeremy(?) (drafted by Will/Ray)"},{"$f":"VLOOKUP($B532,Data!$A$2:$C$13,2,0)","v":"Romeo Warriors(?)"},null,{"$f":"IF(E532=\"\",\"\",VLOOKUP(E532,Data!$A$16:$B$2773,2,0))","v":""},"3rd supplemental - First week of August (tentative)"]
[47,4,{"$f":"VLOOKUP($B533,Data!$A$2:$C$13,3,0)","v":"Tim & Jeremy(?) (drafted by Will/Ray)"},{"$f":"VLOOKUP($B533,Data!$A$2:$C$13,2,0)","v":"Romeo Warriors(?)"},null,{"$f":"IF(E533=\"\",\"\",VLOOKUP(E533,Data!$A$16:$B$2773,2,0))","v":""},"3rd supplemental - First week of August (tentative)"]
[44,5,{"$f":"VLOOKUP($B534,Data!$A$2:$C$13,3,0)","v":"Chris"},{"$f":"VLOOKUP($B534,Data!$A$2:$C$13,2,0)","v":"Memories of Mom"},null,{"$f":"IF(E534=\"\",\"\",VLOOKUP(E534,Data!$A$16:$B$2773,2,0))","v":""},"3rd supplemental - First week of August (tentative)"]
[45,5,{"$f":"VLOOKUP($B535,Data!$A$2:$C$13,3,0)","v":"Chris"},{"$f":"VLOOKUP($B535,Data!$A$2:$C$13,2,0)","v":"Memories of Mom"},null,{"$f":"IF(E535=\"\",\"\",VLOOKUP(E535,Data!$A$16:$B$2773,2,0))","v":""},"3rd supplemental - First week of August (tentative)"]
[46,5,{"$f":"VLOOKUP($B536,Data!$A$2:$C$13,3,0)","v":"Chris"},{"$f":"VLOOKUP($B536,Data!$A$2:$C$13,2,0)","v":"Memories of Mom"},null,{"$f":"IF(E536=\"\",\"\",VLOOKUP(E536,Data!$A$16:$B$2773,2,0))","v":""},"3rd supplemental - First week of August (tentative)"]
[47,5,{"$f":"VLOOKUP($B537,Data!$A$2:$C$13,3,0)","v":"Chris"},{"$f":"VLOOKUP($B537,Data!$A$2:$C$13,2,0)","v":"Memories of Mom"},null,{"$f":"IF(E537=\"\",\"\",VLOOKUP(E537,Data!$A$16:$B$2773,2,0))","v":""},"3rd supplemental - First week of August (tentative)"]
[44,6,{"$f":"VLOOKUP($B538,Data!$A$2:$C$13,3,0)","v":"Kevin"},{"$f":"VLOOKUP($B538,Data!$A$2:$C$13,2,0)","v":"The Luddites"},null,{"$f":"IF(E538=\"\",\"\",VLOOKUP(E538,Data!$A$16:$B$2773,2,0))","v":""},"3rd supplemental - First week of August (tentative)"]
[45,6,{"$f":"VLOOKUP($B539,Data!$A$2:$C$13,3,0)","v":"Kevin"},{"$f":"VLOOKUP($B539,Data!$A$2:$C$13,2,0)","v":"The Luddites"},null,{"$f":"IF(E539=\"\",\"\",VLOOKUP(E539,Data!$A$16:$B$2773,2,0))","v":""},"3rd supplemental - First week of August (tentative)"]
[46,6,{"$f":"VLOOKUP($B540,Data!$A$2:$C$13,3,0)","v":"Kevin"},{"$f":"VLOOKUP($B540,Data!$A$2:$C$13,2,0)","v":"The Luddites"},null,{"$f":"IF(E540=\"\",\"\",VLOOKUP(E540,Data!$A$16:$B$2773,2,0))","v":""},"3rd supplemental - First week of August (tentative)"]
[47,6,{"$f":"VLOOKUP($B541,Data!$A$2:$C$13,3,0)","v":"Kevin"},{"$f":"VLOOKUP($B541,Data!$A$2:$C$13,2,0)","v":"The Luddites"},null,{"$f":"IF(E541=\"\",\"\",VLOOKUP(E541,Data!$A$16:$B$2773,2,0))","v":""},"3rd supplemental - First week of August (tentative)"]
[44,7,{"$f":"VLOOKUP($B542,Data!$A$2:$C$13,3,0)","v":"Jess & Tim"},{"$f":"VLOOKUP($B542,Data!$A$2:$C$13,2,0)","v":"Resistance is Futile"},null,{"$f":"IF(E542=\"\",\"\",VLOOKUP(E542,Data!$A$16:$B$2773,2,0))","v":""},"3rd supplemental - First week of August (tentative)"]
[45,7,{"$f":"VLOOKUP($B543,Data!$A$2:$C$13,3,0)","v":"Jess & Tim"},{"$f":"VLOOKUP($B543,Data!$A$2:$C$13,2,0)","v":"Resistance is Futile"},null,{"$f":"IF(E543=\"\",\"\",VLOOKUP(E543,Data!$A$16:$B$2773,2,0))","v":""},"3rd supplemental - First week of August (tentative)"]
[46,7,{"$f":"VLOOKUP($B544,Data!$A$2:$C$13,3,0)","v":"Jess & Tim"},{"$f":"VLOOKUP($B544,Data!$A$2:$C$13,2,0)","v":"Resistance is Futile"},null,{"$f":"IF(E544=\"\",\"\",VLOOKUP(E544,Data!$A$16:$B$2773,2,0))","v":""},"3rd supplemental - First week of August (tentative)"]
[47,7,{"$f":"VLOOKUP($B545,Data!$A$2:$C$13,3,0)","v":"Jess & Tim"},{"$f":"VLOOKUP($B545,Data!$A$2:$C$13,2,0)","v":"Resistance is Futile"},null,{"$f":"IF(E545=\"\",\"\",VLOOKUP(E545,Data!$A$16:$B$2773,2,0))","v":""},"3rd supplemental - First week of August (tentative)"]
[44,8,{"$f":"VLOOKUP($B546,Data!$A$2:$C$13,3,0)","v":"Duke & Josh"},{"$f":"VLOOKUP($B546,Data!$A$2:$C$13,2,0)","v":"Austin Ackbars"},null,{"$f":"IF(E546=\"\",\"\",VLOOKUP(E546,Data!$A$16:$B$2773,2,0))","v":""},"3rd supplemental - First week of August (tentative)"]
[45,8,{"$f":"VLOOKUP($B547,Data!$A$2:$C$13,3,0)","v":"Duke & Josh"},{"$f":"VLOOKUP($B547,Data!$A$2:$C$13,2,0)","v":"Austin Ackbars"},null,{"$f":"IF(E547=\"\",\"\",VLOOKUP(E547,Data!$A$16:$B$2773,2,0))","v":""},"3rd supplemental - First week of August (tentative)"]
[46,8,{"$f":"VLOOKUP($B548,Data!$A$2:$C$13,3,0)","v":"Duke & Josh"},{"$f":"VLOOKUP($B548,Data!$A$2:$C$13,2,0)","v":"Austin Ackbars"},null,{"$f":"IF(E548=\"\",\"\",VLOOKUP(E548,Data!$A$16:$B$2773,2,0))","v":""},"3rd supplemental - First week of August (tentative)"]
[47,8,{"$f":"VLOOKUP($B549,Data!$A$2:$C$13,3,0)","v":"Duke & Josh"},{"$f":"VLOOKUP($B549,Data!$A$2:$C$13,2,0)","v":"Austin Ackbars"},null,{"$f":"IF(E549=\"\",\"\",VLOOKUP(E549,Data!$A$16:$B$2773,2,0))","v":""},"3rd supplemental - First week of August (tentative)"]
[44,9,{"$f":"VLOOKUP($B550,Data!$A$2:$C$13,3,0)","v":"Ryan"},{"$f":"VLOOKUP($B550,Data!$A$2:$C$13,2,0)","v":"Ryan's Team"},null,{"$f":"IF(E550=\"\",\"\",VLOOKUP(E550,Data!$A$16:$B$2773,2,0))","v":""},"3rd supplemental - First week of August (tentative)"]
[45,9,{"$f":"VLOOKUP($B551,Data!$A$2:$C$13,3,0)","v":"Ryan"},{"$f":"VLOOKUP($B551,Data!$A$2:$C$13,2,0)","v":"Ryan's Team"},null,{"$f":"IF(E551=\"\",\"\",VLOOKUP(E551,Data!$A$16:$B$2773,2,0))","v":""},"3rd supplemental - First week of August (tentative)"]
[46,9,{"$f":"VLOOKUP($B552,Data!$A$2:$C$13,3,0)","v":"Ryan"},{"$f":"VLOOKUP($B552,Data!$A$2:$C$13,2,0)","v":"Ryan's Team"},null,{"$f":"IF(E552=\"\",\"\",VLOOKUP(E552,Data!$A$16:$B$2773,2,0))","v":""},"3rd supplemental - First week of August (tentative)"]
[47,9,{"$f":"VLOOKUP($B553,Data!$A$2:$C$13,3,0)","v":"Ryan"},{"$f":"VLOOKUP($B553,Data!$A$2:$C$13,2,0)","v":"Ryan's Team"},null,{"$f":"IF(E553=\"\",\"\",VLOOKUP(E553,Data!$A$16:$B$2773,2,0))","v":""},"3rd supplemental - First week of August (tentative)"]
[44,10,{"$f":"VLOOKUP($B554,Data!$A$2:$C$13,3,0)","v":"Bill"},{"$f":"VLOOKUP($B554,Data!$A$2:$C$13,2,0)","v":"Reggae Rebels"},null,{"$f":"IF(E554=\"\",\"\",VLOOKUP(E554,Data!$A$16:$B$2773,2,0))","v":""},"3rd supplemental - First week of August (tentative)"]
[45,10,{"$f":"VLOOKUP($B555,Data!$A$2:$C$13,3,0)","v":"Bill"},{"$f":"VLOOKUP($B555,Data!$A$2:$C$13,2,0)","v":"Reggae Rebels"},null,{"$f":"IF(E555=\"\",\"\",VLOOKUP(E555,Data!$A$16:$B$2773,2,0))","v":""},"3rd supplemental - First week of August (tentative)"]
[46,10,{"$f":"VLOOKUP($B556,Data!$A$2:$C$13,3,0)","v":"Bill"},{"$f":"VLOOKUP($B556,Data!$A$2:$C$13,2,0)","v":"Reggae Rebels"},null,{"$f":"IF(E556=\"\",\"\",VLOOKUP(E556,Data!$A$16:$B$2773,2,0))","v":""},"3rd supplemental - First week of August (tentative)"]
[47,10,{"$f":"VLOOKUP($B557,Data!$A$2:$C$13,3,0)","v":"Bill"},{"$f":"VLOOKUP($B557,Data!$A$2:$C$13,2,0)","v":"Reggae Rebels"},null,{"$f":"IF(E557=\"\",\"\",VLOOKUP(E557,Data!$A$16:$B$2773,2,0))","v":""},"3rd supplemental - First week of August (tentative)"]
[44,11,{"$f":"VLOOKUP($B558,Data!$A$2:$C$13,3,0)","v":"Ray"},{"$f":"VLOOKUP($B558,Data!$A$2:$C$13,2,0)","v":"South Indy Thugs"},null,{"$f":"IF(E558=\"\",\"\",VLOOKUP(E558,Data!$A$16:$B$2773,2,0))","v":""},"3rd supplemental - First week of August (tentative)"]
[45,11,{"$f":"VLOOKUP($B559,Data!$A$2:$C$13,3,0)","v":"Ray"},{"$f":"VLOOKUP($B559,Data!$A$2:$C$13,2,0)","v":"South Indy Thugs"},null,{"$f":"IF(E559=\"\",\"\",VLOOKUP(E559,Data!$A$16:$B$2773,2,0))","v":""},"3rd supplemental - First week of August (tentative)"]
[46,11,{"$f":"VLOOKUP($B560,Data!$A$2:$C$13,3,0)","v":"Ray"},{"$f":"VLOOKUP($B560,Data!$A$2:$C$13,2,0)","v":"South Indy Thugs"},null,{"$f":"IF(E560=\"\",\"\",VLOOKUP(E560,Data!$A$16:$B$2773,2,0))","v":""},"3rd supplemental - First week of August (tentative)"]
[47,11,{"$f":"VLOOKUP($B561,Data!$A$2:$C$13,3,0)","v":"Ray"},{"$f":"VLOOKUP($B561,Data!$A$2:$C$13,2,0)","v":"South Indy Thugs"},null,{"$f":"IF(E561=\"\",\"\",VLOOKUP(E561,Data!$A$16:$B$2773,2,0))","v":""},"3rd supplemental - First week of August (tentative)"]
[44,12,{"$f":"VLOOKUP($B562,Data!$A$2:$C$13,3,0)","v":"Mark"},{"$f":"VLOOKUP($B562,Data!$A$2:$C$13,2,0)","v":"W&S Life Insurers"},null,{"$f":"IF(E562=\"\",\"\",VLOOKUP(E562,Data!$A$16:$B$2773,2,0))","v":""},"3rd supplemental - First week of August (tentative)"]
[45,12,{"$f":"VLOOKUP($B563,Data!$A$2:$C$13,3,0)","v":"Mark"},{"$f":"VLOOKUP($B563,Data!$A$2:$C$13,2,0)","v":"W&S Life Insurers"},null,{"$f":"IF(E563=\"\",\"\",VLOOKUP(E563,Data!$A$16:$B$2773,2,0))","v":""},"3rd supplemental - First week of August (tentative)"]
[46,12,{"$f":"VLOOKUP($B564,Data!$A$2:$C$13,3,0)","v":"Mark"},{"$f":"VLOOKUP($B564,Data!$A$2:$C$13,2,0)","v":"W&S Life Insurers"},null,{"$f":"IF(E564=\"\",\"\",VLOOKUP(E564,Data!$A$16:$B$2773,2,0))","v":""},"3rd supplemental - First week of August (tentative)"]
[47,12,{"$f":"VLOOKUP($B565,Data!$A$2:$C$13,3,0)","v":"Mark"},{"$f":"VLOOKUP($B565,Data!$A$2:$C$13,2,0)","v":"W&S Life Insurers"},null,{"$f":"IF(E565=\"\",\"\",VLOOKUP(E565,Data!$A$16:$B$2773,2,0))","v":""},"3rd supplemental - First week of August (tentative)"]
[null,null,null,null,null,{"$f":"IF(E566=\"\",\"\",VLOOKUP(E566,Data!$A$16:$B$1560,2,0))","v":""}]

{"sheet":"Data","index":2,"n_rows":1902,"n_cols":5,"rows_kept":1902,"cut":false,"hidden":false,"merged":[]}
["Tm#","Team Name","Owner",null,"Supplemental Draft Order"]
[1,"Uninspired","Jeremy",null,"1st - reverse order of combined 2009-10 records (snake)"]
[2,"Tulsa Drillers","Casey",null,"2nd - reverse order of 2010 record"]
[3,"Cripplers","Andy",null,"3rd - reverse order of 2010 record"]
[4,"Romeo Warriors(?)","Tim & Jeremy(?) (drafted by Will/Ray)"]
[5,"Memories of Mom","Chris",null,"2010 Supplemental Draft Pick Trades"]
[6,"The Luddites","Kevin",null,"Chris traded 36.00 to JTP on 5.27.09 (with 13.2, N.Johnson, & R.Madson for 17.12 & 21.12)"]
[7,"Resistance is Futile","Jess & Tim",null,"Chris traded 40.00 to JTP on 8.12.09 (with 12.2 & #44-47 in 2009 for T.Alderson & 15.12)"]
[8,"Austin Ackbars","Duke & Josh",null,"D&J traded 38.00, 39.00, 42.00, & 43.00 to Kevin for 25.01, 26.01, & 27.01 in the draft"]
[9,"Ryan's Team","Ryan",null,"Kevin traded 25.00, 26.00, & 27.00 in the draft to D&J for 38.00, 39.00, 42.00, & 43.00"]
[10,"Reggae Rebels","Bill",null,"Chris traded 37.00 & 42.00 to Chris for 28.09 in the draft"]
[11,"South Indy Thugs","Ray",null,"Bill traded 28.09 in the draft to Chris for 37.00 & 42.00"]
[12,"W&S Life Insurers","Mark"]
[]
["SS#","Player","Owned?"]
[1,"Halladay, Roy",{"$f":"IF(ISNA(IF(VLOOKUP(A16,Draft!E:E,1,FALSE)=A16,\"Yes\")),\"\",IF(VLOOKUP(A16,Draft!E:E,1,FALSE)=A16,\"Yes\"))","v":"Yes"}]
[2,"Wainwright, Adam",{"$f":"IF(ISNA(IF(VLOOKUP(A17,Draft!E:E,1,FALSE)=A17,\"Yes\")),\"\",IF(VLOOKUP(A17,Draft!E:E,1,FALSE)=A17,\"Yes\"))","v":"Yes"}]
[3,"Haren, Dan",{"$f":"IF(ISNA(IF(VLOOKUP(A18,Draft!E:E,1,FALSE)=A18,\"Yes\")),\"\",IF(VLOOKUP(A18,Draft!E:E,1,FALSE)=A18,\"Yes\"))","v":"Yes"}]
[4,"Lincecum, Tim",{"$f":"IF(ISNA(IF(VLOOKUP(A19,Draft!E:E,1,FALSE)=A19,\"Yes\")),\"\",IF(VLOOKUP(A19,Draft!E:E,1,FALSE)=A19,\"Yes\"))","v":"Yes"}]
[5,"Arroyo, Bronson",{"$f":"IF(ISNA(IF(VLOOKUP(A20,Draft!E:E,1,FALSE)=A20,\"Yes\")),\"\",IF(VLOOKUP(A20,Draft!E:E,1,FALSE)=A20,\"Yes\"))","v":"Yes"}]
[6,"Jimenez, Ubaldo",{"$f":"IF(ISNA(IF(VLOOKUP(A21,Draft!E:E,1,FALSE)=A21,\"Yes\")),\"\",IF(VLOOKUP(A21,Draft!E:E,1,FALSE)=A21,\"Yes\"))","v":"Yes"}]
[7,"Cain, Matt",{"$f":"IF(ISNA(IF(VLOOKUP(A22,Draft!E:E,1,FALSE)=A22,\"Yes\")),\"\",IF(VLOOKUP(A22,Draft!E:E,1,FALSE)=A22,\"Yes\"))","v":"Yes"}]
[8,"Marquis, Jason",{"$f":"IF(ISNA(IF(VLOOKUP(A23,Draft!E:E,1,FALSE)=A23,\"Yes\")),\"\",IF(VLOOKUP(A23,Draft!E:E,1,FALSE)=A23,\"Yes\"))","v":"Yes"}]
[9,"Jurrjens, Jair",{"$f":"IF(ISNA(IF(VLOOKUP(A24,Draft!E:E,1,FALSE)=A24,\"Yes\")),\"\",IF(VLOOKUP(A24,Draft!E:E,1,FALSE)=A24,\"Yes\"))","v":"Yes"}]
[10,"Wolf, Randy",{"$f":"IF(ISNA(IF(VLOOKUP(A25,Draft!E:E,1,FALSE)=A25,\"Yes\")),\"\",IF(VLOOKUP(A25,Draft!E:E,1,FALSE)=A25,\"Yes\"))","v":"Yes"}]
[11,"Jackson, Edwin",{"$f":"IF(ISNA(IF(VLOOKUP(A26,Draft!E:E,1,FALSE)=A26,\"Yes\")),\"\",IF(VLOOKUP(A26,Draft!E:E,1,FALSE)=A26,\"Yes\"))","v":"Yes"}]
[12,"Duke, Zach",{"$f":"IF(ISNA(IF(VLOOKUP(A27,Draft!E:E,1,FALSE)=A27,\"Yes\")),\"\",IF(VLOOKUP(A27,Draft!E:E,1,FALSE)=A27,\"Yes\"))","v":"Yes"}]
[13,"Johnson(Flo), Josh",{"$f":"IF(ISNA(IF(VLOOKUP(A28,Draft!E:E,1,FALSE)=A28,\"Yes\")),\"\",IF(VLOOKUP(A28,Draft!E:E,1,FALSE)=A28,\"Yes\"))","v":"Yes"}]
[14,"Lannan, John",{"$f":"IF(ISNA(IF(VLOOKUP(A29,Draft!E:E,1,FALSE)=A29,\"Yes\")),\"\",IF(VLOOKUP(A29,Draft!E:E,1,FALSE)=A29,\"Yes\"))","v":"Yes"}]
[15,"Rodriguez, Wandy",{"$f":"IF(ISNA(IF(VLOOKUP(A30,Draft!E:E,1,FALSE)=A30,\"Yes\")),\"\",IF(VLOOKUP(A30,Draft!E:E,1,FALSE)=A30,\"Yes\"))","v":"Yes"}]
[16,"Dempster, Ryan",{"$f":"IF(ISNA(IF(VLOOKUP(A31,Draft!E:E,1,FALSE)=A31,\"Yes\")),\"\",IF(VLOOKUP(A31,Draft!E:E,1,FALSE)=A31,\"Yes\"))","v":"Yes"}]
[17,"Correia, Kevin",{"$f":"IF(ISNA(IF(VLOOKUP(A32,Draft!E:E,1,FALSE)=A32,\"Yes\")),\"\",IF(VLOOKUP(A32,Draft!E:E,1,FALSE)=A32,\"Yes\"))","v":"Yes"}]
[18,"Billingsley, Chad",{"$f":"IF(ISNA(IF(VLOOKUP(A33,Draft!E:E,1,FALSE)=A33,\"Yes\")),\"\",IF(VLOOKUP(A33,Draft!E:E,1,FALSE)=A33,\"Yes\"))","v":"Yes"}]
[19,"Blanton, Joe",{"$f":"IF(ISNA(IF(VLOOKUP(A34,Draft!E:E,1,FALSE)=A34,\"Yes\")),\"\",IF(VLOOKUP(A34,Draft!E:E,1,FALSE)=A34,\"Yes\"))","v":"Yes"}]
[20,"Lowe, Derek",{"$f":"IF(ISNA(IF(VLOOKUP(A35,Draft!E:E,1,FALSE)=A35,\"Yes\")),\"\",IF(VLOOKUP(A35,Draft!E:E,1,FALSE)=A35,\"Yes\"))","v":"Yes"}]
[21,"Maholm, Paul",{"$f":"IF(ISNA(IF(VLOOKUP(A36,Draft!E:E,1,FALSE)=A36,\"Yes\")),\"\",IF(VLOOKUP(A36,Draft!E:E,1,FALSE)=A36,\"Yes\"))","v":"Yes"}]
[22,"Hamels, Cole",{"$f":"IF(ISNA(IF(VLOOKUP(A37,Draft!E:E,1,FALSE)=A37,\"Yes\")),\"\",IF(VLOOKUP(A37,Draft!E:E,1,FALSE)=A37,\"Yes\"))","v":"Yes"}]
[23,"Carpenter, Chris",{"$f":"IF(ISNA(IF(VLOOKUP(A38,Draft!E:E,1,FALSE)=A38,\"Yes\")),\"\",IF(VLOOKUP(A38,Draft!E:E,1,FALSE)=A38,\"Yes\"))","v":"Yes"}]
[24,"Zito, Barry",{"$f":"IF(ISNA(IF(VLOOKUP(A39,Draft!E:E,1,FALSE)=A39,\"Yes\")),\"\",IF(VLOOKUP(A39,Draft!E:E,1,FALSE)=A39,\"Yes\"))","v":"Yes"}]
[25,"Gallardo, Yovani",{"$f":"IF(ISNA(IF(VLOOKUP(A40,Draft!E:E,1,FALSE)=A40,\"Yes\")),\"\",IF(VLOOKUP(A40,Draft!E:E,1,FALSE)=A40,\"Yes\"))","v":"Yes"}]
[26,"delaRosa, Jorge",{"$f":"IF(ISNA(IF(VLOOKUP(A41,Draft!E:E,1,FALSE)=A41,\"Yes\")),\"\",IF(VLOOKUP(A41,Draft!E:E,1,FALSE)=A41,\"Yes\"))","v":"Yes"}]
[27,"Nolasco, Ricky",{"$f":"IF(ISNA(IF(VLOOKUP(A42,Draft!E:E,1,FALSE)=A42,\"Yes\")),\"\",IF(VLOOKUP(A42,Draft!E:E,1,FALSE)=A42,\"Yes\"))","v":"Yes"}]
[28,"Pelfrey, Mike",{"$f":"IF(ISNA(IF(VLOOKUP(A43,Draft!E:E,1,FALSE)=A43,\"Yes\")),\"\",IF(VLOOKUP(A43,Draft!E:E,1,FALSE)=A43,\"Yes\"))","v":"Yes"}]
[29,"Oswalt, Roy",{"$f":"IF(ISNA(IF(VLOOKUP(A44,Draft!E:E,1,FALSE)=A44,\"Yes\")),\"\",IF(VLOOKUP(A44,Draft!E:E,1,FALSE)=A44,\"Yes\"))","v":"Yes"}]
[30,"Lilly, Ted",{"$f":"IF(ISNA(IF(VLOOKUP(A45,Draft!E:E,1,FALSE)=A45,\"Yes\")),\"\",IF(VLOOKUP(A45,Draft!E:E,1,FALSE)=A45,\"Yes\"))","v":"Yes"}]
[31,"Hammel, Jason",{"$f":"IF(ISNA(IF(VLOOKUP(A46,Draft!E:E,1,FALSE)=A46,\"Yes\")),\"\",IF(VLOOKUP(A46,Draft!E:E,1,FALSE)=A46,\"Yes\"))","v":"Yes"}]
[32,"Ohlendorf, Ross",{"$f":"IF(ISNA(IF(VLOOKUP(A47,Draft!E:E,1,FALSE)=A47,\"Yes\")),\"\",IF(VLOOKUP(A47,Draft!E:E,1,FALSE)=A47,\"Yes\"))","v":"Yes"}]
[33,"Penny, Brad",{"$f":"IF(ISNA(IF(VLOOKUP(A48,Draft!E:E,1,FALSE)=A48,\"Yes\")),\"\",IF(VLOOKUP(A48,Draft!E:E,1,FALSE)=A48,\"Yes\"))","v":"Yes"}]
[34,"Cueto, Johnny",{"$f":"IF(ISNA(IF(VLOOKUP(A49,Draft!E:E,1,FALSE)=A49,\"Yes\")),\"\",IF(VLOOKUP(A49,Draft!E:E,1,FALSE)=A49,\"Yes\"))","v":"Yes"}]
[35,"Kershaw, Clayton",{"$f":"IF(ISNA(IF(VLOOKUP(A50,Draft!E:E,1,FALSE)=A50,\"Yes\")),\"\",IF(VLOOKUP(A50,Draft!E:E,1,FALSE)=A50,\"Yes\"))","v":"Yes"}]
[36,"Zambrano, Carlos",{"$f":"IF(ISNA(IF(VLOOKUP(A51,Draft!E:E,1,FALSE)=A51,\"Yes\")),\"\",IF(VLOOKUP(A51,Draft!E:E,1,FALSE)=A51,\"Yes\"))","v":"Yes"}]
[37,"Santana, Johan",{"$f":"IF(ISNA(IF(VLOOKUP(A52,Draft!E:E,1,FALSE)=A52,\"Yes\")),\"\",IF(VLOOKUP(A52,Draft!E:E,1,FALSE)=A52,\"Yes\"))","v":"Yes"}]
[38,"Happ, J.A.",{"$f":"IF(ISNA(IF(VLOOKUP(A53,Draft!E:E,1,FALSE)=A53,\"Yes\")),\"\",IF(VLOOKUP(A53,Draft!E:E,1,FALSE)=A53,\"Yes\"))","v":"Yes"}]
[39,"Wells, Randy",{"$f":"IF(ISNA(IF(VLOOKUP(A54,Draft!E:E,1,FALSE)=A54,\"Yes\")),\"\",IF(VLOOKUP(A54,Draft!E:E,1,FALSE)=A54,\"Yes\"))","v":"Yes"}]
[40,"Sanchez, Jonathan",{"$f":"IF(ISNA(IF(VLOOKUP(A55,Draft!E:E,1,FALSE)=A55,\"Yes\")),\"\",IF(VLOOKUP(A55,Draft!E:E,1,FALSE)=A55,\"Yes\"))","v":"Yes"}]
[41,"Harang, Aaron",{"$f":"IF(ISNA(IF(VLOOKUP(A56,Draft!E:E,1,FALSE)=A56,\"Yes\")),\"\",IF(VLOOKUP(A56,Draft!E:E,1,FALSE)=A56,\"Yes\"))","v":"Yes"}]
[42,"Moyer, Jamie",{"$f":"IF(ISNA(IF(VLOOKUP(A57,Draft!E:E,1,FALSE)=A57,\"Yes\")),\"\",IF(VLOOKUP(A57,Draft!E:E,1,FALSE)=A57,\"Yes\"))","v":""}]
[43,"Suppan, Jeff",{"$f":"IF(ISNA(IF(VLOOKUP(A58,Draft!E:E,1,FALSE)=A58,\"Yes\")),\"\",IF(VLOOKUP(A58,Draft!E:E,1,FALSE)=A58,\"Yes\"))","v":""}]
[44,"Volstad, Chris",{"$f":"IF(ISNA(IF(VLOOKUP(A59,Draft!E:E,1,FALSE)=A59,\"Yes\")),\"\",IF(VLOOKUP(A59,Draft!E:E,1,FALSE)=A59,\"Yes\"))","v":"Yes"}]
[45,"Cook, Aaron",{"$f":"IF(ISNA(IF(VLOOKUP(A60,Draft!E:E,1,FALSE)=A60,\"Yes\")),\"\",IF(VLOOKUP(A60,Draft!E:E,1,FALSE)=A60,\"Yes\"))","v":"Yes"}]
[46,"Kawakami, Kenshin",{"$f":"IF(ISNA(IF(VLOOKUP(A61,Draft!E:E,1,FALSE)=A61,\"Yes\")),\"\",IF(VLOOKUP(A61,Draft!E:E,1,FALSE)=A61,\"Yes\"))","v":"Yes"}]
[47,"Moehler, Brian",{"$f":"IF(ISNA(IF(VLOOKUP(A62,Draft!E:E,1,FALSE)=A62,\"Yes\")),\"\",IF(VLOOKUP(A62,Draft!E:E,1,FALSE)=A62,\"Yes\"))","v":""}]
[48,"Richard, Clayton",{"$f":"IF(ISNA(IF(VLOOKUP(A63,Draft!E:E,1,FALSE)=A63,\"Yes\")),\"\",IF(VLOOKUP(A63,Draft!E:E,1,FALSE)=A63,\"Yes\"))","v":"Yes"}]
[49,"Parra, Manny",{"$f":"IF(ISNA(IF(VLOOKUP(A64,Draft!E:E,1,FALSE)=A64,\"Yes\")),\"\",IF(VLOOKUP(A64,Draft!E:E,1,FALSE)=A64,\"Yes\"))","v":"Yes"}]
[50,"Hanson, Thomas",{"$f":"IF(ISNA(IF(VLOOKUP(A65,Draft!E:E,1,FALSE)=A65,\"Yes\")),\"\",IF(VLOOKUP(A65,Draft!E:E,1,FALSE)=A65,\"Yes\"))","v":"Yes"}]
[51,"Owings, Micah",{"$f":"IF(ISNA(IF(VLOOKUP(A66,Draft!E:E,1,FALSE)=A66,\"Yes\")),\"\",IF(VLOOKUP(A66,Draft!E:E,1,FALSE)=A66,\"Yes\"))","v":""}]
[52,"Lohse, Kyle",{"$f":"IF(ISNA(IF(VLOOKUP(A67,Draft!E:E,1,FALSE)=A67,\"Yes\")),\"\",IF(VLOOKUP(A67,Draft!E:E,1,FALSE)=A67,\"Yes\"))","v":"Yes"}]
[53,"Kuroda, Hiroki",{"$f":"IF(ISNA(IF(VLOOKUP(A68,Draft!E:E,1,FALSE)=A68,\"Yes\")),\"\",IF(VLOOKUP(A68,Draft!E:E,1,FALSE)=A68,\"Yes\"))","v":"Yes"}]
[54,"Bush, Dave",{"$f":"IF(ISNA(IF(VLOOKUP(A69,Draft!E:E,1,FALSE)=A69,\"Yes\")),\"\",IF(VLOOKUP(A69,Draft!E:E,1,FALSE)=A69,\"Yes\"))","v":"Yes"}]
[55,"Bailey, Homer",{"$f":"IF(ISNA(IF(VLOOKUP(A70,Draft!E:E,1,FALSE)=A70,\"Yes\")),\"\",IF(VLOOKUP(A70,Draft!E:E,1,FALSE)=A70,\"Yes\"))","v":"Yes"}]
[56,"Karstens, Jeffrey",{"$f":"IF(ISNA(IF(VLOOKUP(A71,Draft!E:E,1,FALSE)=A71,\"Yes\")),\"\",IF(VLOOKUP(A71,Draft!E:E,1,FALSE)=A71,\"Yes\"))","v":""}]
[57,"Stammen, Craig",{"$f":"IF(ISNA(IF(VLOOKUP(A72,Draft!E:E,1,FALSE)=A72,\"Yes\")),\"\",IF(VLOOKUP(A72,Draft!E:E,1,FALSE)=A72,\"Yes\"))","v":""}]
[58,"West, Sean",{"$f":"IF(ISNA(IF(VLOOKUP(A73,Draft!E:E,1,FALSE)=A73,\"Yes\")),\"\",IF(VLOOKUP(A73,Draft!E:E,1,FALSE)=A73,\"Yes\"))","v":""}]
[59,"Paulino, Felipe",{"$f":"IF(ISNA(IF(VLOOKUP(A74,Draft!E:E,1,FALSE)=A74,\"Yes\")),\"\",IF(VLOOKUP(A74,Draft!E:E,1,FALSE)=A74,\"Yes\"))","v":"Yes"}]
[60,"Morton, Charlie",{"$f":"IF(ISNA(IF(VLOOKUP(A75,Draft!E:E,1,FALSE)=A75,\"Yes\")),\"\",IF(VLOOKUP(A75,Draft!E:E,1,FALSE)=A75,\"Yes\"))","v":"Yes"}]
[61,"Villanueva, Carlos",{"$f":"IF(ISNA(IF(VLOOKUP(A76,Draft!E:E,1,FALSE)=A76,\"Yes\")),\"\",IF(VLOOKUP(A76,Draft!E:E,1,FALSE)=A76,\"Yes\"))","v":""}]
[62,"Mujica, Edward",{"$f":"IF(ISNA(IF(VLOOKUP(A77,Draft!E:E,1,FALSE)=A77,\"Yes\")),\"\",IF(VLOOKUP(A77,Draft!E:E,1,FALSE)=A77,\"Yes\"))","v":"Yes"}]
[63,"Carrasco, D.J.",{"$f":"IF(ISNA(IF(VLOOKUP(A78,Draft!E:E,1,FALSE)=A78,\"Yes\")),\"\",IF(VLOOKUP(A78,Draft!E:E,1,FALSE)=A78,\"Yes\"))","v":""}]
[64,"Jakubauskas, Chris",{"$f":"IF(ISNA(IF(VLOOKUP(A79,Draft!E:E,1,FALSE)=A79,\"Yes\")),\"\",IF(VLOOKUP(A79,Draft!E:E,1,FALSE)=A79,\"Yes\"))","v":""}]
[65,"Mock, Garrett",{"$f":"IF(ISNA(IF(VLOOKUP(A80,Draft!E:E,1,FALSE)=A80,\"Yes\")),\"\",IF(VLOOKUP(A80,Draft!E:E,1,FALSE)=A80,\"Yes\"))","v":"Yes"}]
[66,"Zimmermann, Jordan",{"$f":"IF(ISNA(IF(VLOOKUP(A81,Draft!E:E,1,FALSE)=A81,\"Yes\")),\"\",IF(VLOOKUP(A81,Draft!E:E,1,FALSE)=A81,\"Yes\"))","v":"Yes"}]
[67,"Parnell, Bobby",{"$f":"IF(ISNA(IF(VLOOKUP(A82,Draft!E:E,1,FALSE)=A82,\"Yes\")),\"\",IF(VLOOKUP(A82,Draft!E:E,1,FALSE)=A82,\"Yes\"))","v":""}]
[68,"Sanchez, Anibal",{"$f":"IF(ISNA(IF(VLOOKUP(A83,Draft!E:E,1,FALSE)=A83,\"Yes\")),\"\",IF(VLOOKUP(A83,Draft!E:E,1,FALSE)=A83,\"Yes\"))","v":"Yes"}]
[69,"Martis, Shairon",{"$f":"IF(ISNA(IF(VLOOKUP(A84,Draft!E:E,1,FALSE)=A84,\"Yes\")),\"\",IF(VLOOKUP(A84,Draft!E:E,1,FALSE)=A84,\"Yes\"))","v":""}]
[70,"Marshall, Sean",{"$f":"IF(ISNA(IF(VLOOKUP(A85,Draft!E:E,1,FALSE)=A85,\"Yes\")),\"\",IF(VLOOKUP(A85,Draft!E:E,1,FALSE)=A85,\"Yes\"))","v":"Yes"}]
[71,"Maine, John",{"$f":"IF(ISNA(IF(VLOOKUP(A86,Draft!E:E,1,FALSE)=A86,\"Yes\")),\"\",IF(VLOOKUP(A86,Draft!E:E,1,FALSE)=A86,\"Yes\"))","v":"Yes"}]
[72,"Hart, Kevin",{"$f":"IF(ISNA(IF(VLOOKUP(A87,Draft!E:E,1,FALSE)=A87,\"Yes\")),\"\",IF(VLOOKUP(A87,Draft!E:E,1,FALSE)=A87,\"Yes\"))","v":""}]
[73,"Miller, Andrew",{"$f":"IF(ISNA(IF(VLOOKUP(A88,Draft!E:E,1,FALSE)=A88,\"Yes\")),\"\",IF(VLOOKUP(A88,Draft!E:E,1,FALSE)=A88,\"Yes\"))","v":"Yes"}]
[74,"Buckner, Billy",{"$f":"IF(ISNA(IF(VLOOKUP(A89,Draft!E:E,1,FALSE)=A89,\"Yes\")),\"\",IF(VLOOKUP(A89,Draft!E:E,1,FALSE)=A89,\"Yes\"))","v":""}]
[75,"Martin, J.D.",{"$f":"IF(ISNA(IF(VLOOKUP(A90,Draft!E:E,1,FALSE)=A90,\"Yes\")),\"\",IF(VLOOKUP(A90,Draft!E:E,1,FALSE)=A90,\"Yes\"))","v":""}]
[76,"Young(SD), Chris",{"$f":"IF(ISNA(IF(VLOOKUP(A91,Draft!E:E,1,FALSE)=A91,\"Yes\")),\"\",IF(VLOOKUP(A91,Draft!E:E,1,FALSE)=A91,\"Yes\"))","v":"Yes"}]
[77,"Detwiler, Ross",{"$f":"IF(ISNA(IF(VLOOKUP(A92,Draft!E:E,1,FALSE)=A92,\"Yes\")),\"\",IF(VLOOKUP(A92,Draft!E:E,1,FALSE)=A92,\"Yes\"))","v":""}]
[78,"Stauffer, Tim",{"$f":"IF(ISNA(IF(VLOOKUP(A93,Draft!E:E,1,FALSE)=A93,\"Yes\")),\"\",IF(VLOOKUP(A93,Draft!E:E,1,FALSE)=A93,\"Yes\"))","v":"Yes"}]
[79,"Badenhop, Burke",{"$f":"IF(ISNA(IF(VLOOKUP(A94,Draft!E:E,1,FALSE)=A94,\"Yes\")),\"\",IF(VLOOKUP(A94,Draft!E:E,1,FALSE)=A94,\"Yes\"))","v":"Yes"}]
[80,"Myers, Brett",{"$f":"IF(ISNA(IF(VLOOKUP(A95,Draft!E:E,1,FALSE)=A95,\"Yes\")),\"\",IF(VLOOKUP(A95,Draft!E:E,1,FALSE)=A95,\"Yes\"))","v":"Yes"}]
[81,"Figueroa, Nelson",{"$f":"IF(ISNA(IF(VLOOKUP(A96,Draft!E:E,1,FALSE)=A96,\"Yes\")),\"\",IF(VLOOKUP(A96,Draft!E:E,1,FALSE)=A96,\"Yes\"))","v":""}]
[82,"Medlen, Kris",{"$f":"IF(ISNA(IF(VLOOKUP(A97,Draft!E:E,1,FALSE)=A97,\"Yes\")),\"\",IF(VLOOKUP(A97,Draft!E:E,1,FALSE)=A97,\"Yes\"))","v":"Yes"}]
[83,"Perez, Oliver",{"$f":"IF(ISNA(IF(VLOOKUP(A98,Draft!E:E,1,FALSE)=A98,\"Yes\")),\"\",IF(VLOOKUP(A98,Draft!E:E,1,FALSE)=A98,\"Yes\"))","v":"Yes"}]
[84,"Lehr, Justin",{"$f":"IF(ISNA(IF(VLOOKUP(A99,Draft!E:E,1,FALSE)=A99,\"Yes\")),\"\",IF(VLOOKUP(A99,Draft!E:E,1,FALSE)=A99,\"Yes\"))","v":""}]
[85,"Dickey, R.A.",{"$f":"IF(ISNA(IF(VLOOKUP(A100,Draft!E:E,1,FALSE)=A100,\"Yes\")),\"\",IF(VLOOKUP(A100,Draft!E:E,1,FALSE)=A100,\"Yes\"))","v":""}]
[86,"McDonald, James",{"$f":"IF(ISNA(IF(VLOOKUP(A101,Draft!E:E,1,FALSE)=A101,\"Yes\")),\"\",IF(VLOOKUP(A101,Draft!E:E,1,FALSE)=A101,\"Yes\"))","v":"Yes"}]
[87,"Olsen, Scott",{"$f":"IF(ISNA(IF(VLOOKUP(A102,Draft!E:E,1,FALSE)=A102,\"Yes\")),\"\",IF(VLOOKUP(A102,Draft!E:E,1,FALSE)=A102,\"Yes\"))","v":""}]
[88,"Misch, Patrick",{"$f":"IF(ISNA(IF(VLOOKUP(A103,Draft!E:E,1,FALSE)=A103,\"Yes\")),\"\",IF(VLOOKUP(A103,Draft!E:E,1,FALSE)=A103,\"Yes\"))","v":""}]
[89,"VandenHurk, Rick",{"$f":"IF(ISNA(IF(VLOOKUP(A104,Draft!E:E,1,FALSE)=A104,\"Yes\")),\"\",IF(VLOOKUP(A104,Draft!E:E,1,FALSE)=A104,\"Yes\"))","v":"Yes"}]
[90,"Boggs, Mitchell",{"$f":"IF(ISNA(IF(VLOOKUP(A105,Draft!E:E,1,FALSE)=A105,\"Yes\")),\"\",IF(VLOOKUP(A105,Draft!E:E,1,FALSE)=A105,\"Yes\"))","v":""}]
[91,"Norris, Bud",{"$f":"IF(ISNA(IF(VLOOKUP(A106,Draft!E:E,1,FALSE)=A106,\"Yes\")),\"\",IF(VLOOKUP(A106,Draft!E:E,1,FALSE)=A106,\"Yes\"))","v":"Yes"}]
[92,"Latos, Mat",{"$f":"IF(ISNA(IF(VLOOKUP(A107,Draft!E:E,1,FALSE)=A107,\"Yes\")),\"\",IF(VLOOKUP(A107,Draft!E:E,1,FALSE)=A107,\"Yes\"))","v":"Yes"}]
[93,"Stults, Eric",{"$f":"IF(ISNA(IF(VLOOKUP(A108,Draft!E:E,1,FALSE)=A108,\"Yes\")),\"\",IF(VLOOKUP(A108,Draft!E:E,1,FALSE)=A108,\"Yes\"))","v":""}]
[94,"Volquez, Edinson",{"$f":"IF(ISNA(IF(VLOOKUP(A109,Draft!E:E,1,FALSE)=A109,\"Yes\")),\"\",IF(VLOOKUP(A109,Draft!E:E,1,FALSE)=A109,\"Yes\"))","v":"Yes"}]
[95,"Gorzelanny, Tom",{"$f":"IF(ISNA(IF(VLOOKUP(A110,Draft!E:E,1,FALSE)=A110,\"Yes\")),\"\",IF(VLOOKUP(A110,Draft!E:E,1,FALSE)=A110,\"Yes\"))","v":"Yes"}]
[96,"Narveson, Chris",{"$f":"IF(ISNA(IF(VLOOKUP(A111,Draft!E:E,1,FALSE)=A111,\"Yes\")),\"\",IF(VLOOKUP(A111,Draft!E:E,1,FALSE)=A111,\"Yes\"))","v":""}]
[97,"LeBlanc, Wade",{"$f":"IF(ISNA(IF(VLOOKUP(A112,Draft!E:E,1,FALSE)=A112,\"Yes\")),\"\",IF(VLOOKUP(A112,Draft!E:E,1,FALSE)=A112,\"Yes\"))","v":""}]
[98,"Vasquez, Virgil",{"$f":"IF(ISNA(IF(VLOOKUP(A113,Draft!E:E,1,FALSE)=A113,\"Yes\")),\"\",IF(VLOOKUP(A113,Draft!E:E,1,FALSE)=A113,\"Yes\"))","v":""}]
[99,"Hudson, Tim",{"$f":"IF(ISNA(IF(VLOOKUP(A114,Draft!E:E,1,FALSE)=A114,\"Yes\")),\"\",IF(VLOOKUP(A114,Draft!E:E,1,FALSE)=A114,\"Yes\"))","v":"Yes"}]
[100,"Maloney, Matt",{"$f":"IF(ISNA(IF(VLOOKUP(A115,Draft!E:E,1,FALSE)=A115,\"Yes\")),\"\",IF(VLOOKUP(A115,Draft!E:E,1,FALSE)=A115,\"Yes\"))","v":""}]
[101,"Hawksworth, Blake",{"$f":"IF(ISNA(IF(VLOOKUP(A116,Draft!E:E,1,FALSE)=A116,\"Yes\")),\"\",IF(VLOOKUP(A116,Draft!E:E,1,FALSE)=A116,\"Yes\"))","v":"Yes"}]
[102,"Nieve, Fernando",{"$f":"IF(ISNA(IF(VLOOKUP(A117,Draft!E:E,1,FALSE)=A117,\"Yes\")),\"\",IF(VLOOKUP(A117,Draft!E:E,1,FALSE)=A117,\"Yes\"))","v":""}]
[103,"McCutchen, Daniel",{"$f":"IF(ISNA(IF(VLOOKUP(A118,Draft!E:E,1,FALSE)=A118,\"Yes\")),\"\",IF(VLOOKUP(A118,Draft!E:E,1,FALSE)=A118,\"Yes\"))","v":"Yes"}]
[104,"Samardzija, Jeff",{"$f":"IF(ISNA(IF(VLOOKUP(A119,Draft!E:E,1,FALSE)=A119,\"Yes\")),\"\",IF(VLOOKUP(A119,Draft!E:E,1,FALSE)=A119,\"Yes\"))","v":""}]
[105,"Bazardo, Yorman",{"$f":"IF(ISNA(IF(VLOOKUP(A120,Draft!E:E,1,FALSE)=A120,\"Yes\")),\"\",IF(VLOOKUP(A120,Draft!E:E,1,FALSE)=A120,\"Yes\"))","v":""}]
[106,"Belisle, Matt",{"$f":"IF(ISNA(IF(VLOOKUP(A121,Draft!E:E,1,FALSE)=A121,\"Yes\")),\"\",IF(VLOOKUP(A121,Draft!E:E,1,FALSE)=A121,\"Yes\"))","v":""}]
[107,"Silva, Carlos",{"$f":"IF(ISNA(IF(VLOOKUP(A122,Draft!E:E,1,FALSE)=A122,\"Yes\")),\"\",IF(VLOOKUP(A122,Draft!E:E,1,FALSE)=A122,\"Yes\"))","v":""}]
[108,"Balester, Collin",{"$f":"IF(ISNA(IF(VLOOKUP(A123,Draft!E:E,1,FALSE)=A123,\"Yes\")),\"\",IF(VLOOKUP(A123,Draft!E:E,1,FALSE)=A123,\"Yes\"))","v":""}]
[109,"Martinez, Joe",{"$f":"IF(ISNA(IF(VLOOKUP(A124,Draft!E:E,1,FALSE)=A124,\"Yes\")),\"\",IF(VLOOKUP(A124,Draft!E:E,1,FALSE)=A124,\"Yes\"))","v":""}]
[110,"Patton, David",{"$f":"IF(ISNA(IF(VLOOKUP(A125,Draft!E:E,1,FALSE)=A125,\"Yes\")),\"\",IF(VLOOKUP(A125,Draft!E:E,1,FALSE)=A125,\"Yes\"))","v":""}]
[111,"Reyes(Atl), Jo-Jo",{"$f":"IF(ISNA(IF(VLOOKUP(A126,Draft!E:E,1,FALSE)=A126,\"Yes\")),\"\",IF(VLOOKUP(A126,Draft!E:E,1,FALSE)=A126,\"Yes\"))","v":"Yes"}]
[112,"Kendrick, Kyle",{"$f":"IF(ISNA(IF(VLOOKUP(A127,Draft!E:E,1,FALSE)=A127,\"Yes\")),\"\",IF(VLOOKUP(A127,Draft!E:E,1,FALSE)=A127,\"Yes\"))","v":"Yes"}]
[113,"Martinez, Cristhian",{"$f":"IF(ISNA(IF(VLOOKUP(A128,Draft!E:E,1,FALSE)=A128,\"Yes\")),\"\",IF(VLOOKUP(A128,Draft!E:E,1,FALSE)=A128,\"Yes\"))","v":""}]
[114,"Niese, Jonathon",{"$f":"IF(ISNA(IF(VLOOKUP(A129,Draft!E:E,1,FALSE)=A129,\"Yes\")),\"\",IF(VLOOKUP(A129,Draft!E:E,1,FALSE)=A129,\"Yes\"))","v":"Yes"}]
[115,"Mulvey, Kevin",{"$f":"IF(ISNA(IF(VLOOKUP(A130,Draft!E:E,1,FALSE)=A130,\"Yes\")),\"\",IF(VLOOKUP(A130,Draft!E:E,1,FALSE)=A130,\"Yes\"))","v":""}]
[116,"Bastardo, Antonio",{"$f":"IF(ISNA(IF(VLOOKUP(A131,Draft!E:E,1,FALSE)=A131,\"Yes\")),\"\",IF(VLOOKUP(A131,Draft!E:E,1,FALSE)=A131,\"Yes\"))","v":"Yes"}]
[117,"Banks, Josh",{"$f":"IF(ISNA(IF(VLOOKUP(A132,Draft!E:E,1,FALSE)=A132,\"Yes\")),\"\",IF(VLOOKUP(A132,Draft!E:E,1,FALSE)=A132,\"Yes\"))","v":""}]
[118,"Penn, Hayden",{"$f":"IF(ISNA(IF(VLOOKUP(A133,Draft!E:E,1,FALSE)=A133,\"Yes\")),\"\",IF(VLOOKUP(A133,Draft!E:E,1,FALSE)=A133,\"Yes\"))","v":""}]
[119,"Gallagher, Sean",{"$f":"IF(ISNA(IF(VLOOKUP(A134,Draft!E:E,1,FALSE)=A134,\"Yes\")),\"\",IF(VLOOKUP(A134,Draft!E:E,1,FALSE)=A134,\"Yes\"))","v":"Yes"}]
[120,"Elbert, Scott",{"$f":"IF(ISNA(IF(VLOOKUP(A135,Draft!E:E,1,FALSE)=A135,\"Yes\")),\"\",IF(VLOOKUP(A135,Draft!E:E,1,FALSE)=A135,\"Yes\"))","v":"Yes"}]
[121,"Caridad, Esmailin",{"$f":"IF(ISNA(IF(VLOOKUP(A136,Draft!E:E,1,FALSE)=A136,\"Yes\")),\"\",IF(VLOOKUP(A136,Draft!E:E,1,FALSE)=A136,\"Yes\"))","v":"Yes"}]
[122,"Lopez, Wilton",{"$f":"IF(ISNA(IF(VLOOKUP(A137,Draft!E:E,1,FALSE)=A137,\"Yes\")),\"\",IF(VLOOKUP(A137,Draft!E:E,1,FALSE)=A137,\"Yes\"))","v":""}]
[123,"Haeger, Charlie",{"$f":"IF(ISNA(IF(VLOOKUP(A138,Draft!E:E,1,FALSE)=A138,\"Yes\")),\"\",IF(VLOOKUP(A138,Draft!E:E,1,FALSE)=A138,\"Yes\"))","v":""}]
[124,"Ekstrom, Mike",{"$f":"IF(ISNA(IF(VLOOKUP(A139,Draft!E:E,1,FALSE)=A139,\"Yes\")),\"\",IF(VLOOKUP(A139,Draft!E:E,1,FALSE)=A139,\"Yes\"))","v":""}]
[125,"Ascanio, Jose",{"$f":"IF(ISNA(IF(VLOOKUP(A140,Draft!E:E,1,FALSE)=A140,\"Yes\")),\"\",IF(VLOOKUP(A140,Draft!E:E,1,FALSE)=A140,\"Yes\"))","v":""}]
[126,"Augenstein, Bryan",{"$f":"IF(ISNA(IF(VLOOKUP(A141,Draft!E:E,1,FALSE)=A141,\"Yes\")),\"\",IF(VLOOKUP(A141,Draft!E:E,1,FALSE)=A141,\"Yes\"))","v":""}]
[127,"Veal, Donnie",{"$f":"IF(ISNA(IF(VLOOKUP(A142,Draft!E:E,1,FALSE)=A142,\"Yes\")),\"\",IF(VLOOKUP(A142,Draft!E:E,1,FALSE)=A142,\"Yes\"))","v":""}]
[128,"Walters, P.J.",{"$f":"IF(ISNA(IF(VLOOKUP(A143,Draft!E:E,1,FALSE)=A143,\"Yes\")),\"\",IF(VLOOKUP(A143,Draft!E:E,1,FALSE)=A143,\"Yes\"))","v":""}]
[129,"Ramos, Cesar",{"$f":"IF(ISNA(IF(VLOOKUP(A144,Draft!E:E,1,FALSE)=A144,\"Yes\")),\"\",IF(VLOOKUP(A144,Draft!E:E,1,FALSE)=A144,\"Yes\"))","v":""}]
[130,"Parr, James",{"$f":"IF(ISNA(IF(VLOOKUP(A145,Draft!E:E,1,FALSE)=A145,\"Yes\")),\"\",IF(VLOOKUP(A145,Draft!E:E,1,FALSE)=A145,\"Yes\"))","v":""}]
[131,"Escalona, Sergio",{"$f":"IF(ISNA(IF(VLOOKUP(A146,Draft!E:E,1,FALSE)=A146,\"Yes\")),\"\",IF(VLOOKUP(A146,Draft!E:E,1,FALSE)=A146,\"Yes\"))","v":""}]
[132,"Poreda, Aaron",{"$f":"IF(ISNA(IF(VLOOKUP(A147,Draft!E:E,1,FALSE)=A147,\"Yes\")),\"\",IF(VLOOKUP(A147,Draft!E:E,1,FALSE)=A147,\"Yes\"))","v":"Yes"}]
[133,"Chacin, Jhoulys",{"$f":"IF(ISNA(IF(VLOOKUP(A148,Draft!E:E,1,FALSE)=A148,\"Yes\")),\"\",IF(VLOOKUP(A148,Draft!E:E,1,FALSE)=A148,\"Yes\"))","v":"Yes"}]
[134,"Carrillo, Cesar",{"$f":"IF(ISNA(IF(VLOOKUP(A149,Draft!E:E,1,FALSE)=A149,\"Yes\")),\"\",IF(VLOOKUP(A149,Draft!E:E,1,FALSE)=A149,\"Yes\"))","v":""}]
[135,"Bumgarner, Madison",{"$f":"IF(ISNA(IF(VLOOKUP(A150,Draft!E:E,1,FALSE)=A150,\"Yes\")),\"\",IF(VLOOKUP(A150,Draft!E:E,1,FALSE)=A150,\"Yes\"))","v":"Yes"}]
[136,"Stoner, Tobi",{"$f":"IF(ISNA(IF(VLOOKUP(A151,Draft!E:E,1,FALSE)=A151,\"Yes\")),\"\",IF(VLOOKUP(A151,Draft!E:E,1,FALSE)=A151,\"Yes\"))","v":""}]
[137,"Estrada, Marco",{"$f":"IF(ISNA(IF(VLOOKUP(A152,Draft!E:E,1,FALSE)=A152,\"Yes\")),\"\",IF(VLOOKUP(A152,Draft!E:E,1,FALSE)=A152,\"Yes\"))","v":""}]
[138,"Burres, Brian",{"$f":"IF(ISNA(IF(VLOOKUP(A153,Draft!E:E,1,FALSE)=A153,\"Yes\")),\"\",IF(VLOOKUP(A153,Draft!E:E,1,FALSE)=A153,\"Yes\"))","v":""}]
[139,"Ledezma, Wilfredo",{"$f":"IF(ISNA(IF(VLOOKUP(A154,Draft!E:E,1,FALSE)=A154,\"Yes\")),\"\",IF(VLOOKUP(A154,Draft!E:E,1,FALSE)=A154,\"Yes\"))","v":""}]
[140,"Carpenter, Andrew",{"$f":"IF(ISNA(IF(VLOOKUP(A155,Draft!E:E,1,FALSE)=A155,\"Yes\")),\"\",IF(VLOOKUP(A155,Draft!E:E,1,FALSE)=A155,\"Yes\"))","v":""}]
[141,"Towers, Josh",{"$f":"IF(ISNA(IF(VLOOKUP(A156,Draft!E:E,1,FALSE)=A156,\"Yes\")),\"\",IF(VLOOKUP(A156,Draft!E:E,1,FALSE)=A156,\"Yes\"))","v":""}]
[142,"Escobar, Kelvim",{"$f":"IF(ISNA(IF(VLOOKUP(A157,Draft!E:E,1,FALSE)=A157,\"Yes\")),\"\",IF(VLOOKUP(A157,Draft!E:E,1,FALSE)=A157,\"Yes\"))","v":""}]
[143,"Dillard, Tim",{"$f":"IF(ISNA(IF(VLOOKUP(A158,Draft!E:E,1,FALSE)=A158,\"Yes\")),\"\",IF(VLOOKUP(A158,Draft!E:E,1,FALSE)=A158,\"Yes\"))","v":""}]
[144,"Webb, Brandon",{"$f":"IF(ISNA(IF(VLOOKUP(A159,Draft!E:E,1,FALSE)=A159,\"Yes\")),\"\",IF(VLOOKUP(A159,Draft!E:E,1,FALSE)=A159,\"Yes\"))","v":"Yes"}]
[145,"Butler, Josh",{"$f":"IF(ISNA(IF(VLOOKUP(A160,Draft!E:E,1,FALSE)=A160,\"Yes\")),\"\",IF(VLOOKUP(A160,Draft!E:E,1,FALSE)=A160,\"Yes\"))","v":""}]
[146,"Rogers, Esmil",{"$f":"IF(ISNA(IF(VLOOKUP(A161,Draft!E:E,1,FALSE)=A161,\"Yes\")),\"\",IF(VLOOKUP(A161,Draft!E:E,1,FALSE)=A161,\"Yes\"))","v":""}]
[147,"Claggett, Anthony",{"$f":"IF(ISNA(IF(VLOOKUP(A162,Draft!E:E,1,FALSE)=A162,\"Yes\")),\"\",IF(VLOOKUP(A162,Draft!E:E,1,FALSE)=A162,\"Yes\"))","v":""}]
[148,"Egbert, Jack",{"$f":"IF(ISNA(IF(VLOOKUP(A163,Draft!E:E,1,FALSE)=A163,\"Yes\")),\"\",IF(VLOOKUP(A163,Draft!E:E,1,FALSE)=A163,\"Yes\"))","v":""}]
[149,"Lopez, Arturo",{"$f":"IF(ISNA(IF(VLOOKUP(A164,Draft!E:E,1,FALSE)=A164,\"Yes\")),\"\",IF(VLOOKUP(A164,Draft!E:E,1,FALSE)=A164,\"Yes\"))","v":""}]
[150,"Atkins, Mitch",{"$f":"IF(ISNA(IF(VLOOKUP(A165,Draft!E:E,1,FALSE)=A165,\"Yes\")),\"\",IF(VLOOKUP(A165,Draft!E:E,1,FALSE)=A165,\"Yes\"))","v":""}]
[151,"Frieri, Ernesto",{"$f":"IF(ISNA(IF(VLOOKUP(A166,Draft!E:E,1,FALSE)=A166,\"Yes\")),\"\",IF(VLOOKUP(A166,Draft!E:E,1,FALSE)=A166,\"Yes\"))","v":""}]
[152,"Liz, Radhames",{"$f":"IF(ISNA(IF(VLOOKUP(A167,Draft!E:E,1,FALSE)=A167,\"Yes\")),\"\",IF(VLOOKUP(A167,Draft!E:E,1,FALSE)=A167,\"Yes\"))","v":""}]
[153,"Kennedy, Ian",{"$f":"IF(ISNA(IF(VLOOKUP(A168,Draft!E:E,1,FALSE)=A168,\"Yes\")),\"\",IF(VLOOKUP(A168,Draft!E:E,1,FALSE)=A168,\"Yes\"))","v":"Yes"}]
[154,"Francis, Jeff",{"$f":"IF(ISNA(IF(VLOOKUP(A169,Draft!E:E,1,FALSE)=A169,\"Yes\")),\"\",IF(VLOOKUP(A169,Draft!E:E,1,FALSE)=A169,\"Yes\"))","v":"Yes"}]
[155,"Capuano, Chris",{"$f":"IF(ISNA(IF(VLOOKUP(A170,Draft!E:E,1,FALSE)=A170,\"Yes\")),\"\",IF(VLOOKUP(A170,Draft!E:E,1,FALSE)=A170,\"Yes\"))","v":""}]
[156,"Loe, Kameron",{"$f":"IF(ISNA(IF(VLOOKUP(A171,Draft!E:E,1,FALSE)=A171,\"Yes\")),\"\",IF(VLOOKUP(A171,Draft!E:E,1,FALSE)=A171,\"Yes\"))","v":""}]
[157,"Chacin, Gustavo",{"$f":"IF(ISNA(IF(VLOOKUP(A172,Draft!E:E,1,FALSE)=A172,\"Yes\")),\"\",IF(VLOOKUP(A172,Draft!E:E,1,FALSE)=A172,\"Yes\"))","v":""}]
[158,"Hensley, Clay",{"$f":"IF(ISNA(IF(VLOOKUP(A173,Draft!E:E,1,FALSE)=A173,\"Yes\")),\"\",IF(VLOOKUP(A173,Draft!E:E,1,FALSE)=A173,\"Yes\"))","v":""}]
[159,"Pena(SF), Tony",{"$f":"IF(ISNA(IF(VLOOKUP(A174,Draft!E:E,1,FALSE)=A174,\"Yes\")),\"\",IF(VLOOKUP(A174,Draft!E:E,1,FALSE)=A174,\"Yes\"))","v":""}]
[160,"Chico, Matt",{"$f":"IF(ISNA(IF(VLOOKUP(A175,Draft!E:E,1,FALSE)=A175,\"Yes\")),\"\",IF(VLOOKUP(A175,Draft!E:E,1,FALSE)=A175,\"Yes\"))","v":""}]
[161,"Smith, Greg",{"$f":"IF(ISNA(IF(VLOOKUP(A176,Draft!E:E,1,FALSE)=A176,\"Yes\")),\"\",IF(VLOOKUP(A176,Draft!E:E,1,FALSE)=A176,\"Yes\"))","v":""}]
[162,"Reynolds, Greg",{"$f":"IF(ISNA(IF(VLOOKUP(A177,Draft!E:E,1,FALSE)=A177,\"Yes\")),\"\",IF(VLOOKUP(A177,Draft!E:E,1,FALSE)=A177,\"Yes\"))","v":""}]
[163,"Mathieson, Scott",{"$f":"IF(ISNA(IF(VLOOKUP(A178,Draft!E:E,1,FALSE)=A178,\"Yes\")),\"\",IF(VLOOKUP(A178,Draft!E:E,1,FALSE)=A178,\"Yes\"))","v":""}]
[164,"Tucker, Ryan",{"$f":"IF(ISNA(IF(VLOOKUP(A179,Draft!E:E,1,FALSE)=A179,\"Yes\")),\"\",IF(VLOOKUP(A179,Draft!E:E,1,FALSE)=A179,\"Yes\"))","v":""}]
[165,"Murray, A.J.",{"$f":"IF(ISNA(IF(VLOOKUP(A180,Draft!E:E,1,FALSE)=A180,\"Yes\")),\"\",IF(VLOOKUP(A180,Draft!E:E,1,FALSE)=A180,\"Yes\"))","v":""}]
[166,"Parisi, Mike",{"$f":"IF(ISNA(IF(VLOOKUP(A181,Draft!E:E,1,FALSE)=A181,\"Yes\")),\"\",IF(VLOOKUP(A181,Draft!E:E,1,FALSE)=A181,\"Yes\"))","v":""}]
[167,"Garcia, Jaime",{"$f":"IF(ISNA(IF(VLOOKUP(A182,Draft!E:E,1,FALSE)=A182,\"Yes\")),\"\",IF(VLOOKUP(A182,Draft!E:E,1,FALSE)=A182,\"Yes\"))","v":"Yes"}]
[168,"White, Bill",{"$f":"IF(ISNA(IF(VLOOKUP(A183,Draft!E:E,1,FALSE)=A183,\"Yes\")),\"\",IF(VLOOKUP(A183,Draft!E:E,1,FALSE)=A183,\"Yes\"))","v":""}]
[169,"Barthmaier, Jimmy",{"$f":"IF(ISNA(IF(VLOOKUP(A184,Draft!E:E,1,FALSE)=A184,\"Yes\")),\"\",IF(VLOOKUP(A184,Draft!E:E,1,FALSE)=A184,\"Yes\"))","v":""}]
[170,"Lofgren, Chuck",{"$f":"IF(ISNA(IF(VLOOKUP(A185,Draft!E:E,1,FALSE)=A185,\"Yes\")),\"\",IF(VLOOKUP(A185,Draft!E:E,1,FALSE)=A185,\"Yes\"))","v":""}]
[171,"Rogers, Mark",{"$f":"IF(ISNA(IF(VLOOKUP(A186,Draft!E:E,1,FALSE)=A186,\"Yes\")),\"\",IF(VLOOKUP(A186,Draft!E:E,1,FALSE)=A186,\"Yes\"))","v":""}]
[172,"Scarpetta, Cody",{"$f":"IF(ISNA(IF(VLOOKUP(A187,Draft!E:E,1,FALSE)=A187,\"Yes\")),\"\",IF(VLOOKUP(A187,Draft!E:E,1,FALSE)=A187,\"Yes\"))","v":""}]
[173,"Arnett, Eric",{"$f":"IF(ISNA(IF(VLOOKUP(A188,Draft!E:E,1,FALSE)=A188,\"Yes\")),\"\",IF(VLOOKUP(A188,Draft!E:E,1,FALSE)=A188,\"Yes\"))","v":""}]
[174,"Heckathorn, Kyle",{"$f":"IF(ISNA(IF(VLOOKUP(A189,Draft!E:E,1,FALSE)=A189,\"Yes\")),\"\",IF(VLOOKUP(A189,Draft!E:E,1,FALSE)=A189,\"Yes\"))","v":""}]
[175,"Vizcaino, Arodys",{"$f":"IF(ISNA(IF(VLOOKUP(A190,Draft!E:E,1,FALSE)=A190,\"Yes\")),\"\",IF(VLOOKUP(A190,Draft!E:E,1,FALSE)=A190,\"Yes\"))","v":"Yes"}]
[176,"Marek, Stephen",{"$f":"IF(ISNA(IF(VLOOKUP(A191,Draft!E:E,1,FALSE)=A191,\"Yes\")),\"\",IF(VLOOKUP(A191,Draft!E:E,1,FALSE)=A191,\"Yes\"))","v":""}]
[177,"Teheran, Julio",{"$f":"IF(ISNA(IF(VLOOKUP(A192,Draft!E:E,1,FALSE)=A192,\"Yes\")),\"\",IF(VLOOKUP(A192,Draft!E:E,1,FALSE)=A192,\"Yes\"))","v":"Yes"}]
[178,"Redmond, Todd",{"$f":"IF(ISNA(IF(VLOOKUP(A193,Draft!E:E,1,FALSE)=A193,\"Yes\")),\"\",IF(VLOOKUP(A193,Draft!E:E,1,FALSE)=A193,\"Yes\"))","v":""}]
[179,"Minor, Michael",{"$f":"IF(ISNA(IF(VLOOKUP(A194,Draft!E:E,1,FALSE)=A194,\"Yes\")),\"\",IF(VLOOKUP(A194,Draft!E:E,1,FALSE)=A194,\"Yes\"))","v":"Yes"}]
[180,"Hale, David",{"$f":"IF(ISNA(IF(VLOOKUP(A195,Draft!E:E,1,FALSE)=A195,\"Yes\")),\"\",IF(VLOOKUP(A195,Draft!E:E,1,FALSE)=A195,\"Yes\"))","v":""}]
[181,"Cashner, Andrew",{"$f":"IF(ISNA(IF(VLOOKUP(A196,Draft!E:E,1,FALSE)=A196,\"Yes\")),\"\",IF(VLOOKUP(A196,Draft!E:E,1,FALSE)=A196,\"Yes\"))","v":"Yes"}]
[182,"Jackson, Jay",{"$f":"IF(ISNA(IF(VLOOKUP(A197,Draft!E:E,1,FALSE)=A197,\"Yes\")),\"\",IF(VLOOKUP(A197,Draft!E:E,1,FALSE)=A197,\"Yes\"))","v":""}]
[183,"Papelbon, Jeremy",{"$f":"IF(ISNA(IF(VLOOKUP(A198,Draft!E:E,1,FALSE)=A198,\"Yes\")),\"\",IF(VLOOKUP(A198,Draft!E:E,1,FALSE)=A198,\"Yes\"))","v":""}]
[184,"Wood, Travis",{"$f":"IF(ISNA(IF(VLOOKUP(A199,Draft!E:E,1,FALSE)=A199,\"Yes\")),\"\",IF(VLOOKUP(A199,Draft!E:E,1,FALSE)=A199,\"Yes\"))","v":"Yes"}]
[185,"Leake, Michael",{"$f":"IF(ISNA(IF(VLOOKUP(A200,Draft!E:E,1,FALSE)=A200,\"Yes\")),\"\",IF(VLOOKUP(A200,Draft!E:E,1,FALSE)=A200,\"Yes\"))","v":"Yes"}]
[186,"Boxberger, Bradley",{"$f":"IF(ISNA(IF(VLOOKUP(A201,Draft!E:E,1,FALSE)=A201,\"Yes\")),\"\",IF(VLOOKUP(A201,Draft!E:E,1,FALSE)=A201,\"Yes\"))","v":""}]
[187,"Chapman, Aroldis",{"$f":"IF(ISNA(IF(VLOOKUP(A202,Draft!E:E,1,FALSE)=A202,\"Yes\")),\"\",IF(VLOOKUP(A202,Draft!E:E,1,FALSE)=A202,\"Yes\"))","v":"Yes"}]
[188,"Lyles, Jordan",{"$f":"IF(ISNA(IF(VLOOKUP(A203,Draft!E:E,1,FALSE)=A203,\"Yes\")),\"\",IF(VLOOKUP(A203,Draft!E:E,1,FALSE)=A203,\"Yes\"))","v":"Yes"}]
[189,"Trinidad, Polin",{"$f":"IF(ISNA(IF(VLOOKUP(A204,Draft!E:E,1,FALSE)=A204,\"Yes\")),\"\",IF(VLOOKUP(A204,Draft!E:E,1,FALSE)=A204,\"Yes\"))","v":""}]
[190,"Bashue, Tanner",{"$f":"IF(ISNA(IF(VLOOKUP(A205,Draft!E:E,1,FALSE)=A205,\"Yes\")),\"\",IF(VLOOKUP(A205,Draft!E:E,1,FALSE)=A205,\"Yes\"))","v":""}]
[191,"Lo, Chia-Jen",{"$f":"IF(ISNA(IF(VLOOKUP(A206,Draft!E:E,1,FALSE)=A206,\"Yes\")),\"\",IF(VLOOKUP(A206,Draft!E:E,1,FALSE)=A206,\"Yes\"))","v":""}]
[192,"Ely, John",{"$f":"IF(ISNA(IF(VLOOKUP(A207,Draft!E:E,1,FALSE)=A207,\"Yes\")),\"\",IF(VLOOKUP(A207,Draft!E:E,1,FALSE)=A207,\"Yes\"))","v":""}]
[193,"Zerpa, Armando",{"$f":"IF(ISNA(IF(VLOOKUP(A208,Draft!E:E,1,FALSE)=A208,\"Yes\")),\"\",IF(VLOOKUP(A208,Draft!E:E,1,FALSE)=A208,\"Yes\"))","v":""}]
[194,"Martin, Ethan",{"$f":"IF(ISNA(IF(VLOOKUP(A209,Draft!E:E,1,FALSE)=A209,\"Yes\")),\"\",IF(VLOOKUP(A209,Draft!E:E,1,FALSE)=A209,\"Yes\"))","v":"Yes"}]
[195,"Lindblom, Josh",{"$f":"IF(ISNA(IF(VLOOKUP(A210,Draft!E:E,1,FALSE)=A210,\"Yes\")),\"\",IF(VLOOKUP(A210,Draft!E:E,1,FALSE)=A210,\"Yes\"))","v":""}]
[196,"Withrow, Christopher",{"$f":"IF(ISNA(IF(VLOOKUP(A211,Draft!E:E,1,FALSE)=A211,\"Yes\")),\"\",IF(VLOOKUP(A211,Draft!E:E,1,FALSE)=A211,\"Yes\"))","v":"Yes"}]
[197,"Miller, Aaron",{"$f":"IF(ISNA(IF(VLOOKUP(A212,Draft!E:E,1,FALSE)=A212,\"Yes\")),\"\",IF(VLOOKUP(A212,Draft!E:E,1,FALSE)=A212,\"Yes\"))","v":"Yes"}]
[198,"Gould, Garrett",{"$f":"IF(ISNA(IF(VLOOKUP(A213,Draft!E:E,1,FALSE)=A213,\"Yes\")),\"\",IF(VLOOKUP(A213,Draft!E:E,1,FALSE)=A213,\"Yes\"))","v":""}]
[199,"English, Jesse",{"$f":"IF(ISNA(IF(VLOOKUP(A214,Draft!E:E,1,FALSE)=A214,\"Yes\")),\"\",IF(VLOOKUP(A214,Draft!E:E,1,FALSE)=A214,\"Yes\"))","v":""}]
[200,"Thompson, Aaron",{"$f":"IF(ISNA(IF(VLOOKUP(A215,Draft!E:E,1,FALSE)=A215,\"Yes\")),\"\",IF(VLOOKUP(A215,Draft!E:E,1,FALSE)=A215,\"Yes\"))","v":""}]
[201,"Strasburg, Stephen",{"$f":"IF(ISNA(IF(VLOOKUP(A216,Draft!E:E,1,FALSE)=A216,\"Yes\")),\"\",IF(VLOOKUP(A216,Draft!E:E,1,FALSE)=A216,\"Yes\"))","v":"Yes"}]
[202,"Holt, Brad",{"$f":"IF(ISNA(IF(VLOOKUP(A217,Draft!E:E,1,FALSE)=A217,\"Yes\")),\"\",IF(VLOOKUP(A217,Draft!E:E,1,FALSE)=A217,\"Yes\"))","v":""}]
[203,"Mejia, Jenrry",{"$f":"IF(ISNA(IF(VLOOKUP(A218,Draft!E:E,1,FALSE)=A218,\"Yes\")),\"\",IF(VLOOKUP(A218,Draft!E:E,1,FALSE)=A218,\"Yes\"))","v":"Yes"}]
[204,"Matz, Steven",{"$f":"IF(ISNA(IF(VLOOKUP(A219,Draft!E:E,1,FALSE)=A219,\"Yes\")),\"\",IF(VLOOKUP(A219,Draft!E:E,1,FALSE)=A219,\"Yes\"))","v":""}]
[205,"Everts, Clint",{"$f":"IF(ISNA(IF(VLOOKUP(A220,Draft!E:E,1,FALSE)=A220,\"Yes\")),\"\",IF(VLOOKUP(A220,Draft!E:E,1,FALSE)=A220,\"Yes\"))","v":""}]
[206,"Aumont, Phillippe",{"$f":"IF(ISNA(IF(VLOOKUP(A221,Draft!E:E,1,FALSE)=A221,\"Yes\")),\"\",IF(VLOOKUP(A221,Draft!E:E,1,FALSE)=A221,\"Yes\"))","v":"Yes"}]
[207,"Ramirez, Juan",{"$f":"IF(ISNA(IF(VLOOKUP(A222,Draft!E:E,1,FALSE)=A222,\"Yes\")),\"\",IF(VLOOKUP(A222,Draft!E:E,1,FALSE)=A222,\"Yes\"))","v":""}]
[208,"Naylor, Drew",{"$f":"IF(ISNA(IF(VLOOKUP(A223,Draft!E:E,1,FALSE)=A223,\"Yes\")),\"\",IF(VLOOKUP(A223,Draft!E:E,1,FALSE)=A223,\"Yes\"))","v":""}]
[209,"May, Trevor",{"$f":"IF(ISNA(IF(VLOOKUP(A224,Draft!E:E,1,FALSE)=A224,\"Yes\")),\"\",IF(VLOOKUP(A224,Draft!E:E,1,FALSE)=A224,\"Yes\"))","v":""}]
[210,"Alderson, Tim",{"$f":"IF(ISNA(IF(VLOOKUP(A225,Draft!E:E,1,FALSE)=A225,\"Yes\")),\"\",IF(VLOOKUP(A225,Draft!E:E,1,FALSE)=A225,\"Yes\"))","v":"Yes"}]
[211,"Lincoln, Brad",{"$f":"IF(ISNA(IF(VLOOKUP(A226,Draft!E:E,1,FALSE)=A226,\"Yes\")),\"\",IF(VLOOKUP(A226,Draft!E:E,1,FALSE)=A226,\"Yes\"))","v":"Yes"}]
[212,"Morris, Bryan(Avery)",{"$f":"IF(ISNA(IF(VLOOKUP(A227,Draft!E:E,1,FALSE)=A227,\"Yes\")),\"\",IF(VLOOKUP(A227,Draft!E:E,1,FALSE)=A227,\"Yes\"))","v":""}]
[213,"Black, Victor",{"$f":"IF(ISNA(IF(VLOOKUP(A228,Draft!E:E,1,FALSE)=A228,\"Yes\")),\"\",IF(VLOOKUP(A228,Draft!E:E,1,FALSE)=A228,\"Yes\"))","v":""}]
[214,"Pounders, Brooks",{"$f":"IF(ISNA(IF(VLOOKUP(A229,Draft!E:E,1,FALSE)=A229,\"Yes\")),\"\",IF(VLOOKUP(A229,Draft!E:E,1,FALSE)=A229,\"Yes\"))","v":""}]
[215,"VonRosenberg, Zack",{"$f":"IF(ISNA(IF(VLOOKUP(A230,Draft!E:E,1,FALSE)=A230,\"Yes\")),\"\",IF(VLOOKUP(A230,Draft!E:E,1,FALSE)=A230,\"Yes\"))","v":""}]
[216,"Lynn, Lance",{"$f":"IF(ISNA(IF(VLOOKUP(A231,Draft!E:E,1,FALSE)=A231,\"Yes\")),\"\",IF(VLOOKUP(A231,Draft!E:E,1,FALSE)=A231,\"Yes\"))","v":""}]
[217,"Ottavino, Adam",{"$f":"IF(ISNA(IF(VLOOKUP(A232,Draft!E:E,1,FALSE)=A232,\"Yes\")),\"\",IF(VLOOKUP(A232,Draft!E:E,1,FALSE)=A232,\"Yes\"))","v":""}]
[218,"Miller, Shelby",{"$f":"IF(ISNA(IF(VLOOKUP(A233,Draft!E:E,1,FALSE)=A233,\"Yes\")),\"\",IF(VLOOKUP(A233,Draft!E:E,1,FALSE)=A233,\"Yes\"))","v":"Yes"}]
[219,"Jukich, Ben",{"$f":"IF(ISNA(IF(VLOOKUP(A234,Draft!E:E,1,FALSE)=A234,\"Yes\")),\"\",IF(VLOOKUP(A234,Draft!E:E,1,FALSE)=A234,\"Yes\"))","v":""}]
[220,"Italiano, Craig",{"$f":"IF(ISNA(IF(VLOOKUP(A235,Draft!E:E,1,FALSE)=A235,\"Yes\")),\"\",IF(VLOOKUP(A235,Draft!E:E,1,FALSE)=A235,\"Yes\"))","v":""}]
[221,"Castro, Simon",{"$f":"IF(ISNA(IF(VLOOKUP(A236,Draft!E:E,1,FALSE)=A236,\"Yes\")),\"\",IF(VLOOKUP(A236,Draft!E:E,1,FALSE)=A236,\"Yes\"))","v":"Yes"}]
[222,"Luebke, Cory",{"$f":"IF(ISNA(IF(VLOOKUP(A237,Draft!E:E,1,FALSE)=A237,\"Yes\")),\"\",IF(VLOOKUP(A237,Draft!E:E,1,FALSE)=A237,\"Yes\"))","v":""}]
[223,"Garrison, Steve",{"$f":"IF(ISNA(IF(VLOOKUP(A238,Draft!E:E,1,FALSE)=A238,\"Yes\")),\"\",IF(VLOOKUP(A238,Draft!E:E,1,FALSE)=A238,\"Yes\"))","v":""}]
[224,"Sosa, Henry",{"$f":"IF(ISNA(IF(VLOOKUP(A239,Draft!E:E,1,FALSE)=A239,\"Yes\")),\"\",IF(VLOOKUP(A239,Draft!E:E,1,FALSE)=A239,\"Yes\"))","v":"Yes"}]
[225,"Pucetas, Kevin",{"$f":"IF(ISNA(IF(VLOOKUP(A240,Draft!E:E,1,FALSE)=A240,\"Yes\")),\"\",IF(VLOOKUP(A240,Draft!E:E,1,FALSE)=A240,\"Yes\"))","v":""}]
[226,"Johnson, Steve",{"$f":"IF(ISNA(IF(VLOOKUP(A241,Draft!E:E,1,FALSE)=A241,\"Yes\")),\"\",IF(VLOOKUP(A241,Draft!E:E,1,FALSE)=A241,\"Yes\"))","v":""}]
[227,"Wheeler, Zach",{"$f":"IF(ISNA(IF(VLOOKUP(A242,Draft!E:E,1,FALSE)=A242,\"Yes\")),\"\",IF(VLOOKUP(A242,Draft!E:E,1,FALSE)=A242,\"Yes\"))","v":"Yes"}]
[228,"Friedrich, Christian",{"$f":"IF(ISNA(IF(VLOOKUP(A243,Draft!E:E,1,FALSE)=A243,\"Yes\")),\"\",IF(VLOOKUP(A243,Draft!E:E,1,FALSE)=A243,\"Yes\"))","v":"Yes"}]
[229,"Lindsay, Shane",{"$f":"IF(ISNA(IF(VLOOKUP(A244,Draft!E:E,1,FALSE)=A244,\"Yes\")),\"\",IF(VLOOKUP(A244,Draft!E:E,1,FALSE)=A244,\"Yes\"))","v":""}]
[230,"Matzek, Tyler",{"$f":"IF(ISNA(IF(VLOOKUP(A245,Draft!E:E,1,FALSE)=A245,\"Yes\")),\"\",IF(VLOOKUP(A245,Draft!E:E,1,FALSE)=A245,\"Yes\"))","v":"Yes"}]
[231,"Brothers, Rex",{"$f":"IF(ISNA(IF(VLOOKUP(A246,Draft!E:E,1,FALSE)=A246,\"Yes\")),\"\",IF(VLOOKUP(A246,Draft!E:E,1,FALSE)=A246,\"Yes\"))","v":""}]
[232,"Ceda, Jose",{"$f":"IF(ISNA(IF(VLOOKUP(A247,Draft!E:E,1,FALSE)=A247,\"Yes\")),\"\",IF(VLOOKUP(A247,Draft!E:E,1,FALSE)=A247,\"Yes\"))","v":""}]
[233,"Sinkbeil, Brett",{"$f":"IF(ISNA(IF(VLOOKUP(A248,Draft!E:E,1,FALSE)=A248,\"Yes\")),\"\",IF(VLOOKUP(A248,Draft!E:E,1,FALSE)=A248,\"Yes\"))","v":""}]
[234,"James, Chad",{"$f":"IF(ISNA(IF(VLOOKUP(A249,Draft!E:E,1,FALSE)=A249,\"Yes\")),\"\",IF(VLOOKUP(A249,Draft!E:E,1,FALSE)=A249,\"Yes\"))","v":"Yes"}]
[235,"Berglund, Bryan",{"$f":"IF(ISNA(IF(VLOOKUP(A250,Draft!E:E,1,FALSE)=A250,\"Yes\")),\"\",IF(VLOOKUP(A250,Draft!E:E,1,FALSE)=A250,\"Yes\"))","v":""}]
[236,"Parker, Jarrod",{"$f":"IF(ISNA(IF(VLOOKUP(A251,Draft!E:E,1,FALSE)=A251,\"Yes\")),\"\",IF(VLOOKUP(A251,Draft!E:E,1,FALSE)=A251,\"Yes\"))","v":"Yes"}]
[237,"Valdez, Cesar",{"$f":"IF(ISNA(IF(VLOOKUP(A252,Draft!E:E,1,FALSE)=A252,\"Yes\")),\"\",IF(VLOOKUP(A252,Draft!E:E,1,FALSE)=A252,\"Yes\"))","v":""}]
[238,"Belfiore, Michael",{"$f":"IF(ISNA(IF(VLOOKUP(A253,Draft!E:E,1,FALSE)=A253,\"Yes\")),\"\",IF(VLOOKUP(A253,Draft!E:E,1,FALSE)=A253,\"Yes\"))","v":""}]
[239,"Smith, Eric",{"$f":"IF(ISNA(IF(VLOOKUP(A254,Draft!E:E,1,FALSE)=A254,\"Yes\")),\"\",IF(VLOOKUP(A254,Draft!E:E,1,FALSE)=A254,\"Yes\"))","v":""}]
[240,"Coffey, Todd",{"$f":"IF(ISNA(IF(VLOOKUP(A255,Draft!E:E,1,FALSE)=A255,\"Yes\")),\"\",IF(VLOOKUP(A255,Draft!E:E,1,FALSE)=A255,\"Yes\"))","v":"Yes"}]
[241,"Troncoso, Ramon",{"$f":"IF(ISNA(IF(VLOOKUP(A256,Draft!E:E,1,FALSE)=A256,\"Yes\")),\"\",IF(VLOOKUP(A256,Draft!E:E,1,FALSE)=A256,\"Yes\"))","v":"Yes"}]
[242,"Fulchino, Jeff",{"$f":"IF(ISNA(IF(VLOOKUP(A257,Draft!E:E,1,FALSE)=A257,\"Yes\")),\"\",IF(VLOOKUP(A257,Draft!E:E,1,FALSE)=A257,\"Yes\"))","v":""}]
[243,"Madson, Ryan",{"$f":"IF(ISNA(IF(VLOOKUP(A258,Draft!E:E,1,FALSE)=A258,\"Yes\")),\"\",IF(VLOOKUP(A258,Draft!E:E,1,FALSE)=A258,\"Yes\"))","v":"Yes"}]
[244,"Lyon, Brandon",{"$f":"IF(ISNA(IF(VLOOKUP(A259,Draft!E:E,1,FALSE)=A259,\"Yes\")),\"\",IF(VLOOKUP(A259,Draft!E:E,1,FALSE)=A259,\"Yes\"))","v":"Yes"}]
[245,"Broxton, Jonathan",{"$f":"IF(ISNA(IF(VLOOKUP(A260,Draft!E:E,1,FALSE)=A260,\"Yes\")),\"\",IF(VLOOKUP(A260,Draft!E:E,1,FALSE)=A260,\"Yes\"))","v":"Yes"}]
[246,"Masset, Nick",{"$f":"IF(ISNA(IF(VLOOKUP(A261,Draft!E:E,1,FALSE)=A261,\"Yes\")),\"\",IF(VLOOKUP(A261,Draft!E:E,1,FALSE)=A261,\"Yes\"))","v":"Yes"}]
[247,"Gregerson, Luke",{"$f":"IF(ISNA(IF(VLOOKUP(A262,Draft!E:E,1,FALSE)=A262,\"Yes\")),\"\",IF(VLOOKUP(A262,Draft!E:E,1,FALSE)=A262,\"Yes\"))","v":"Yes"}]
[248,"Marmol, Carlos",{"$f":"IF(ISNA(IF(VLOOKUP(A263,Draft!E:E,1,FALSE)=A263,\"Yes\")),\"\",IF(VLOOKUP(A263,Draft!E:E,1,FALSE)=A263,\"Yes\"))","v":"Yes"}]
[249,"Moylan, Peter",{"$f":"IF(ISNA(IF(VLOOKUP(A264,Draft!E:E,1,FALSE)=A264,\"Yes\")),\"\",IF(VLOOKUP(A264,Draft!E:E,1,FALSE)=A264,\"Yes\"))","v":"Yes"}]
[250,"Heilman, Aaron",{"$f":"IF(ISNA(IF(VLOOKUP(A265,Draft!E:E,1,FALSE)=A265,\"Yes\")),\"\",IF(VLOOKUP(A265,Draft!E:E,1,FALSE)=A265,\"Yes\"))","v":"Yes"}]
[251,"Grabow, John",{"$f":"IF(ISNA(IF(VLOOKUP(A266,Draft!E:E,1,FALSE)=A266,\"Yes\")),\"\",IF(VLOOKUP(A266,Draft!E:E,1,FALSE)=A266,\"Yes\"))","v":"Yes"}]
[252,"Wilson, Brian",{"$f":"IF(ISNA(IF(VLOOKUP(A267,Draft!E:E,1,FALSE)=A267,\"Yes\")),\"\",IF(VLOOKUP(A267,Draft!E:E,1,FALSE)=A267,\"Yes\"))","v":"Yes"}]
[253,"Baez, Danys",{"$f":"IF(ISNA(IF(VLOOKUP(A268,Draft!E:E,1,FALSE)=A268,\"Yes\")),\"\",IF(VLOOKUP(A268,Draft!E:E,1,FALSE)=A268,\"Yes\"))","v":"Yes"}]
[254,"Gutierrez, Juan",{"$f":"IF(ISNA(IF(VLOOKUP(A269,Draft!E:E,1,FALSE)=A269,\"Yes\")),\"\",IF(VLOOKUP(A269,Draft!E:E,1,FALSE)=A269,\"Yes\"))","v":""}]
[255,"Belisario, Ronald",{"$f":"IF(ISNA(IF(VLOOKUP(A270,Draft!E:E,1,FALSE)=A270,\"Yes\")),\"\",IF(VLOOKUP(A270,Draft!E:E,1,FALSE)=A270,\"Yes\"))","v":""}]
[256,"Stokes, Brian",{"$f":"IF(ISNA(IF(VLOOKUP(A271,Draft!E:E,1,FALSE)=A271,\"Yes\")),\"\",IF(VLOOKUP(A271,Draft!E:E,1,FALSE)=A271,\"Yes\"))","v":""}]
[257,"Durbin, Chad",{"$f":"IF(ISNA(IF(VLOOKUP(A272,Draft!E:E,1,FALSE)=A272,\"Yes\")),\"\",IF(VLOOKUP(A272,Draft!E:E,1,FALSE)=A272,\"Yes\"))","v":""}]
[258,"Bell, Heath",{"$f":"IF(ISNA(IF(VLOOKUP(A273,Draft!E:E,1,FALSE)=A273,\"Yes\")),\"\",IF(VLOOKUP(A273,Draft!E:E,1,FALSE)=A273,\"Yes\"))","v":"Yes"}]
[259,"Green, Sean",{"$f":"IF(ISNA(IF(VLOOKUP(A274,Draft!E:E,1,FALSE)=A274,\"Yes\")),\"\",IF(VLOOKUP(A274,Draft!E:E,1,FALSE)=A274,\"Yes\"))","v":"Yes"}]
[260,"Sherrill, George",{"$f":"IF(ISNA(IF(VLOOKUP(A275,Draft!E:E,1,FALSE)=A275,\"Yes\")),\"\",IF(VLOOKUP(A275,Draft!E:E,1,FALSE)=A275,\"Yes\"))","v":"Yes"}]
[261,"Nunez, Leo",{"$f":"IF(ISNA(IF(VLOOKUP(A276,Draft!E:E,1,FALSE)=A276,\"Yes\")),\"\",IF(VLOOKUP(A276,Draft!E:E,1,FALSE)=A276,\"Yes\"))","v":"Yes"}]
[262,"Medders, Brandon",{"$f":"IF(ISNA(IF(VLOOKUP(A277,Draft!E:E,1,FALSE)=A277,\"Yes\")),\"\",IF(VLOOKUP(A277,Draft!E:E,1,FALSE)=A277,\"Yes\"))","v":""}]
[263,"Rodriguez, Francisco",{"$f":"IF(ISNA(IF(VLOOKUP(A278,Draft!E:E,1,FALSE)=A278,\"Yes\")),\"\",IF(VLOOKUP(A278,Draft!E:E,1,FALSE)=A278,\"Yes\"))","v":"Yes"}]
[264,"Chavez, Jesse",{"$f":"IF(ISNA(IF(VLOOKUP(A279,Draft!E:E,1,FALSE)=A279,\"Yes\")),\"\",IF(VLOOKUP(A279,Draft!E:E,1,FALSE)=A279,\"Yes\"))","v":""}]
[265,"Cordero, Francisco",{"$f":"IF(ISNA(IF(VLOOKUP(A280,Draft!E:E,1,FALSE)=A280,\"Yes\")),\"\",IF(VLOOKUP(A280,Draft!E:E,1,FALSE)=A280,\"Yes\"))","v":"Yes"}]
[266,"McClellan, Kyle",{"$f":"IF(ISNA(IF(VLOOKUP(A281,Draft!E:E,1,FALSE)=A281,\"Yes\")),\"\",IF(VLOOKUP(A281,Draft!E:E,1,FALSE)=A281,\"Yes\"))","v":"Yes"}]
[267,"Hanrahan, Joel",{"$f":"IF(ISNA(IF(VLOOKUP(A282,Draft!E:E,1,FALSE)=A282,\"Yes\")),\"\",IF(VLOOKUP(A282,Draft!E:E,1,FALSE)=A282,\"Yes\"))","v":""}]
[268,"Howry, Bob",{"$f":"IF(ISNA(IF(VLOOKUP(A283,Draft!E:E,1,FALSE)=A283,\"Yes\")),\"\",IF(VLOOKUP(A283,Draft!E:E,1,FALSE)=A283,\"Yes\"))","v":""}]
[269,"Hawkins, LaTroy",{"$f":"IF(ISNA(IF(VLOOKUP(A284,Draft!E:E,1,FALSE)=A284,\"Yes\")),\"\",IF(VLOOKUP(A284,Draft!E:E,1,FALSE)=A284,\"Yes\"))","v":"Yes"}]
[270,"Affeldt, Jeremy",{"$f":"IF(ISNA(IF(VLOOKUP(A285,Draft!E:E,1,FALSE)=A285,\"Yes\")),\"\",IF(VLOOKUP(A285,Draft!E:E,1,FALSE)=A285,\"Yes\"))","v":"Yes"}]
[271,"Street, Huston",{"$f":"IF(ISNA(IF(VLOOKUP(A286,Draft!E:E,1,FALSE)=A286,\"Yes\")),\"\",IF(VLOOKUP(A286,Draft!E:E,1,FALSE)=A286,\"Yes\"))","v":"Yes"}]
[272,"Herrera, DannyRay",{"$f":"IF(ISNA(IF(VLOOKUP(A287,Draft!E:E,1,FALSE)=A287,\"Yes\")),\"\",IF(VLOOKUP(A287,Draft!E:E,1,FALSE)=A287,\"Yes\"))","v":"Yes"}]
[273,"Byrdak, Tim",{"$f":"IF(ISNA(IF(VLOOKUP(A288,Draft!E:E,1,FALSE)=A288,\"Yes\")),\"\",IF(VLOOKUP(A288,Draft!E:E,1,FALSE)=A288,\"Yes\"))","v":"Yes"}]
[274,"Pinto, Renyel",{"$f":"IF(ISNA(IF(VLOOKUP(A289,Draft!E:E,1,FALSE)=A289,\"Yes\")),\"\",IF(VLOOKUP(A289,Draft!E:E,1,FALSE)=A289,\"Yes\"))","v":"Yes"}]
[275,"Franklin, Ryan",{"$f":"IF(ISNA(IF(VLOOKUP(A290,Draft!E:E,1,FALSE)=A290,\"Yes\")),\"\",IF(VLOOKUP(A290,Draft!E:E,1,FALSE)=A290,\"Yes\"))","v":"Yes"}]
[276,"Guzman, Angel",{"$f":"IF(ISNA(IF(VLOOKUP(A291,Draft!E:E,1,FALSE)=A291,\"Yes\")),\"\",IF(VLOOKUP(A291,Draft!E:E,1,FALSE)=A291,\"Yes\"))","v":""}]
[277,"Clippard, Tyler",{"$f":"IF(ISNA(IF(VLOOKUP(A292,Draft!E:E,1,FALSE)=A292,\"Yes\")),\"\",IF(VLOOKUP(A292,Draft!E:E,1,FALSE)=A292,\"Yes\"))","v":"Yes"}]
[278,"Perdomo, Luis",{"$f":"IF(ISNA(IF(VLOOKUP(A293,Draft!E:E,1,FALSE)=A293,\"Yes\")),\"\",IF(VLOOKUP(A293,Draft!E:E,1,FALSE)=A293,\"Yes\"))","v":""}]
[279,"Feliciano, Pedro",{"$f":"IF(ISNA(IF(VLOOKUP(A294,Draft!E:E,1,FALSE)=A294,\"Yes\")),\"\",IF(VLOOKUP(A294,Draft!E:E,1,FALSE)=A294,\"Yes\"))","v":"Yes"}]
[280,"Burton, Jared",{"$f":"IF(ISNA(IF(VLOOKUP(A295,Draft!E:E,1,FALSE)=A295,\"Yes\")),\"\",IF(VLOOKUP(A295,Draft!E:E,1,FALSE)=A295,\"Yes\"))","v":""}]
[281,"Lidge, Brad",{"$f":"IF(ISNA(IF(VLOOKUP(A296,Draft!E:E,1,FALSE)=A296,\"Yes\")),\"\",IF(VLOOKUP(A296,Draft!E:E,1,FALSE)=A296,\"Yes\"))","v":"Yes"}]
[282,"Meyer, Dan",{"$f":"IF(ISNA(IF(VLOOKUP(A297,Draft!E:E,1,FALSE)=A297,\"Yes\")),\"\",IF(VLOOKUP(A297,Draft!E:E,1,FALSE)=A297,\"Yes\"))","v":"Yes"}]
[283,"Burnett, Sean",{"$f":"IF(ISNA(IF(VLOOKUP(A298,Draft!E:E,1,FALSE)=A298,\"Yes\")),\"\",IF(VLOOKUP(A298,Draft!E:E,1,FALSE)=A298,\"Yes\"))","v":"Yes"}]
[284,"Motte, Jason",{"$f":"IF(ISNA(IF(VLOOKUP(A299,Draft!E:E,1,FALSE)=A299,\"Yes\")),\"\",IF(VLOOKUP(A299,Draft!E:E,1,FALSE)=A299,\"Yes\"))","v":"Yes"}]
[285,"O'Flaherty, Eric",{"$f":"IF(ISNA(IF(VLOOKUP(A300,Draft!E:E,1,FALSE)=A300,\"Yes\")),\"\",IF(VLOOKUP(A300,Draft!E:E,1,FALSE)=A300,\"Yes\"))","v":"Yes"}]
[286,"Sanches, Brian",{"$f":"IF(ISNA(IF(VLOOKUP(A301,Draft!E:E,1,FALSE)=A301,\"Yes\")),\"\",IF(VLOOKUP(A301,Draft!E:E,1,FALSE)=A301,\"Yes\"))","v":""}]
[287,"Betancourt, Rafael",{"$f":"IF(ISNA(IF(VLOOKUP(A302,Draft!E:E,1,FALSE)=A302,\"Yes\")),\"\",IF(VLOOKUP(A302,Draft!E:E,1,FALSE)=A302,\"Yes\"))","v":"Yes"}]
[288,"Saito, Takashi",{"$f":"IF(ISNA(IF(VLOOKUP(A303,Draft!E:E,1,FALSE)=A303,\"Yes\")),\"\",IF(VLOOKUP(A303,Draft!E:E,1,FALSE)=A303,\"Yes\"))","v":"Yes"}]
[289,"Sampson, Chris",{"$f":"IF(ISNA(IF(VLOOKUP(A304,Draft!E:E,1,FALSE)=A304,\"Yes\")),\"\",IF(VLOOKUP(A304,Draft!E:E,1,FALSE)=A304,\"Yes\"))","v":""}]
[290,"Boyer, Blaine",{"$f":"IF(ISNA(IF(VLOOKUP(A305,Draft!E:E,1,FALSE)=A305,\"Yes\")),\"\",IF(VLOOKUP(A305,Draft!E:E,1,FALSE)=A305,\"Yes\"))","v":""}]
[291,"Capps, Matt",{"$f":"IF(ISNA(IF(VLOOKUP(A306,Draft!E:E,1,FALSE)=A306,\"Yes\")),\"\",IF(VLOOKUP(A306,Draft!E:E,1,FALSE)=A306,\"Yes\"))","v":"Yes"}]
[292,"Hoffman, Trevor",{"$f":"IF(ISNA(IF(VLOOKUP(A307,Draft!E:E,1,FALSE)=A307,\"Yes\")),\"\",IF(VLOOKUP(A307,Draft!E:E,1,FALSE)=A307,\"Yes\"))","v":"Yes"}]
[293,"Rhodes, Arthur",{"$f":"IF(ISNA(IF(VLOOKUP(A308,Draft!E:E,1,FALSE)=A308,\"Yes\")),\"\",IF(VLOOKUP(A308,Draft!E:E,1,FALSE)=A308,\"Yes\"))","v":"Yes"}]
[294,"Vasquez, Esmerling",{"$f":"IF(ISNA(IF(VLOOKUP(A309,Draft!E:E,1,FALSE)=A309,\"Yes\")),\"\",IF(VLOOKUP(A309,Draft!E:E,1,FALSE)=A309,\"Yes\"))","v":""}]
[295,"Fisher, Carlos",{"$f":"IF(ISNA(IF(VLOOKUP(A310,Draft!E:E,1,FALSE)=A310,\"Yes\")),\"\",IF(VLOOKUP(A310,Draft!E:E,1,FALSE)=A310,\"Yes\"))","v":""}]
[296,"Qualls, Chad",{"$f":"IF(ISNA(IF(VLOOKUP(A311,Draft!E:E,1,FALSE)=A311,\"Yes\")),\"\",IF(VLOOKUP(A311,Draft!E:E,1,FALSE)=A311,\"Yes\"))","v":"Yes"}]
[297,"Daley, Matt",{"$f":"IF(ISNA(IF(VLOOKUP(A312,Draft!E:E,1,FALSE)=A312,\"Yes\")),\"\",IF(VLOOKUP(A312,Draft!E:E,1,FALSE)=A312,\"Yes\"))","v":""}]
[298,"Zavada, Clay",{"$f":"IF(ISNA(IF(VLOOKUP(A313,Draft!E:E,1,FALSE)=A313,\"Yes\")),\"\",IF(VLOOKUP(A313,Draft!E:E,1,FALSE)=A313,\"Yes\"))","v":"Yes"}]
[299,"Bergmann, Jason",{"$f":"IF(ISNA(IF(VLOOKUP(A314,Draft!E:E,1,FALSE)=A314,\"Yes\")),\"\",IF(VLOOKUP(A314,Draft!E:E,1,FALSE)=A314,\"Yes\"))","v":""}]
[300,"Lindstrom, Matthew",{"$f":"IF(ISNA(IF(VLOOKUP(A315,Draft!E:E,1,FALSE)=A315,\"Yes\")),\"\",IF(VLOOKUP(A315,Draft!E:E,1,FALSE)=A315,\"Yes\"))","v":"Yes"}]
[301,"Meek, Evan",{"$f":"IF(ISNA(IF(VLOOKUP(A316,Draft!E:E,1,FALSE)=A316,\"Yes\")),\"\",IF(VLOOKUP(A316,Draft!E:E,1,FALSE)=A316,\"Yes\"))","v":""}]
[302,"Smith, Chris",{"$f":"IF(ISNA(IF(VLOOKUP(A317,Draft!E:E,1,FALSE)=A317,\"Yes\")),\"\",IF(VLOOKUP(A317,Draft!E:E,1,FALSE)=A317,\"Yes\"))","v":""}]
[303,"Arias, Alberto",{"$f":"IF(ISNA(IF(VLOOKUP(A318,Draft!E:E,1,FALSE)=A318,\"Yes\")),\"\",IF(VLOOKUP(A318,Draft!E:E,1,FALSE)=A318,\"Yes\"))","v":""}]
[304,"Burke, Greg",{"$f":"IF(ISNA(IF(VLOOKUP(A319,Draft!E:E,1,FALSE)=A319,\"Yes\")),\"\",IF(VLOOKUP(A319,Draft!E:E,1,FALSE)=A319,\"Yes\"))","v":""}]
[305,"Rosales, Leo",{"$f":"IF(ISNA(IF(VLOOKUP(A320,Draft!E:E,1,FALSE)=A320,\"Yes\")),\"\",IF(VLOOKUP(A320,Draft!E:E,1,FALSE)=A320,\"Yes\"))","v":""}]
[306,"Thatcher, Joe",{"$f":"IF(ISNA(IF(VLOOKUP(A321,Draft!E:E,1,FALSE)=A321,\"Yes\")),\"\",IF(VLOOKUP(A321,Draft!E:E,1,FALSE)=A321,\"Yes\"))","v":"Yes"}]
[307,"Stetter, Mitch",{"$f":"IF(ISNA(IF(VLOOKUP(A322,Draft!E:E,1,FALSE)=A322,\"Yes\")),\"\",IF(VLOOKUP(A322,Draft!E:E,1,FALSE)=A322,\"Yes\"))","v":"Yes"}]
[308,"Wright, Wesley",{"$f":"IF(ISNA(IF(VLOOKUP(A323,Draft!E:E,1,FALSE)=A323,\"Yes\")),\"\",IF(VLOOKUP(A323,Draft!E:E,1,FALSE)=A323,\"Yes\"))","v":""}]
[309,"Miller, Trever",{"$f":"IF(ISNA(IF(VLOOKUP(A324,Draft!E:E,1,FALSE)=A324,\"Yes\")),\"\",IF(VLOOKUP(A324,Draft!E:E,1,FALSE)=A324,\"Yes\"))","v":"Yes"}]
[310,"Jackson, Steven",{"$f":"IF(ISNA(IF(VLOOKUP(A325,Draft!E:E,1,FALSE)=A325,\"Yes\")),\"\",IF(VLOOKUP(A325,Draft!E:E,1,FALSE)=A325,\"Yes\"))","v":""}]
[311,"Vargas, Claudio",{"$f":"IF(ISNA(IF(VLOOKUP(A326,Draft!E:E,1,FALSE)=A326,\"Yes\")),\"\",IF(VLOOKUP(A326,Draft!E:E,1,FALSE)=A326,\"Yes\"))","v":""}]
[312,"Reyes, Dennys",{"$f":"IF(ISNA(IF(VLOOKUP(A327,Draft!E:E,1,FALSE)=A327,\"Yes\")),\"\",IF(VLOOKUP(A327,Draft!E:E,1,FALSE)=A327,\"Yes\"))","v":"Yes"}]
[313,"Ayala, Luis",{"$f":"IF(ISNA(IF(VLOOKUP(A328,Draft!E:E,1,FALSE)=A328,\"Yes\")),\"\",IF(VLOOKUP(A328,Draft!E:E,1,FALSE)=A328,\"Yes\"))","v":""}]
[314,"Morales, Franklin",{"$f":"IF(ISNA(IF(VLOOKUP(A329,Draft!E:E,1,FALSE)=A329,\"Yes\")),\"\",IF(VLOOKUP(A329,Draft!E:E,1,FALSE)=A329,\"Yes\"))","v":"Yes"}]
[315,"Bruney, Brian",{"$f":"IF(ISNA(IF(VLOOKUP(A330,Draft!E:E,1,FALSE)=A330,\"Yes\")),\"\",IF(VLOOKUP(A330,Draft!E:E,1,FALSE)=A330,\"Yes\"))","v":""}]
[316,"Guardado, Eddie",{"$f":"IF(ISNA(IF(VLOOKUP(A331,Draft!E:E,1,FALSE)=A331,\"Yes\")),\"\",IF(VLOOKUP(A331,Draft!E:E,1,FALSE)=A331,\"Yes\"))","v":""}]
[317,"Acosta, Manny",{"$f":"IF(ISNA(IF(VLOOKUP(A332,Draft!E:E,1,FALSE)=A332,\"Yes\")),\"\",IF(VLOOKUP(A332,Draft!E:E,1,FALSE)=A332,\"Yes\"))","v":""}]
[318,"Adams, Mike",{"$f":"IF(ISNA(IF(VLOOKUP(A333,Draft!E:E,1,FALSE)=A333,\"Yes\")),\"\",IF(VLOOKUP(A333,Draft!E:E,1,FALSE)=A333,\"Yes\"))","v":"Yes"}]
[319,"Kensing, Logan",{"$f":"IF(ISNA(IF(VLOOKUP(A334,Draft!E:E,1,FALSE)=A334,\"Yes\")),\"\",IF(VLOOKUP(A334,Draft!E:E,1,FALSE)=A334,\"Yes\"))","v":""}]
[320,"Romo, Sergio",{"$f":"IF(ISNA(IF(VLOOKUP(A335,Draft!E:E,1,FALSE)=A335,\"Yes\")),\"\",IF(VLOOKUP(A335,Draft!E:E,1,FALSE)=A335,\"Yes\"))","v":"Yes"}]
[321,"Corpas, Manuel",{"$f":"IF(ISNA(IF(VLOOKUP(A336,Draft!E:E,1,FALSE)=A336,\"Yes\")),\"\",IF(VLOOKUP(A336,Draft!E:E,1,FALSE)=A336,\"Yes\"))","v":""}]
[322,"Dessens, Elmer",{"$f":"IF(ISNA(IF(VLOOKUP(A337,Draft!E:E,1,FALSE)=A337,\"Yes\")),\"\",IF(VLOOKUP(A337,Draft!E:E,1,FALSE)=A337,\"Yes\"))","v":""}]
[323,"Kuo, Hong-Chih",{"$f":"IF(ISNA(IF(VLOOKUP(A338,Draft!E:E,1,FALSE)=A338,\"Yes\")),\"\",IF(VLOOKUP(A338,Draft!E:E,1,FALSE)=A338,\"Yes\"))","v":"Yes"}]
[324,"Taschner, Jack",{"$f":"IF(ISNA(IF(VLOOKUP(A339,Draft!E:E,1,FALSE)=A339,\"Yes\")),\"\",IF(VLOOKUP(A339,Draft!E:E,1,FALSE)=A339,\"Yes\"))","v":""}]
[325,"Wade, Cory",{"$f":"IF(ISNA(IF(VLOOKUP(A340,Draft!E:E,1,FALSE)=A340,\"Yes\")),\"\",IF(VLOOKUP(A340,Draft!E:E,1,FALSE)=A340,\"Yes\"))","v":""}]
[326,"Gray, Jeff",{"$f":"IF(ISNA(IF(VLOOKUP(A341,Draft!E:E,1,FALSE)=A341,\"Yes\")),\"\",IF(VLOOKUP(A341,Draft!E:E,1,FALSE)=A341,\"Yes\"))","v":""}]
[327,"Webb, Ryan",{"$f":"IF(ISNA(IF(VLOOKUP(A342,Draft!E:E,1,FALSE)=A342,\"Yes\")),\"\",IF(VLOOKUP(A342,Draft!E:E,1,FALSE)=A342,\"Yes\"))","v":""}]
[328,"Donnelly, Brendan",{"$f":"IF(ISNA(IF(VLOOKUP(A343,Draft!E:E,1,FALSE)=A343,\"Yes\")),\"\",IF(VLOOKUP(A343,Draft!E:E,1,FALSE)=A343,\"Yes\"))","v":""}]
[329,"Peralta, Joel",{"$f":"IF(ISNA(IF(VLOOKUP(A344,Draft!E:E,1,FALSE)=A344,\"Yes\")),\"\",IF(VLOOKUP(A344,Draft!E:E,1,FALSE)=A344,\"Yes\"))","v":""}]
[330,"Lincoln, Mike",{"$f":"IF(ISNA(IF(VLOOKUP(A345,Draft!E:E,1,FALSE)=A345,\"Yes\")),\"\",IF(VLOOKUP(A345,Draft!E:E,1,FALSE)=A345,\"Yes\"))","v":""}]
[331,"Wood, Tim",{"$f":"IF(ISNA(IF(VLOOKUP(A346,Draft!E:E,1,FALSE)=A346,\"Yes\")),\"\",IF(VLOOKUP(A346,Draft!E:E,1,FALSE)=A346,\"Yes\"))","v":""}]
[332,"Gervacio, Sammy",{"$f":"IF(ISNA(IF(VLOOKUP(A347,Draft!E:E,1,FALSE)=A347,\"Yes\")),\"\",IF(VLOOKUP(A347,Draft!E:E,1,FALSE)=A347,\"Yes\"))","v":"Yes"}]
[333,"Leach, Brent",{"$f":"IF(ISNA(IF(VLOOKUP(A348,Draft!E:E,1,FALSE)=A348,\"Yes\")),\"\",IF(VLOOKUP(A348,Draft!E:E,1,FALSE)=A348,\"Yes\"))","v":""}]
[334,"Corcoran, Roy",{"$f":"IF(ISNA(IF(VLOOKUP(A349,Draft!E:E,1,FALSE)=A349,\"Yes\")),\"\",IF(VLOOKUP(A349,Draft!E:E,1,FALSE)=A349,\"Yes\"))","v":""}]
[335,"Romero, J.C.",{"$f":"IF(ISNA(IF(VLOOKUP(A350,Draft!E:E,1,FALSE)=A350,\"Yes\")),\"\",IF(VLOOKUP(A350,Draft!E:E,1,FALSE)=A350,\"Yes\"))","v":""}]
[336,"Wagner, Billy",{"$f":"IF(ISNA(IF(VLOOKUP(A351,Draft!E:E,1,FALSE)=A351,\"Yes\")),\"\",IF(VLOOKUP(A351,Draft!E:E,1,FALSE)=A351,\"Yes\"))","v":"Yes"}]
[337,"Kinney, Josh",{"$f":"IF(ISNA(IF(VLOOKUP(A352,Draft!E:E,1,FALSE)=A352,\"Yes\")),\"\",IF(VLOOKUP(A352,Draft!E:E,1,FALSE)=A352,\"Yes\"))","v":""}]
[338,"Stevens, Jeff",{"$f":"IF(ISNA(IF(VLOOKUP(A353,Draft!E:E,1,FALSE)=A353,\"Yes\")),\"\",IF(VLOOKUP(A353,Draft!E:E,1,FALSE)=A353,\"Yes\"))","v":""}]
[339,"Jones, Hunter",{"$f":"IF(ISNA(IF(VLOOKUP(A354,Draft!E:E,1,FALSE)=A354,\"Yes\")),\"\",IF(VLOOKUP(A354,Draft!E:E,1,FALSE)=A354,\"Yes\"))","v":""}]
[340,"Russell, Adam",{"$f":"IF(ISNA(IF(VLOOKUP(A355,Draft!E:E,1,FALSE)=A355,\"Yes\")),\"\",IF(VLOOKUP(A355,Draft!E:E,1,FALSE)=A355,\"Yes\"))","v":""}]
[341,"Chulk, Vinnie",{"$f":"IF(ISNA(IF(VLOOKUP(A356,Draft!E:E,1,FALSE)=A356,\"Yes\")),\"\",IF(VLOOKUP(A356,Draft!E:E,1,FALSE)=A356,\"Yes\"))","v":""}]
[342,"Flores, Randy",{"$f":"IF(ISNA(IF(VLOOKUP(A357,Draft!E:E,1,FALSE)=A357,\"Yes\")),\"\",IF(VLOOKUP(A357,Draft!E:E,1,FALSE)=A357,\"Yes\"))","v":""}]
[343,"Berg, Justin",{"$f":"IF(ISNA(IF(VLOOKUP(A358,Draft!E:E,1,FALSE)=A358,\"Yes\")),\"\",IF(VLOOKUP(A358,Draft!E:E,1,FALSE)=A358,\"Yes\"))","v":""}]
[344,"Lopez, Javier",{"$f":"IF(ISNA(IF(VLOOKUP(A359,Draft!E:E,1,FALSE)=A359,\"Yes\")),\"\",IF(VLOOKUP(A359,Draft!E:E,1,FALSE)=A359,\"Yes\"))","v":""}]
[345,"Cotts, Neal",{"$f":"IF(ISNA(IF(VLOOKUP(A360,Draft!E:E,1,FALSE)=A360,\"Yes\")),\"\",IF(VLOOKUP(A360,Draft!E:E,1,FALSE)=A360,\"Yes\"))","v":""}]
[346,"Joaquin, Waldis",{"$f":"IF(ISNA(IF(VLOOKUP(A361,Draft!E:E,1,FALSE)=A361,\"Yes\")),\"\",IF(VLOOKUP(A361,Draft!E:E,1,FALSE)=A361,\"Yes\"))","v":""}]
[347,"Runzler, Daniel",{"$f":"IF(ISNA(IF(VLOOKUP(A362,Draft!E:E,1,FALSE)=A362,\"Yes\")),\"\",IF(VLOOKUP(A362,Draft!E:E,1,FALSE)=A362,\"Yes\"))","v":"Yes"}]
[348,"Axford, John",{"$f":"IF(ISNA(IF(VLOOKUP(A363,Draft!E:E,1,FALSE)=A363,\"Yes\")),\"\",IF(VLOOKUP(A363,Draft!E:E,1,FALSE)=A363,\"Yes\"))","v":""}]
[349,"Marshall, Jay",{"$f":"IF(ISNA(IF(VLOOKUP(A364,Draft!E:E,1,FALSE)=A364,\"Yes\")),\"\",IF(VLOOKUP(A364,Draft!E:E,1,FALSE)=A364,\"Yes\"))","v":""}]
[350,"Viola, Pedro",{"$f":"IF(ISNA(IF(VLOOKUP(A365,Draft!E:E,1,FALSE)=A365,\"Yes\")),\"\",IF(VLOOKUP(A365,Draft!E:E,1,FALSE)=A365,\"Yes\"))","v":""}]
[351,"Leroux, Chris",{"$f":"IF(ISNA(IF(VLOOKUP(A366,Draft!E:E,1,FALSE)=A366,\"Yes\")),\"\",IF(VLOOKUP(A366,Draft!E:E,1,FALSE)=A366,\"Yes\"))","v":""}]
[352,"Hansen, Craig",{"$f":"IF(ISNA(IF(VLOOKUP(A367,Draft!E:E,1,FALSE)=A367,\"Yes\")),\"\",IF(VLOOKUP(A367,Draft!E:E,1,FALSE)=A367,\"Yes\"))","v":""}]
[353,"Slaten, Doug",{"$f":"IF(ISNA(IF(VLOOKUP(A368,Draft!E:E,1,FALSE)=A368,\"Yes\")),\"\",IF(VLOOKUP(A368,Draft!E:E,1,FALSE)=A368,\"Yes\"))","v":""}]
[354,"Hinshaw, Alex",{"$f":"IF(ISNA(IF(VLOOKUP(A369,Draft!E:E,1,FALSE)=A369,\"Yes\")),\"\",IF(VLOOKUP(A369,Draft!E:E,1,FALSE)=A369,\"Yes\"))","v":""}]
[355,"Speier, Ryan",{"$f":"IF(ISNA(IF(VLOOKUP(A370,Draft!E:E,1,FALSE)=A370,\"Yes\")),\"\",IF(VLOOKUP(A370,Draft!E:E,1,FALSE)=A370,\"Yes\"))","v":""}]
[356,"Dunn, Michael",{"$f":"IF(ISNA(IF(VLOOKUP(A371,Draft!E:E,1,FALSE)=A371,\"Yes\")),\"\",IF(VLOOKUP(A371,Draft!E:E,1,FALSE)=A371,\"Yes\"))","v":""}]
[357,"Valdez, Luis",{"$f":"IF(ISNA(IF(VLOOKUP(A372,Draft!E:E,1,FALSE)=A372,\"Yes\")),\"\",IF(VLOOKUP(A372,Draft!E:E,1,FALSE)=A372,\"Yes\"))","v":""}]
[358,"Schlichting, Travis",{"$f":"IF(ISNA(IF(VLOOKUP(A373,Draft!E:E,1,FALSE)=A373,\"Yes\")),\"\",IF(VLOOKUP(A373,Draft!E:E,1,FALSE)=A373,\"Yes\"))","v":""}]
[359,"Garate, Victor",{"$f":"IF(ISNA(IF(VLOOKUP(A374,Draft!E:E,1,FALSE)=A374,\"Yes\")),\"\",IF(VLOOKUP(A374,Draft!E:E,1,FALSE)=A374,\"Yes\"))","v":""}]
[360,"Riske, David",{"$f":"IF(ISNA(IF(VLOOKUP(A375,Draft!E:E,1,FALSE)=A375,\"Yes\")),\"\",IF(VLOOKUP(A375,Draft!E:E,1,FALSE)=A375,\"Yes\"))","v":""}]
[361,"Proctor, Scott",{"$f":"IF(ISNA(IF(VLOOKUP(A376,Draft!E:E,1,FALSE)=A376,\"Yes\")),\"\",IF(VLOOKUP(A376,Draft!E:E,1,FALSE)=A376,\"Yes\"))","v":""}]
[362,"Buchholz, Taylor",{"$f":"IF(ISNA(IF(VLOOKUP(A377,Draft!E:E,1,FALSE)=A377,\"Yes\")),\"\",IF(VLOOKUP(A377,Draft!E:E,1,FALSE)=A377,\"Yes\"))","v":""}]
[363,"Majewski, Gary",{"$f":"IF(ISNA(IF(VLOOKUP(A378,Draft!E:E,1,FALSE)=A378,\"Yes\")),\"\",IF(VLOOKUP(A378,Draft!E:E,1,FALSE)=A378,\"Yes\"))","v":""}]
[364,"Bray, Bill",{"$f":"IF(ISNA(IF(VLOOKUP(A379,Draft!E:E,1,FALSE)=A379,\"Yes\")),\"\",IF(VLOOKUP(A379,Draft!E:E,1,FALSE)=A379,\"Yes\"))","v":""}]
[365,"Tankersley, Taylor",{"$f":"IF(ISNA(IF(VLOOKUP(A380,Draft!E:E,1,FALSE)=A380,\"Yes\")),\"\",IF(VLOOKUP(A380,Draft!E:E,1,FALSE)=A380,\"Yes\"))","v":""}]
[366,"Beam, T.J.",{"$f":"IF(ISNA(IF(VLOOKUP(A381,Draft!E:E,1,FALSE)=A381,\"Yes\")),\"\",IF(VLOOKUP(A381,Draft!E:E,1,FALSE)=A381,\"Yes\"))","v":""}]
[367,"Daigle, Casey",{"$f":"IF(ISNA(IF(VLOOKUP(A382,Draft!E:E,1,FALSE)=A382,\"Yes\")),\"\",IF(VLOOKUP(A382,Draft!E:E,1,FALSE)=A382,\"Yes\"))","v":""}]
[368,"Zagurski, Mike",{"$f":"IF(ISNA(IF(VLOOKUP(A383,Draft!E:E,1,FALSE)=A383,\"Yes\")),\"\",IF(VLOOKUP(A383,Draft!E:E,1,FALSE)=A383,\"Yes\"))","v":""}]
[369,"Thomas, Justin",{"$f":"IF(ISNA(IF(VLOOKUP(A384,Draft!E:E,1,FALSE)=A384,\"Yes\")),\"\",IF(VLOOKUP(A384,Draft!E:E,1,FALSE)=A384,\"Yes\"))","v":""}]
[370,"Kunz, Eddie",{"$f":"IF(ISNA(IF(VLOOKUP(A385,Draft!E:E,1,FALSE)=A385,\"Yes\")),\"\",IF(VLOOKUP(A385,Draft!E:E,1,FALSE)=A385,\"Yes\"))","v":""}]
[371,"Kimbrel, Craig",{"$f":"IF(ISNA(IF(VLOOKUP(A386,Draft!E:E,1,FALSE)=A386,\"Yes\")),\"\",IF(VLOOKUP(A386,Draft!E:E,1,FALSE)=A386,\"Yes\"))","v":"Yes"}]
[372,"Hyde, Lee",{"$f":"IF(ISNA(IF(VLOOKUP(A387,Draft!E:E,1,FALSE)=A387,\"Yes\")),\"\",IF(VLOOKUP(A387,Draft!E:E,1,FALSE)=A387,\"Yes\"))","v":""}]
[373,"Abreu, Juan",{"$f":"IF(ISNA(IF(VLOOKUP(A388,Draft!E:E,1,FALSE)=A388,\"Yes\")),\"\",IF(VLOOKUP(A388,Draft!E:E,1,FALSE)=A388,\"Yes\"))","v":""}]
[374,"Gaub, John",{"$f":"IF(ISNA(IF(VLOOKUP(A389,Draft!E:E,1,FALSE)=A389,\"Yes\")),\"\",IF(VLOOKUP(A389,Draft!E:E,1,FALSE)=A389,\"Yes\"))","v":""}]
[375,"Storen, Drew",{"$f":"IF(ISNA(IF(VLOOKUP(A390,Draft!E:E,1,FALSE)=A390,\"Yes\")),\"\",IF(VLOOKUP(A390,Draft!E:E,1,FALSE)=A390,\"Yes\"))","v":"Yes"}]
[376,"Igarashi, Ryota",{"$f":"IF(ISNA(IF(VLOOKUP(A391,Draft!E:E,1,FALSE)=A391,\"Yes\")),\"\",IF(VLOOKUP(A391,Draft!E:E,1,FALSE)=A391,\"Yes\"))","v":""}]
[377,"Herndon, David",{"$f":"IF(ISNA(IF(VLOOKUP(A392,Draft!E:E,1,FALSE)=A392,\"Yes\")),\"\",IF(VLOOKUP(A392,Draft!E:E,1,FALSE)=A392,\"Yes\"))","v":""}]
[378,"Colvin, Brody",{"$f":"IF(ISNA(IF(VLOOKUP(A393,Draft!E:E,1,FALSE)=A393,\"Yes\")),\"\",IF(VLOOKUP(A393,Draft!E:E,1,FALSE)=A393,\"Yes\"))","v":""}]
[379,"Kroenke, Zach",{"$f":"IF(ISNA(IF(VLOOKUP(A394,Draft!E:E,1,FALSE)=A394,\"Yes\")),\"\",IF(VLOOKUP(A394,Draft!E:E,1,FALSE)=A394,\"Yes\"))","v":""}]
[380,"Stange, Daniel",{"$f":"IF(ISNA(IF(VLOOKUP(A395,Draft!E:E,1,FALSE)=A395,\"Yes\")),\"\",IF(VLOOKUP(A395,Draft!E:E,1,FALSE)=A395,\"Yes\"))","v":""}]
[381,"Martin, Russell",{"$f":"IF(ISNA(IF(VLOOKUP(A396,Draft!E:E,1,FALSE)=A396,\"Yes\")),\"\",IF(VLOOKUP(A396,Draft!E:E,1,FALSE)=A396,\"Yes\"))","v":"Yes"}]
[382,"McCann, Brian",{"$f":"IF(ISNA(IF(VLOOKUP(A397,Draft!E:E,1,FALSE)=A397,\"Yes\")),\"\",IF(VLOOKUP(A397,Draft!E:E,1,FALSE)=A397,\"Yes\"))","v":"Yes"}]
[383,"Molina, Yadier",{"$f":"IF(ISNA(IF(VLOOKUP(A398,Draft!E:E,1,FALSE)=A398,\"Yes\")),\"\",IF(VLOOKUP(A398,Draft!E:E,1,FALSE)=A398,\"Yes\"))","v":"Yes"}]
[384,"Montero, Miguel",{"$f":"IF(ISNA(IF(VLOOKUP(A399,Draft!E:E,1,FALSE)=A399,\"Yes\")),\"\",IF(VLOOKUP(A399,Draft!E:E,1,FALSE)=A399,\"Yes\"))","v":"Yes"}]
[385,"Rodriguez, Ivan",{"$f":"IF(ISNA(IF(VLOOKUP(A400,Draft!E:E,1,FALSE)=A400,\"Yes\")),\"\",IF(VLOOKUP(A400,Draft!E:E,1,FALSE)=A400,\"Yes\"))","v":"Yes"}]
[386,"Baker, John",{"$f":"IF(ISNA(IF(VLOOKUP(A401,Draft!E:E,1,FALSE)=A401,\"Yes\")),\"\",IF(VLOOKUP(A401,Draft!E:E,1,FALSE)=A401,\"Yes\"))","v":"Yes"}]
[387,"Olivo, Miguel",{"$f":"IF(ISNA(IF(VLOOKUP(A402,Draft!E:E,1,FALSE)=A402,\"Yes\")),\"\",IF(VLOOKUP(A402,Draft!E:E,1,FALSE)=A402,\"Yes\"))","v":"Yes"}]
[388,"Soto, Geovany",{"$f":"IF(ISNA(IF(VLOOKUP(A403,Draft!E:E,1,FALSE)=A403,\"Yes\")),\"\",IF(VLOOKUP(A403,Draft!E:E,1,FALSE)=A403,\"Yes\"))","v":"Yes"}]
[389,"Ruiz, Carlos",{"$f":"IF(ISNA(IF(VLOOKUP(A404,Draft!E:E,1,FALSE)=A404,\"Yes\")),\"\",IF(VLOOKUP(A404,Draft!E:E,1,FALSE)=A404,\"Yes\"))","v":"Yes"}]
[390,"Iannetta, Chris",{"$f":"IF(ISNA(IF(VLOOKUP(A405,Draft!E:E,1,FALSE)=A405,\"Yes\")),\"\",IF(VLOOKUP(A405,Draft!E:E,1,FALSE)=A405,\"Yes\"))","v":"Yes"}]
[391,"Hernandez, Ramon",{"$f":"IF(ISNA(IF(VLOOKUP(A406,Draft!E:E,1,FALSE)=A406,\"Yes\")),\"\",IF(VLOOKUP(A406,Draft!E:E,1,FALSE)=A406,\"Yes\"))","v":"Yes"}]
[392,"Doumit, Ryan",{"$f":"IF(ISNA(IF(VLOOKUP(A407,Draft!E:E,1,FALSE)=A407,\"Yes\")),\"\",IF(VLOOKUP(A407,Draft!E:E,1,FALSE)=A407,\"Yes\"))","v":"Yes"}]
[393,"Santos, Omir",{"$f":"IF(ISNA(IF(VLOOKUP(A408,Draft!E:E,1,FALSE)=A408,\"Yes\")),\"\",IF(VLOOKUP(A408,Draft!E:E,1,FALSE)=A408,\"Yes\"))","v":""}]
[394,"Zaun, Gregg",{"$f":"IF(ISNA(IF(VLOOKUP(A409,Draft!E:E,1,FALSE)=A409,\"Yes\")),\"\",IF(VLOOKUP(A409,Draft!E:E,1,FALSE)=A409,\"Yes\"))","v":"Yes"}]
[395,"Hanigan, Ryan",{"$f":"IF(ISNA(IF(VLOOKUP(A410,Draft!E:E,1,FALSE)=A410,\"Yes\")),\"\",IF(VLOOKUP(A410,Draft!E:E,1,FALSE)=A410,\"Yes\"))","v":"Yes"}]
[396,"Hundley, Nick",{"$f":"IF(ISNA(IF(VLOOKUP(A411,Draft!E:E,1,FALSE)=A411,\"Yes\")),\"\",IF(VLOOKUP(A411,Draft!E:E,1,FALSE)=A411,\"Yes\"))","v":"Yes"}]
[397,"Hill, Koyie",{"$f":"IF(ISNA(IF(VLOOKUP(A412,Draft!E:E,1,FALSE)=A412,\"Yes\")),\"\",IF(VLOOKUP(A412,Draft!E:E,1,FALSE)=A412,\"Yes\"))","v":""}]
[398,"Paulino, Ronny",{"$f":"IF(ISNA(IF(VLOOKUP(A413,Draft!E:E,1,FALSE)=A413,\"Yes\")),\"\",IF(VLOOKUP(A413,Draft!E:E,1,FALSE)=A413,\"Yes\"))","v":"Yes"}]
[399,"Nieves, Wil",{"$f":"IF(ISNA(IF(VLOOKUP(A414,Draft!E:E,1,FALSE)=A414,\"Yes\")),\"\",IF(VLOOKUP(A414,Draft!E:E,1,FALSE)=A414,\"Yes\"))","v":""}]
[400,"Blanco, Henry",{"$f":"IF(ISNA(IF(VLOOKUP(A415,Draft!E:E,1,FALSE)=A415,\"Yes\")),\"\",IF(VLOOKUP(A415,Draft!E:E,1,FALSE)=A415,\"Yes\"))","v":""}]
[401,"Coste, Chris",{"$f":"IF(ISNA(IF(VLOOKUP(A416,Draft!E:E,1,FALSE)=A416,\"Yes\")),\"\",IF(VLOOKUP(A416,Draft!E:E,1,FALSE)=A416,\"Yes\"))","v":""}]
[402,"Jaramillo, Jason",{"$f":"IF(ISNA(IF(VLOOKUP(A417,Draft!E:E,1,FALSE)=A417,\"Yes\")),\"\",IF(VLOOKUP(A417,Draft!E:E,1,FALSE)=A417,\"Yes\"))","v":""}]
[403,"Snyder, Chris",{"$f":"IF(ISNA(IF(VLOOKUP(A418,Draft!E:E,1,FALSE)=A418,\"Yes\")),\"\",IF(VLOOKUP(A418,Draft!E:E,1,FALSE)=A418,\"Yes\"))","v":"Yes"}]
[404,"Schneider, Brian",{"$f":"IF(ISNA(IF(VLOOKUP(A419,Draft!E:E,1,FALSE)=A419,\"Yes\")),\"\",IF(VLOOKUP(A419,Draft!E:E,1,FALSE)=A419,\"Yes\"))","v":""}]
[405,"Quintero, Humberto",{"$f":"IF(ISNA(IF(VLOOKUP(A420,Draft!E:E,1,FALSE)=A420,\"Yes\")),\"\",IF(VLOOKUP(A420,Draft!E:E,1,FALSE)=A420,\"Yes\"))","v":""}]
[406,"Ross, David",{"$f":"IF(ISNA(IF(VLOOKUP(A421,Draft!E:E,1,FALSE)=A421,\"Yes\")),\"\",IF(VLOOKUP(A421,Draft!E:E,1,FALSE)=A421,\"Yes\"))","v":"Yes"}]
[407,"Whiteside, Eli",{"$f":"IF(ISNA(IF(VLOOKUP(A422,Draft!E:E,1,FALSE)=A422,\"Yes\")),\"\",IF(VLOOKUP(A422,Draft!E:E,1,FALSE)=A422,\"Yes\"))","v":""}]
[408,"LaRue, Jason",{"$f":"IF(ISNA(IF(VLOOKUP(A423,Draft!E:E,1,FALSE)=A423,\"Yes\")),\"\",IF(VLOOKUP(A423,Draft!E:E,1,FALSE)=A423,\"Yes\"))","v":""}]
[409,"Flores, Jesus",{"$f":"IF(ISNA(IF(VLOOKUP(A424,Draft!E:E,1,FALSE)=A424,\"Yes\")),\"\",IF(VLOOKUP(A424,Draft!E:E,1,FALSE)=A424,\"Yes\"))","v":"Yes"}]
[410,"Kottaras, George",{"$f":"IF(ISNA(IF(VLOOKUP(A425,Draft!E:E,1,FALSE)=A425,\"Yes\")),\"\",IF(VLOOKUP(A425,Draft!E:E,1,FALSE)=A425,\"Yes\"))","v":""}]
[411,"Thole, Josh",{"$f":"IF(ISNA(IF(VLOOKUP(A426,Draft!E:E,1,FALSE)=A426,\"Yes\")),\"\",IF(VLOOKUP(A426,Draft!E:E,1,FALSE)=A426,\"Yes\"))","v":""}]
[412,"Burke, Jamie",{"$f":"IF(ISNA(IF(VLOOKUP(A427,Draft!E:E,1,FALSE)=A427,\"Yes\")),\"\",IF(VLOOKUP(A427,Draft!E:E,1,FALSE)=A427,\"Yes\"))","v":""}]
[413,"Towles, J.R.",{"$f":"IF(ISNA(IF(VLOOKUP(A428,Draft!E:E,1,FALSE)=A428,\"Yes\")),\"\",IF(VLOOKUP(A428,Draft!E:E,1,FALSE)=A428,\"Yes\"))","v":"Yes"}]
[414,"Sardinha, Dane",{"$f":"IF(ISNA(IF(VLOOKUP(A429,Draft!E:E,1,FALSE)=A429,\"Yes\")),\"\",IF(VLOOKUP(A429,Draft!E:E,1,FALSE)=A429,\"Yes\"))","v":""}]
[415,"Ryan, Dusty",{"$f":"IF(ISNA(IF(VLOOKUP(A430,Draft!E:E,1,FALSE)=A430,\"Yes\")),\"\",IF(VLOOKUP(A430,Draft!E:E,1,FALSE)=A430,\"Yes\"))","v":""}]
[416,"Hester, John",{"$f":"IF(ISNA(IF(VLOOKUP(A431,Draft!E:E,1,FALSE)=A431,\"Yes\")),\"\",IF(VLOOKUP(A431,Draft!E:E,1,FALSE)=A431,\"Yes\"))","v":""}]
[417,"Posey, Buster",{"$f":"IF(ISNA(IF(VLOOKUP(A432,Draft!E:E,1,FALSE)=A432,\"Yes\")),\"\",IF(VLOOKUP(A432,Draft!E:E,1,FALSE)=A432,\"Yes\"))","v":"Yes"}]
[418,"Treanor, Matt",{"$f":"IF(ISNA(IF(VLOOKUP(A433,Draft!E:E,1,FALSE)=A433,\"Yes\")),\"\",IF(VLOOKUP(A433,Draft!E:E,1,FALSE)=A433,\"Yes\"))","v":""}]
[419,"Sammons, Clint",{"$f":"IF(ISNA(IF(VLOOKUP(A434,Draft!E:E,1,FALSE)=A434,\"Yes\")),\"\",IF(VLOOKUP(A434,Draft!E:E,1,FALSE)=A434,\"Yes\"))","v":""}]
[420,"Hayes, Brett",{"$f":"IF(ISNA(IF(VLOOKUP(A435,Draft!E:E,1,FALSE)=A435,\"Yes\")),\"\",IF(VLOOKUP(A435,Draft!E:E,1,FALSE)=A435,\"Yes\"))","v":""}]
[421,"Ellis, A.J.",{"$f":"IF(ISNA(IF(VLOOKUP(A436,Draft!E:E,1,FALSE)=A436,\"Yes\")),\"\",IF(VLOOKUP(A436,Draft!E:E,1,FALSE)=A436,\"Yes\"))","v":"Yes"}]
[422,"Hoover, Paul",{"$f":"IF(ISNA(IF(VLOOKUP(A437,Draft!E:E,1,FALSE)=A437,\"Yes\")),\"\",IF(VLOOKUP(A437,Draft!E:E,1,FALSE)=A437,\"Yes\"))","v":""}]
[423,"Pagnozzi, Matt",{"$f":"IF(ISNA(IF(VLOOKUP(A438,Draft!E:E,1,FALSE)=A438,\"Yes\")),\"\",IF(VLOOKUP(A438,Draft!E:E,1,FALSE)=A438,\"Yes\"))","v":""}]
[424,"Corporan, Carlos",{"$f":"IF(ISNA(IF(VLOOKUP(A439,Draft!E:E,1,FALSE)=A439,\"Yes\")),\"\",IF(VLOOKUP(A439,Draft!E:E,1,FALSE)=A439,\"Yes\"))","v":""}]
[425,"Salome, Angel",{"$f":"IF(ISNA(IF(VLOOKUP(A440,Draft!E:E,1,FALSE)=A440,\"Yes\")),\"\",IF(VLOOKUP(A440,Draft!E:E,1,FALSE)=A440,\"Yes\"))","v":"Yes"}]
[426,"Lucroy, Jonathon",{"$f":"IF(ISNA(IF(VLOOKUP(A441,Draft!E:E,1,FALSE)=A441,\"Yes\")),\"\",IF(VLOOKUP(A441,Draft!E:E,1,FALSE)=A441,\"Yes\"))","v":"Yes"}]
[427,"Garfield, Cameron",{"$f":"IF(ISNA(IF(VLOOKUP(A442,Draft!E:E,1,FALSE)=A442,\"Yes\")),\"\",IF(VLOOKUP(A442,Draft!E:E,1,FALSE)=A442,\"Yes\"))","v":""}]
[428,"Castillo, Wellington",{"$f":"IF(ISNA(IF(VLOOKUP(A443,Draft!E:E,1,FALSE)=A443,\"Yes\")),\"\",IF(VLOOKUP(A443,Draft!E:E,1,FALSE)=A443,\"Yes\"))","v":""}]
[429,"Castro, Jason",{"$f":"IF(ISNA(IF(VLOOKUP(A444,Draft!E:E,1,FALSE)=A444,\"Yes\")),\"\",IF(VLOOKUP(A444,Draft!E:E,1,FALSE)=A444,\"Yes\"))","v":"Yes"}]
[430,"May, Lucas",{"$f":"IF(ISNA(IF(VLOOKUP(A445,Draft!E:E,1,FALSE)=A445,\"Yes\")),\"\",IF(VLOOKUP(A445,Draft!E:E,1,FALSE)=A445,\"Yes\"))","v":""}]
[431,"Wise, Jeremy",{"$f":"IF(ISNA(IF(VLOOKUP(A446,Draft!E:E,1,FALSE)=A446,\"Yes\")),\"\",IF(VLOOKUP(A446,Draft!E:E,1,FALSE)=A446,\"Yes\"))","v":""}]
[432,"Norris, Derek",{"$f":"IF(ISNA(IF(VLOOKUP(A447,Draft!E:E,1,FALSE)=A447,\"Yes\")),\"\",IF(VLOOKUP(A447,Draft!E:E,1,FALSE)=A447,\"Yes\"))","v":"Yes"}]
[433,"Sanchez, Jorge(Tony)",{"$f":"IF(ISNA(IF(VLOOKUP(A448,Draft!E:E,1,FALSE)=A448,\"Yes\")),\"\",IF(VLOOKUP(A448,Draft!E:E,1,FALSE)=A448,\"Yes\"))","v":"Yes"}]
[434,"Anderson, Bryan",{"$f":"IF(ISNA(IF(VLOOKUP(A449,Draft!E:E,1,FALSE)=A449,\"Yes\")),\"\",IF(VLOOKUP(A449,Draft!E:E,1,FALSE)=A449,\"Yes\"))","v":""}]
[435,"Stock, Robert",{"$f":"IF(ISNA(IF(VLOOKUP(A450,Draft!E:E,1,FALSE)=A450,\"Yes\")),\"\",IF(VLOOKUP(A450,Draft!E:E,1,FALSE)=A450,\"Yes\"))","v":""}]
[436,"Joseph, Thomas",{"$f":"IF(ISNA(IF(VLOOKUP(A451,Draft!E:E,1,FALSE)=A451,\"Yes\")),\"\",IF(VLOOKUP(A451,Draft!E:E,1,FALSE)=A451,\"Yes\"))","v":"Yes"}]
[437,"Rosario, Wilin",{"$f":"IF(ISNA(IF(VLOOKUP(A452,Draft!E:E,1,FALSE)=A452,\"Yes\")),\"\",IF(VLOOKUP(A452,Draft!E:E,1,FALSE)=A452,\"Yes\"))","v":"Yes"}]
[438,"McKenry, Michael",{"$f":"IF(ISNA(IF(VLOOKUP(A453,Draft!E:E,1,FALSE)=A453,\"Yes\")),\"\",IF(VLOOKUP(A453,Draft!E:E,1,FALSE)=A453,\"Yes\"))","v":""}]
[439,"Fielder, Prince",{"$f":"IF(ISNA(IF(VLOOKUP(A454,Draft!E:E,1,FALSE)=A454,\"Yes\")),\"\",IF(VLOOKUP(A454,Draft!E:E,1,FALSE)=A454,\"Yes\"))","v":"Yes"}]
[440,"Howard, Ryan",{"$f":"IF(ISNA(IF(VLOOKUP(A455,Draft!E:E,1,FALSE)=A455,\"Yes\")),\"\",IF(VLOOKUP(A455,Draft!E:E,1,FALSE)=A455,\"Yes\"))","v":"Yes"}]
[441,"Pujols, Albert",{"$f":"IF(ISNA(IF(VLOOKUP(A456,Draft!E:E,1,FALSE)=A456,\"Yes\")),\"\",IF(VLOOKUP(A456,Draft!E:E,1,FALSE)=A456,\"Yes\"))","v":"Yes"}]
[442,"Gonzalez, Adrian",{"$f":"IF(ISNA(IF(VLOOKUP(A457,Draft!E:E,1,FALSE)=A457,\"Yes\")),\"\",IF(VLOOKUP(A457,Draft!E:E,1,FALSE)=A457,\"Yes\"))","v":"Yes"}]
[443,"Dunn, Adam",{"$f":"IF(ISNA(IF(VLOOKUP(A458,Draft!E:E,1,FALSE)=A458,\"Yes\")),\"\",IF(VLOOKUP(A458,Draft!E:E,1,FALSE)=A458,\"Yes\"))","v":"Yes"}]
[444,"Loney, James",{"$f":"IF(ISNA(IF(VLOOKUP(A459,Draft!E:E,1,FALSE)=A459,\"Yes\")),\"\",IF(VLOOKUP(A459,Draft!E:E,1,FALSE)=A459,\"Yes\"))","v":"Yes"}]
[445,"Helton, Todd",{"$f":"IF(ISNA(IF(VLOOKUP(A460,Draft!E:E,1,FALSE)=A460,\"Yes\")),\"\",IF(VLOOKUP(A460,Draft!E:E,1,FALSE)=A460,\"Yes\"))","v":"Yes"}]
[446,"LaRoche, Adam",{"$f":"IF(ISNA(IF(VLOOKUP(A461,Draft!E:E,1,FALSE)=A461,\"Yes\")),\"\",IF(VLOOKUP(A461,Draft!E:E,1,FALSE)=A461,\"Yes\"))","v":"Yes"}]
[447,"Lee, Derrek",{"$f":"IF(ISNA(IF(VLOOKUP(A462,Draft!E:E,1,FALSE)=A462,\"Yes\")),\"\",IF(VLOOKUP(A462,Draft!E:E,1,FALSE)=A462,\"Yes\"))","v":"Yes"}]
[448,"Huff, Aubrey",{"$f":"IF(ISNA(IF(VLOOKUP(A463,Draft!E:E,1,FALSE)=A463,\"Yes\")),\"\",IF(VLOOKUP(A463,Draft!E:E,1,FALSE)=A463,\"Yes\"))","v":"Yes"}]
[449,"Berkman, Lance",{"$f":"IF(ISNA(IF(VLOOKUP(A464,Draft!E:E,1,FALSE)=A464,\"Yes\")),\"\",IF(VLOOKUP(A464,Draft!E:E,1,FALSE)=A464,\"Yes\"))","v":"Yes"}]
[450,"Murphy, Daniel",{"$f":"IF(ISNA(IF(VLOOKUP(A465,Draft!E:E,1,FALSE)=A465,\"Yes\")),\"\",IF(VLOOKUP(A465,Draft!E:E,1,FALSE)=A465,\"Yes\"))","v":"Yes"}]
[451,"Votto, Joey",{"$f":"IF(ISNA(IF(VLOOKUP(A466,Draft!E:E,1,FALSE)=A466,\"Yes\")),\"\",IF(VLOOKUP(A466,Draft!E:E,1,FALSE)=A466,\"Yes\"))","v":"Yes"}]
[452,"Ishikawa, Travis",{"$f":"IF(ISNA(IF(VLOOKUP(A467,Draft!E:E,1,FALSE)=A467,\"Yes\")),\"\",IF(VLOOKUP(A467,Draft!E:E,1,FALSE)=A467,\"Yes\"))","v":"Yes"}]
[453,"Gload, Ross",{"$f":"IF(ISNA(IF(VLOOKUP(A468,Draft!E:E,1,FALSE)=A468,\"Yes\")),\"\",IF(VLOOKUP(A468,Draft!E:E,1,FALSE)=A468,\"Yes\"))","v":""}]
[454,"Pearce, Steven",{"$f":"IF(ISNA(IF(VLOOKUP(A469,Draft!E:E,1,FALSE)=A469,\"Yes\")),\"\",IF(VLOOKUP(A469,Draft!E:E,1,FALSE)=A469,\"Yes\"))","v":""}]
[455,"Whitesell, Josh",{"$f":"IF(ISNA(IF(VLOOKUP(A470,Draft!E:E,1,FALSE)=A470,\"Yes\")),\"\",IF(VLOOKUP(A470,Draft!E:E,1,FALSE)=A470,\"Yes\"))","v":""}]
[456,"Allen, Brandon",{"$f":"IF(ISNA(IF(VLOOKUP(A471,Draft!E:E,1,FALSE)=A471,\"Yes\")),\"\",IF(VLOOKUP(A471,Draft!E:E,1,FALSE)=A471,\"Yes\"))","v":"Yes"}]
[457,"Bailey, Jeff",{"$f":"IF(ISNA(IF(VLOOKUP(A472,Draft!E:E,1,FALSE)=A472,\"Yes\")),\"\",IF(VLOOKUP(A472,Draft!E:E,1,FALSE)=A472,\"Yes\"))","v":""}]
[458,"Shelton, Chris",{"$f":"IF(ISNA(IF(VLOOKUP(A473,Draft!E:E,1,FALSE)=A473,\"Yes\")),\"\",IF(VLOOKUP(A473,Draft!E:E,1,FALSE)=A473,\"Yes\"))","v":""}]
[459,"Sanchez, Gaby",{"$f":"IF(ISNA(IF(VLOOKUP(A474,Draft!E:E,1,FALSE)=A474,\"Yes\")),\"\",IF(VLOOKUP(A474,Draft!E:E,1,FALSE)=A474,\"Yes\"))","v":"Yes"}]
[460,"Mientkiewicz, Doug",{"$f":"IF(ISNA(IF(VLOOKUP(A475,Draft!E:E,1,FALSE)=A475,\"Yes\")),\"\",IF(VLOOKUP(A475,Draft!E:E,1,FALSE)=A475,\"Yes\"))","v":""}]
[461,"Guzman, Jesus",{"$f":"IF(ISNA(IF(VLOOKUP(A476,Draft!E:E,1,FALSE)=A476,\"Yes\")),\"\",IF(VLOOKUP(A476,Draft!E:E,1,FALSE)=A476,\"Yes\"))","v":""}]
[462,"Tracy, Andy",{"$f":"IF(ISNA(IF(VLOOKUP(A477,Draft!E:E,1,FALSE)=A477,\"Yes\")),\"\",IF(VLOOKUP(A477,Draft!E:E,1,FALSE)=A477,\"Yes\"))","v":""}]
[463,"Clement, Jeff",{"$f":"IF(ISNA(IF(VLOOKUP(A478,Draft!E:E,1,FALSE)=A478,\"Yes\")),\"\",IF(VLOOKUP(A478,Draft!E:E,1,FALSE)=A478,\"Yes\"))","v":"Yes"}]
[464,"LaHair, Bryan",{"$f":"IF(ISNA(IF(VLOOKUP(A479,Draft!E:E,1,FALSE)=A479,\"Yes\")),\"\",IF(VLOOKUP(A479,Draft!E:E,1,FALSE)=A479,\"Yes\"))","v":""}]
[465,"Freeman, Frederick",{"$f":"IF(ISNA(IF(VLOOKUP(A480,Draft!E:E,1,FALSE)=A480,\"Yes\")),\"\",IF(VLOOKUP(A480,Draft!E:E,1,FALSE)=A480,\"Yes\"))","v":"Yes"}]
[466,"Alonso, Yonder",{"$f":"IF(ISNA(IF(VLOOKUP(A481,Draft!E:E,1,FALSE)=A481,\"Yes\")),\"\",IF(VLOOKUP(A481,Draft!E:E,1,FALSE)=A481,\"Yes\"))","v":"Yes"}]
[467,"Marrero, Chris",{"$f":"IF(ISNA(IF(VLOOKUP(A482,Draft!E:E,1,FALSE)=A482,\"Yes\")),\"\",IF(VLOOKUP(A482,Draft!E:E,1,FALSE)=A482,\"Yes\"))","v":"Yes"}]
[468,"Davis, Ike",{"$f":"IF(ISNA(IF(VLOOKUP(A483,Draft!E:E,1,FALSE)=A483,\"Yes\")),\"\",IF(VLOOKUP(A483,Draft!E:E,1,FALSE)=A483,\"Yes\"))","v":"Yes"}]
[469,"Singleton, Jonathan",{"$f":"IF(ISNA(IF(VLOOKUP(A484,Draft!E:E,1,FALSE)=A484,\"Yes\")),\"\",IF(VLOOKUP(A484,Draft!E:E,1,FALSE)=A484,\"Yes\"))","v":""}]
[470,"Neal, Thomas",{"$f":"IF(ISNA(IF(VLOOKUP(A485,Draft!E:E,1,FALSE)=A485,\"Yes\")),\"\",IF(VLOOKUP(A485,Draft!E:E,1,FALSE)=A485,\"Yes\"))","v":""}]
[471,"Paulsen, Ben",{"$f":"IF(ISNA(IF(VLOOKUP(A486,Draft!E:E,1,FALSE)=A486,\"Yes\")),\"\",IF(VLOOKUP(A486,Draft!E:E,1,FALSE)=A486,\"Yes\"))","v":""}]
[472,"Morrison, Logan",{"$f":"IF(ISNA(IF(VLOOKUP(A487,Draft!E:E,1,FALSE)=A487,\"Yes\")),\"\",IF(VLOOKUP(A487,Draft!E:E,1,FALSE)=A487,\"Yes\"))","v":"Yes"}]
[473,"Wheeler, Ryan",{"$f":"IF(ISNA(IF(VLOOKUP(A488,Draft!E:E,1,FALSE)=A488,\"Yes\")),\"\",IF(VLOOKUP(A488,Draft!E:E,1,FALSE)=A488,\"Yes\"))","v":""}]
[474,"Utley, Chase",{"$f":"IF(ISNA(IF(VLOOKUP(A489,Draft!E:E,1,FALSE)=A489,\"Yes\")),\"\",IF(VLOOKUP(A489,Draft!E:E,1,FALSE)=A489,\"Yes\"))","v":"Yes"}]
[475,"Uggla, Dan",{"$f":"IF(ISNA(IF(VLOOKUP(A490,Draft!E:E,1,FALSE)=A490,\"Yes\")),\"\",IF(VLOOKUP(A490,Draft!E:E,1,FALSE)=A490,\"Yes\"))","v":"Yes"}]
[476,"Polanco, Placido",{"$f":"IF(ISNA(IF(VLOOKUP(A491,Draft!E:E,1,FALSE)=A491,\"Yes\")),\"\",IF(VLOOKUP(A491,Draft!E:E,1,FALSE)=A491,\"Yes\"))","v":"Yes"}]
[477,"Phillips, Brandon",{"$f":"IF(ISNA(IF(VLOOKUP(A492,Draft!E:E,1,FALSE)=A492,\"Yes\")),\"\",IF(VLOOKUP(A492,Draft!E:E,1,FALSE)=A492,\"Yes\"))","v":"Yes"}]
[478,"Barmes, Clint",{"$f":"IF(ISNA(IF(VLOOKUP(A493,Draft!E:E,1,FALSE)=A493,\"Yes\")),\"\",IF(VLOOKUP(A493,Draft!E:E,1,FALSE)=A493,\"Yes\"))","v":"Yes"}]
[479,"Schumaker, Skip",{"$f":"IF(ISNA(IF(VLOOKUP(A494,Draft!E:E,1,FALSE)=A494,\"Yes\")),\"\",IF(VLOOKUP(A494,Draft!E:E,1,FALSE)=A494,\"Yes\"))","v":"Yes"}]
[480,"Castillo, Luis",{"$f":"IF(ISNA(IF(VLOOKUP(A495,Draft!E:E,1,FALSE)=A495,\"Yes\")),\"\",IF(VLOOKUP(A495,Draft!E:E,1,FALSE)=A495,\"Yes\"))","v":"Yes"}]
[481,"Eckstein, David",{"$f":"IF(ISNA(IF(VLOOKUP(A496,Draft!E:E,1,FALSE)=A496,\"Yes\")),\"\",IF(VLOOKUP(A496,Draft!E:E,1,FALSE)=A496,\"Yes\"))","v":"Yes"}]
[482,"Matsui, Kazuo",{"$f":"IF(ISNA(IF(VLOOKUP(A497,Draft!E:E,1,FALSE)=A497,\"Yes\")),\"\",IF(VLOOKUP(A497,Draft!E:E,1,FALSE)=A497,\"Yes\"))","v":"Yes"}]
[483,"Prado, Martin",{"$f":"IF(ISNA(IF(VLOOKUP(A498,Draft!E:E,1,FALSE)=A498,\"Yes\")),\"\",IF(VLOOKUP(A498,Draft!E:E,1,FALSE)=A498,\"Yes\"))","v":"Yes"}]
[484,"Sanchez, Freddy",{"$f":"IF(ISNA(IF(VLOOKUP(A499,Draft!E:E,1,FALSE)=A499,\"Yes\")),\"\",IF(VLOOKUP(A499,Draft!E:E,1,FALSE)=A499,\"Yes\"))","v":"Yes"}]
[485,"Fontenot, Mike",{"$f":"IF(ISNA(IF(VLOOKUP(A500,Draft!E:E,1,FALSE)=A500,\"Yes\")),\"\",IF(VLOOKUP(A500,Draft!E:E,1,FALSE)=A500,\"Yes\"))","v":"Yes"}]
[486,"Hernandez, Anderson",{"$f":"IF(ISNA(IF(VLOOKUP(A501,Draft!E:E,1,FALSE)=A501,\"Yes\")),\"\",IF(VLOOKUP(A501,Draft!E:E,1,FALSE)=A501,\"Yes\"))","v":""}]
[487,"McGehee, Casey",{"$f":"IF(ISNA(IF(VLOOKUP(A502,Draft!E:E,1,FALSE)=A502,\"Yes\")),\"\",IF(VLOOKUP(A502,Draft!E:E,1,FALSE)=A502,\"Yes\"))","v":"Yes"}]
[488,"Young, Delwyn",{"$f":"IF(ISNA(IF(VLOOKUP(A503,Draft!E:E,1,FALSE)=A503,\"Yes\")),\"\",IF(VLOOKUP(A503,Draft!E:E,1,FALSE)=A503,\"Yes\"))","v":"Yes"}]
[489,"Carroll, Jamey",{"$f":"IF(ISNA(IF(VLOOKUP(A504,Draft!E:E,1,FALSE)=A504,\"Yes\")),\"\",IF(VLOOKUP(A504,Draft!E:E,1,FALSE)=A504,\"Yes\"))","v":"Yes"}]
[490,"Roberts, Ryan",{"$f":"IF(ISNA(IF(VLOOKUP(A505,Draft!E:E,1,FALSE)=A505,\"Yes\")),\"\",IF(VLOOKUP(A505,Draft!E:E,1,FALSE)=A505,\"Yes\"))","v":""}]
[491,"Johnson, Kelly",{"$f":"IF(ISNA(IF(VLOOKUP(A506,Draft!E:E,1,FALSE)=A506,\"Yes\")),\"\",IF(VLOOKUP(A506,Draft!E:E,1,FALSE)=A506,\"Yes\"))","v":"Yes"}]
[492,"Keppinger, Jeff",{"$f":"IF(ISNA(IF(VLOOKUP(A507,Draft!E:E,1,FALSE)=A507,\"Yes\")),\"\",IF(VLOOKUP(A507,Draft!E:E,1,FALSE)=A507,\"Yes\"))","v":"Yes"}]
[493,"Velez, Eugenio",{"$f":"IF(ISNA(IF(VLOOKUP(A508,Draft!E:E,1,FALSE)=A508,\"Yes\")),\"\",IF(VLOOKUP(A508,Draft!E:E,1,FALSE)=A508,\"Yes\"))","v":""}]
[494,"Thurston, Joe",{"$f":"IF(ISNA(IF(VLOOKUP(A509,Draft!E:E,1,FALSE)=A509,\"Yes\")),\"\",IF(VLOOKUP(A509,Draft!E:E,1,FALSE)=A509,\"Yes\"))","v":""}]
[495,"Iwamura, Akinori",{"$f":"IF(ISNA(IF(VLOOKUP(A510,Draft!E:E,1,FALSE)=A510,\"Yes\")),\"\",IF(VLOOKUP(A510,Draft!E:E,1,FALSE)=A510,\"Yes\"))","v":"Yes"}]
[496,"Baker, Jeff",{"$f":"IF(ISNA(IF(VLOOKUP(A511,Draft!E:E,1,FALSE)=A511,\"Yes\")),\"\",IF(VLOOKUP(A511,Draft!E:E,1,FALSE)=A511,\"Yes\"))","v":"Yes"}]
[497,"Burriss, Emmanuel",{"$f":"IF(ISNA(IF(VLOOKUP(A512,Draft!E:E,1,FALSE)=A512,\"Yes\")),\"\",IF(VLOOKUP(A512,Draft!E:E,1,FALSE)=A512,\"Yes\"))","v":""}]
[498,"Weeks, Rickie",{"$f":"IF(ISNA(IF(VLOOKUP(A513,Draft!E:E,1,FALSE)=A513,\"Yes\")),\"\",IF(VLOOKUP(A513,Draft!E:E,1,FALSE)=A513,\"Yes\"))","v":"Yes"}]
[499,"Maysonet, Edwin",{"$f":"IF(ISNA(IF(VLOOKUP(A514,Draft!E:E,1,FALSE)=A514,\"Yes\")),\"\",IF(VLOOKUP(A514,Draft!E:E,1,FALSE)=A514,\"Yes\"))","v":""}]
[500,"Sutton, Drew",{"$f":"IF(ISNA(IF(VLOOKUP(A515,Draft!E:E,1,FALSE)=A515,\"Yes\")),\"\",IF(VLOOKUP(A515,Draft!E:E,1,FALSE)=A515,\"Yes\"))","v":""}]
[501,"Ryal, Rusty",{"$f":"IF(ISNA(IF(VLOOKUP(A516,Draft!E:E,1,FALSE)=A516,\"Yes\")),\"\",IF(VLOOKUP(A516,Draft!E:E,1,FALSE)=A516,\"Yes\"))","v":""}]
[502,"Young, Eric",{"$f":"IF(ISNA(IF(VLOOKUP(A517,Draft!E:E,1,FALSE)=A517,\"Yes\")),\"\",IF(VLOOKUP(A517,Draft!E:E,1,FALSE)=A517,\"Yes\"))","v":"Yes"}]
[503,"Downs, Matt",{"$f":"IF(ISNA(IF(VLOOKUP(A518,Draft!E:E,1,FALSE)=A518,\"Yes\")),\"\",IF(VLOOKUP(A518,Draft!E:E,1,FALSE)=A518,\"Yes\"))","v":""}]
[504,"Conrad, Brooks",{"$f":"IF(ISNA(IF(VLOOKUP(A519,Draft!E:E,1,FALSE)=A519,\"Yes\")),\"\",IF(VLOOKUP(A519,Draft!E:E,1,FALSE)=A519,\"Yes\"))","v":""}]
[505,"Frandsen, Kevin",{"$f":"IF(ISNA(IF(VLOOKUP(A520,Draft!E:E,1,FALSE)=A520,\"Yes\")),\"\",IF(VLOOKUP(A520,Draft!E:E,1,FALSE)=A520,\"Yes\"))","v":""}]
[506,"DeWitt, Blake",{"$f":"IF(ISNA(IF(VLOOKUP(A521,Draft!E:E,1,FALSE)=A521,\"Yes\")),\"\",IF(VLOOKUP(A521,Draft!E:E,1,FALSE)=A521,\"Yes\"))","v":"Yes"}]
[507,"Adams, Russ",{"$f":"IF(ISNA(IF(VLOOKUP(A522,Draft!E:E,1,FALSE)=A522,\"Yes\")),\"\",IF(VLOOKUP(A522,Draft!E:E,1,FALSE)=A522,\"Yes\"))","v":""}]
[508,"Iribarren, Hernan",{"$f":"IF(ISNA(IF(VLOOKUP(A523,Draft!E:E,1,FALSE)=A523,\"Yes\")),\"\",IF(VLOOKUP(A523,Draft!E:E,1,FALSE)=A523,\"Yes\"))","v":""}]
[509,"Abreu, Tony",{"$f":"IF(ISNA(IF(VLOOKUP(A524,Draft!E:E,1,FALSE)=A524,\"Yes\")),\"\",IF(VLOOKUP(A524,Draft!E:E,1,FALSE)=A524,\"Yes\"))","v":"Yes"}]
[510,"Green, Andy",{"$f":"IF(ISNA(IF(VLOOKUP(A525,Draft!E:E,1,FALSE)=A525,\"Yes\")),\"\",IF(VLOOKUP(A525,Draft!E:E,1,FALSE)=A525,\"Yes\"))","v":""}]
[511,"Gotay, Ruben",{"$f":"IF(ISNA(IF(VLOOKUP(A526,Draft!E:E,1,FALSE)=A526,\"Yes\")),\"\",IF(VLOOKUP(A526,Draft!E:E,1,FALSE)=A526,\"Yes\"))","v":""}]
[512,"Antonelli, Matt",{"$f":"IF(ISNA(IF(VLOOKUP(A527,Draft!E:E,1,FALSE)=A527,\"Yes\")),\"\",IF(VLOOKUP(A527,Draft!E:E,1,FALSE)=A527,\"Yes\"))","v":"Yes"}]
[513,"Lawrie, Brett",{"$f":"IF(ISNA(IF(VLOOKUP(A528,Draft!E:E,1,FALSE)=A528,\"Yes\")),\"\",IF(VLOOKUP(A528,Draft!E:E,1,FALSE)=A528,\"Yes\"))","v":"Yes"}]
[514,"Frazier, Todd",{"$f":"IF(ISNA(IF(VLOOKUP(A529,Draft!E:E,1,FALSE)=A529,\"Yes\")),\"\",IF(VLOOKUP(A529,Draft!E:E,1,FALSE)=A529,\"Yes\"))","v":"Yes"}]
[515,"Vallejo, Jose",{"$f":"IF(ISNA(IF(VLOOKUP(A530,Draft!E:E,1,FALSE)=A530,\"Yes\")),\"\",IF(VLOOKUP(A530,Draft!E:E,1,FALSE)=A530,\"Yes\"))","v":""}]
[516,"Kobernus, Jeffrey",{"$f":"IF(ISNA(IF(VLOOKUP(A531,Draft!E:E,1,FALSE)=A531,\"Yes\")),\"\",IF(VLOOKUP(A531,Draft!E:E,1,FALSE)=A531,\"Yes\"))","v":""}]
[517,"Zimmerman, Ryan",{"$f":"IF(ISNA(IF(VLOOKUP(A532,Draft!E:E,1,FALSE)=A532,\"Yes\")),\"\",IF(VLOOKUP(A532,Draft!E:E,1,FALSE)=A532,\"Yes\"))","v":"Yes"}]
[518,"Reynolds, Mark",{"$f":"IF(ISNA(IF(VLOOKUP(A533,Draft!E:E,1,FALSE)=A533,\"Yes\")),\"\",IF(VLOOKUP(A533,Draft!E:E,1,FALSE)=A533,\"Yes\"))","v":"Yes"}]
[519,"Cantu, Jorge",{"$f":"IF(ISNA(IF(VLOOKUP(A534,Draft!E:E,1,FALSE)=A534,\"Yes\")),\"\",IF(VLOOKUP(A534,Draft!E:E,1,FALSE)=A534,\"Yes\"))","v":"Yes"}]
[520,"Sandoval, Pablo",{"$f":"IF(ISNA(IF(VLOOKUP(A535,Draft!E:E,1,FALSE)=A535,\"Yes\")),\"\",IF(VLOOKUP(A535,Draft!E:E,1,FALSE)=A535,\"Yes\"))","v":"Yes"}]
[521,"Feliz, Pedro",{"$f":"IF(ISNA(IF(VLOOKUP(A536,Draft!E:E,1,FALSE)=A536,\"Yes\")),\"\",IF(VLOOKUP(A536,Draft!E:E,1,FALSE)=A536,\"Yes\"))","v":"Yes"}]
[522,"Wright, David",{"$f":"IF(ISNA(IF(VLOOKUP(A537,Draft!E:E,1,FALSE)=A537,\"Yes\")),\"\",IF(VLOOKUP(A537,Draft!E:E,1,FALSE)=A537,\"Yes\"))","v":"Yes"}]
[523,"Headley, Chase",{"$f":"IF(ISNA(IF(VLOOKUP(A538,Draft!E:E,1,FALSE)=A538,\"Yes\")),\"\",IF(VLOOKUP(A538,Draft!E:E,1,FALSE)=A538,\"Yes\"))","v":"Yes"}]
[524,"Jones, Chipper",{"$f":"IF(ISNA(IF(VLOOKUP(A539,Draft!E:E,1,FALSE)=A539,\"Yes\")),\"\",IF(VLOOKUP(A539,Draft!E:E,1,FALSE)=A539,\"Yes\"))","v":"Yes"}]
[525,"LaRoche, Andy",{"$f":"IF(ISNA(IF(VLOOKUP(A540,Draft!E:E,1,FALSE)=A540,\"Yes\")),\"\",IF(VLOOKUP(A540,Draft!E:E,1,FALSE)=A540,\"Yes\"))","v":"Yes"}]
[526,"DeRosa, Mark",{"$f":"IF(ISNA(IF(VLOOKUP(A541,Draft!E:E,1,FALSE)=A541,\"Yes\")),\"\",IF(VLOOKUP(A541,Draft!E:E,1,FALSE)=A541,\"Yes\"))","v":"Yes"}]
[527,"Blake, Casey",{"$f":"IF(ISNA(IF(VLOOKUP(A542,Draft!E:E,1,FALSE)=A542,\"Yes\")),\"\",IF(VLOOKUP(A542,Draft!E:E,1,FALSE)=A542,\"Yes\"))","v":"Yes"}]
[528,"Rolen, Scott",{"$f":"IF(ISNA(IF(VLOOKUP(A543,Draft!E:E,1,FALSE)=A543,\"Yes\")),\"\",IF(VLOOKUP(A543,Draft!E:E,1,FALSE)=A543,\"Yes\"))","v":"Yes"}]
[529,"Stewart, Ian",{"$f":"IF(ISNA(IF(VLOOKUP(A544,Draft!E:E,1,FALSE)=A544,\"Yes\")),\"\",IF(VLOOKUP(A544,Draft!E:E,1,FALSE)=A544,\"Yes\"))","v":"Yes"}]
[530,"Blum, Geoff",{"$f":"IF(ISNA(IF(VLOOKUP(A545,Draft!E:E,1,FALSE)=A545,\"Yes\")),\"\",IF(VLOOKUP(A545,Draft!E:E,1,FALSE)=A545,\"Yes\"))","v":""}]
[531,"Ramirez, Aramis",{"$f":"IF(ISNA(IF(VLOOKUP(A546,Draft!E:E,1,FALSE)=A546,\"Yes\")),\"\",IF(VLOOKUP(A546,Draft!E:E,1,FALSE)=A546,\"Yes\"))","v":"Yes"}]
[532,"Crosby, Bobby",{"$f":"IF(ISNA(IF(VLOOKUP(A547,Draft!E:E,1,FALSE)=A547,\"Yes\")),\"\",IF(VLOOKUP(A547,Draft!E:E,1,FALSE)=A547,\"Yes\"))","v":"Yes"}]
[533,"Rosales, Adam",{"$f":"IF(ISNA(IF(VLOOKUP(A548,Draft!E:E,1,FALSE)=A548,\"Yes\")),\"\",IF(VLOOKUP(A548,Draft!E:E,1,FALSE)=A548,\"Yes\"))","v":""}]
[534,"Helms, Wes",{"$f":"IF(ISNA(IF(VLOOKUP(A549,Draft!E:E,1,FALSE)=A549,\"Yes\")),\"\",IF(VLOOKUP(A549,Draft!E:E,1,FALSE)=A549,\"Yes\"))","v":""}]
[535,"Dobbs, Greg",{"$f":"IF(ISNA(IF(VLOOKUP(A550,Draft!E:E,1,FALSE)=A550,\"Yes\")),\"\",IF(VLOOKUP(A550,Draft!E:E,1,FALSE)=A550,\"Yes\"))","v":""}]
[536,"Gamel, Mathew",{"$f":"IF(ISNA(IF(VLOOKUP(A551,Draft!E:E,1,FALSE)=A551,\"Yes\")),\"\",IF(VLOOKUP(A551,Draft!E:E,1,FALSE)=A551,\"Yes\"))","v":"Yes"}]
[537,"Barden, Brian",{"$f":"IF(ISNA(IF(VLOOKUP(A552,Draft!E:E,1,FALSE)=A552,\"Yes\")),\"\",IF(VLOOKUP(A552,Draft!E:E,1,FALSE)=A552,\"Yes\"))","v":""}]
[538,"Ransom, Cody",{"$f":"IF(ISNA(IF(VLOOKUP(A553,Draft!E:E,1,FALSE)=A553,\"Yes\")),\"\",IF(VLOOKUP(A553,Draft!E:E,1,FALSE)=A553,\"Yes\"))","v":""}]
[539,"Walker, Neil",{"$f":"IF(ISNA(IF(VLOOKUP(A554,Draft!E:E,1,FALSE)=A554,\"Yes\")),\"\",IF(VLOOKUP(A554,Draft!E:E,1,FALSE)=A554,\"Yes\"))","v":""}]
[540,"Freese, David",{"$f":"IF(ISNA(IF(VLOOKUP(A555,Draft!E:E,1,FALSE)=A555,\"Yes\")),\"\",IF(VLOOKUP(A555,Draft!E:E,1,FALSE)=A555,\"Yes\"))","v":"Yes"}]
[541,"Glaus, Troy",{"$f":"IF(ISNA(IF(VLOOKUP(A556,Draft!E:E,1,FALSE)=A556,\"Yes\")),\"\",IF(VLOOKUP(A556,Draft!E:E,1,FALSE)=A556,\"Yes\"))","v":"Yes"}]
[542,"Francisco, Juan",{"$f":"IF(ISNA(IF(VLOOKUP(A557,Draft!E:E,1,FALSE)=A557,\"Yes\")),\"\",IF(VLOOKUP(A557,Draft!E:E,1,FALSE)=A557,\"Yes\"))","v":"Yes"}]
[543,"Johnson, Chris",{"$f":"IF(ISNA(IF(VLOOKUP(A558,Draft!E:E,1,FALSE)=A558,\"Yes\")),\"\",IF(VLOOKUP(A558,Draft!E:E,1,FALSE)=A558,\"Yes\"))","v":"Yes"}]
[544,"Rohlinger, Ryan",{"$f":"IF(ISNA(IF(VLOOKUP(A559,Draft!E:E,1,FALSE)=A559,\"Yes\")),\"\",IF(VLOOKUP(A559,Draft!E:E,1,FALSE)=A559,\"Yes\"))","v":""}]
[545,"Hessman, Mike",{"$f":"IF(ISNA(IF(VLOOKUP(A560,Draft!E:E,1,FALSE)=A560,\"Yes\")),\"\",IF(VLOOKUP(A560,Draft!E:E,1,FALSE)=A560,\"Yes\"))","v":""}]
[546,"Cervenak, Michael",{"$f":"IF(ISNA(IF(VLOOKUP(A561,Draft!E:E,1,FALSE)=A561,\"Yes\")),\"\",IF(VLOOKUP(A561,Draft!E:E,1,FALSE)=A561,\"Yes\"))","v":""}]
[547,"Gillaspie, Conor",{"$f":"IF(ISNA(IF(VLOOKUP(A562,Draft!E:E,1,FALSE)=A562,\"Yes\")),\"\",IF(VLOOKUP(A562,Draft!E:E,1,FALSE)=A562,\"Yes\"))","v":""}]
[548,"Vitters, Joshua",{"$f":"IF(ISNA(IF(VLOOKUP(A563,Draft!E:E,1,FALSE)=A563,\"Yes\")),\"\",IF(VLOOKUP(A563,Draft!E:E,1,FALSE)=A563,\"Yes\"))","v":"Yes"}]
[549,"Meyer, Jon",{"$f":"IF(ISNA(IF(VLOOKUP(A564,Draft!E:E,1,FALSE)=A564,\"Yes\")),\"\",IF(VLOOKUP(A564,Draft!E:E,1,FALSE)=A564,\"Yes\"))","v":""}]
[550,"Alvarez, Pedro",{"$f":"IF(ISNA(IF(VLOOKUP(A565,Draft!E:E,1,FALSE)=A565,\"Yes\")),\"\",IF(VLOOKUP(A565,Draft!E:E,1,FALSE)=A565,\"Yes\"))","v":"Yes"}]
[551,"Forsythe, Logan",{"$f":"IF(ISNA(IF(VLOOKUP(A566,Draft!E:E,1,FALSE)=A566,\"Yes\")),\"\",IF(VLOOKUP(A566,Draft!E:E,1,FALSE)=A566,\"Yes\"))","v":""}]
[552,"Darnell, James",{"$f":"IF(ISNA(IF(VLOOKUP(A567,Draft!E:E,1,FALSE)=A567,\"Yes\")),\"\",IF(VLOOKUP(A567,Draft!E:E,1,FALSE)=A567,\"Yes\"))","v":""}]
[553,"Arenado, Nolan",{"$f":"IF(ISNA(IF(VLOOKUP(A568,Draft!E:E,1,FALSE)=A568,\"Yes\")),\"\",IF(VLOOKUP(A568,Draft!E:E,1,FALSE)=A568,\"Yes\"))","v":""}]
[554,"Dominguez, Matthew",{"$f":"IF(ISNA(IF(VLOOKUP(A569,Draft!E:E,1,FALSE)=A569,\"Yes\")),\"\",IF(VLOOKUP(A569,Draft!E:E,1,FALSE)=A569,\"Yes\"))","v":"Yes"}]
[555,"Jimenez, Jorge",{"$f":"IF(ISNA(IF(VLOOKUP(A570,Draft!E:E,1,FALSE)=A570,\"Yes\")),\"\",IF(VLOOKUP(A570,Draft!E:E,1,FALSE)=A570,\"Yes\"))","v":""}]
[556,"Borchering, Robert",{"$f":"IF(ISNA(IF(VLOOKUP(A571,Draft!E:E,1,FALSE)=A571,\"Yes\")),\"\",IF(VLOOKUP(A571,Draft!E:E,1,FALSE)=A571,\"Yes\"))","v":"Yes"}]
[557,"Davidson, Matt",{"$f":"IF(ISNA(IF(VLOOKUP(A572,Draft!E:E,1,FALSE)=A572,\"Yes\")),\"\",IF(VLOOKUP(A572,Draft!E:E,1,FALSE)=A572,\"Yes\"))","v":""}]
[558,"Rollins, Jimmy",{"$f":"IF(ISNA(IF(VLOOKUP(A573,Draft!E:E,1,FALSE)=A573,\"Yes\")),\"\",IF(VLOOKUP(A573,Draft!E:E,1,FALSE)=A573,\"Yes\"))","v":"Yes"}]
[559,"Furcal, Rafael",{"$f":"IF(ISNA(IF(VLOOKUP(A574,Draft!E:E,1,FALSE)=A574,\"Yes\")),\"\",IF(VLOOKUP(A574,Draft!E:E,1,FALSE)=A574,\"Yes\"))","v":"Yes"}]
[560,"Theriot, Ryan",{"$f":"IF(ISNA(IF(VLOOKUP(A575,Draft!E:E,1,FALSE)=A575,\"Yes\")),\"\",IF(VLOOKUP(A575,Draft!E:E,1,FALSE)=A575,\"Yes\"))","v":"Yes"}]
[561,"Ramirez, Hanley",{"$f":"IF(ISNA(IF(VLOOKUP(A576,Draft!E:E,1,FALSE)=A576,\"Yes\")),\"\",IF(VLOOKUP(A576,Draft!E:E,1,FALSE)=A576,\"Yes\"))","v":"Yes"}]
[562,"Tulowitzki, Troy",{"$f":"IF(ISNA(IF(VLOOKUP(A577,Draft!E:E,1,FALSE)=A577,\"Yes\")),\"\",IF(VLOOKUP(A577,Draft!E:E,1,FALSE)=A577,\"Yes\"))","v":"Yes"}]
[563,"Escobar, Yunel",{"$f":"IF(ISNA(IF(VLOOKUP(A578,Draft!E:E,1,FALSE)=A578,\"Yes\")),\"\",IF(VLOOKUP(A578,Draft!E:E,1,FALSE)=A578,\"Yes\"))","v":"Yes"}]
[564,"Drew, Stephen",{"$f":"IF(ISNA(IF(VLOOKUP(A579,Draft!E:E,1,FALSE)=A579,\"Yes\")),\"\",IF(VLOOKUP(A579,Draft!E:E,1,FALSE)=A579,\"Yes\"))","v":"Yes"}]
[565,"Guzman, Cristian",{"$f":"IF(ISNA(IF(VLOOKUP(A580,Draft!E:E,1,FALSE)=A580,\"Yes\")),\"\",IF(VLOOKUP(A580,Draft!E:E,1,FALSE)=A580,\"Yes\"))","v":"Yes"}]
[566,"Renteria, Edgar",{"$f":"IF(ISNA(IF(VLOOKUP(A581,Draft!E:E,1,FALSE)=A581,\"Yes\")),\"\",IF(VLOOKUP(A581,Draft!E:E,1,FALSE)=A581,\"Yes\"))","v":"Yes"}]
[567,"Bonifacio, Emilio",{"$f":"IF(ISNA(IF(VLOOKUP(A582,Draft!E:E,1,FALSE)=A582,\"Yes\")),\"\",IF(VLOOKUP(A582,Draft!E:E,1,FALSE)=A582,\"Yes\"))","v":""}]
[568,"Counsell, Craig",{"$f":"IF(ISNA(IF(VLOOKUP(A583,Draft!E:E,1,FALSE)=A583,\"Yes\")),\"\",IF(VLOOKUP(A583,Draft!E:E,1,FALSE)=A583,\"Yes\"))","v":"Yes"}]
[569,"Cabrera, Everth",{"$f":"IF(ISNA(IF(VLOOKUP(A584,Draft!E:E,1,FALSE)=A584,\"Yes\")),\"\",IF(VLOOKUP(A584,Draft!E:E,1,FALSE)=A584,\"Yes\"))","v":"Yes"}]
[570,"Uribe, Juan",{"$f":"IF(ISNA(IF(VLOOKUP(A585,Draft!E:E,1,FALSE)=A585,\"Yes\")),\"\",IF(VLOOKUP(A585,Draft!E:E,1,FALSE)=A585,\"Yes\"))","v":"Yes"}]
[571,"Hairston, Jerry",{"$f":"IF(ISNA(IF(VLOOKUP(A586,Draft!E:E,1,FALSE)=A586,\"Yes\")),\"\",IF(VLOOKUP(A586,Draft!E:E,1,FALSE)=A586,\"Yes\"))","v":"Yes"}]
[572,"Ryan, Brendan",{"$f":"IF(ISNA(IF(VLOOKUP(A587,Draft!E:E,1,FALSE)=A587,\"Yes\")),\"\",IF(VLOOKUP(A587,Draft!E:E,1,FALSE)=A587,\"Yes\"))","v":"Yes"}]
[573,"Cedeno, Ronny",{"$f":"IF(ISNA(IF(VLOOKUP(A588,Draft!E:E,1,FALSE)=A588,\"Yes\")),\"\",IF(VLOOKUP(A588,Draft!E:E,1,FALSE)=A588,\"Yes\"))","v":"Yes"}]
[574,"Gonzalez, Alberto",{"$f":"IF(ISNA(IF(VLOOKUP(A589,Draft!E:E,1,FALSE)=A589,\"Yes\")),\"\",IF(VLOOKUP(A589,Draft!E:E,1,FALSE)=A589,\"Yes\"))","v":""}]
[575,"Green(LA), Nick",{"$f":"IF(ISNA(IF(VLOOKUP(A590,Draft!E:E,1,FALSE)=A590,\"Yes\")),\"\",IF(VLOOKUP(A590,Draft!E:E,1,FALSE)=A590,\"Yes\"))","v":""}]
[576,"Ojeda, Augie",{"$f":"IF(ISNA(IF(VLOOKUP(A591,Draft!E:E,1,FALSE)=A591,\"Yes\")),\"\",IF(VLOOKUP(A591,Draft!E:E,1,FALSE)=A591,\"Yes\"))","v":""}]
[577,"Cora, Alex",{"$f":"IF(ISNA(IF(VLOOKUP(A592,Draft!E:E,1,FALSE)=A592,\"Yes\")),\"\",IF(VLOOKUP(A592,Draft!E:E,1,FALSE)=A592,\"Yes\"))","v":""}]
[578,"Lugo, Julio",{"$f":"IF(ISNA(IF(VLOOKUP(A593,Draft!E:E,1,FALSE)=A593,\"Yes\")),\"\",IF(VLOOKUP(A593,Draft!E:E,1,FALSE)=A593,\"Yes\"))","v":""}]
[579,"Janish, Paul",{"$f":"IF(ISNA(IF(VLOOKUP(A594,Draft!E:E,1,FALSE)=A594,\"Yes\")),\"\",IF(VLOOKUP(A594,Draft!E:E,1,FALSE)=A594,\"Yes\"))","v":""}]
[580,"Vazquez, Ramon",{"$f":"IF(ISNA(IF(VLOOKUP(A595,Draft!E:E,1,FALSE)=A595,\"Yes\")),\"\",IF(VLOOKUP(A595,Draft!E:E,1,FALSE)=A595,\"Yes\"))","v":""}]
[581,"Infante, Omar",{"$f":"IF(ISNA(IF(VLOOKUP(A596,Draft!E:E,1,FALSE)=A596,\"Yes\")),\"\",IF(VLOOKUP(A596,Draft!E:E,1,FALSE)=A596,\"Yes\"))","v":"Yes"}]
[582,"Reyes(NYN), Jose",{"$f":"IF(ISNA(IF(VLOOKUP(A597,Draft!E:E,1,FALSE)=A597,\"Yes\")),\"\",IF(VLOOKUP(A597,Draft!E:E,1,FALSE)=A597,\"Yes\"))","v":"Yes"}]
[583,"Blanco, Andres",{"$f":"IF(ISNA(IF(VLOOKUP(A598,Draft!E:E,1,FALSE)=A598,\"Yes\")),\"\",IF(VLOOKUP(A598,Draft!E:E,1,FALSE)=A598,\"Yes\"))","v":""}]
[584,"Escobar, Alcides",{"$f":"IF(ISNA(IF(VLOOKUP(A599,Draft!E:E,1,FALSE)=A599,\"Yes\")),\"\",IF(VLOOKUP(A599,Draft!E:E,1,FALSE)=A599,\"Yes\"))","v":"Yes"}]
[585,"Castro, Juan",{"$f":"IF(ISNA(IF(VLOOKUP(A600,Draft!E:E,1,FALSE)=A600,\"Yes\")),\"\",IF(VLOOKUP(A600,Draft!E:E,1,FALSE)=A600,\"Yes\"))","v":"Yes"}]
[586,"Greene, Tyler",{"$f":"IF(ISNA(IF(VLOOKUP(A601,Draft!E:E,1,FALSE)=A601,\"Yes\")),\"\",IF(VLOOKUP(A601,Draft!E:E,1,FALSE)=A601,\"Yes\"))","v":""}]
[587,"Bruntlett, Eric",{"$f":"IF(ISNA(IF(VLOOKUP(A602,Draft!E:E,1,FALSE)=A602,\"Yes\")),\"\",IF(VLOOKUP(A602,Draft!E:E,1,FALSE)=A602,\"Yes\"))","v":""}]
[588,"Valdez, Wilson",{"$f":"IF(ISNA(IF(VLOOKUP(A603,Draft!E:E,1,FALSE)=A603,\"Yes\")),\"\",IF(VLOOKUP(A603,Draft!E:E,1,FALSE)=A603,\"Yes\"))","v":""}]
[589,"Hernandez, Diory",{"$f":"IF(ISNA(IF(VLOOKUP(A604,Draft!E:E,1,FALSE)=A604,\"Yes\")),\"\",IF(VLOOKUP(A604,Draft!E:E,1,FALSE)=A604,\"Yes\"))","v":""}]
[590,"Desmond, Ian",{"$f":"IF(ISNA(IF(VLOOKUP(A605,Draft!E:E,1,FALSE)=A605,\"Yes\")),\"\",IF(VLOOKUP(A605,Draft!E:E,1,FALSE)=A605,\"Yes\"))","v":"Yes"}]
[591,"Orr, Pete",{"$f":"IF(ISNA(IF(VLOOKUP(A606,Draft!E:E,1,FALSE)=A606,\"Yes\")),\"\",IF(VLOOKUP(A606,Draft!E:E,1,FALSE)=A606,\"Yes\"))","v":""}]
[592,"Cruz, Luis",{"$f":"IF(ISNA(IF(VLOOKUP(A607,Draft!E:E,1,FALSE)=A607,\"Yes\")),\"\",IF(VLOOKUP(A607,Draft!E:E,1,FALSE)=A607,\"Yes\"))","v":""}]
[593,"Berroa, Angel",{"$f":"IF(ISNA(IF(VLOOKUP(A608,Draft!E:E,1,FALSE)=A608,\"Yes\")),\"\",IF(VLOOKUP(A608,Draft!E:E,1,FALSE)=A608,\"Yes\"))","v":""}]
[594,"Hu, Chin-Lung",{"$f":"IF(ISNA(IF(VLOOKUP(A609,Draft!E:E,1,FALSE)=A609,\"Yes\")),\"\",IF(VLOOKUP(A609,Draft!E:E,1,FALSE)=A609,\"Yes\"))","v":""}]
[595,"Manzella, Tommy",{"$f":"IF(ISNA(IF(VLOOKUP(A610,Draft!E:E,1,FALSE)=A610,\"Yes\")),\"\",IF(VLOOKUP(A610,Draft!E:E,1,FALSE)=A610,\"Yes\"))","v":"Yes"}]
[596,"Navarro, Oswaldo",{"$f":"IF(ISNA(IF(VLOOKUP(A611,Draft!E:E,1,FALSE)=A611,\"Yes\")),\"\",IF(VLOOKUP(A611,Draft!E:E,1,FALSE)=A611,\"Yes\"))","v":""}]
[597,"Lee, Hak-Ju",{"$f":"IF(ISNA(IF(VLOOKUP(A612,Draft!E:E,1,FALSE)=A612,\"Yes\")),\"\",IF(VLOOKUP(A612,Draft!E:E,1,FALSE)=A612,\"Yes\"))","v":"Yes"}]
[598,"LeMahieu, David",{"$f":"IF(ISNA(IF(VLOOKUP(A613,Draft!E:E,1,FALSE)=A613,\"Yes\")),\"\",IF(VLOOKUP(A613,Draft!E:E,1,FALSE)=A613,\"Yes\"))","v":""}]
[599,"Castro, Starlin",{"$f":"IF(ISNA(IF(VLOOKUP(A614,Draft!E:E,1,FALSE)=A614,\"Yes\")),\"\",IF(VLOOKUP(A614,Draft!E:E,1,FALSE)=A614,\"Yes\"))","v":"Yes"}]
[600,"Valaika, Chris",{"$f":"IF(ISNA(IF(VLOOKUP(A615,Draft!E:E,1,FALSE)=A615,\"Yes\")),\"\",IF(VLOOKUP(A615,Draft!E:E,1,FALSE)=A615,\"Yes\"))","v":""}]
[601,"Hamilton, Billy",{"$f":"IF(ISNA(IF(VLOOKUP(A616,Draft!E:E,1,FALSE)=A616,\"Yes\")),\"\",IF(VLOOKUP(A616,Draft!E:E,1,FALSE)=A616,\"Yes\"))","v":""}]
[602,"Mier, Jiovanni",{"$f":"IF(ISNA(IF(VLOOKUP(A617,Draft!E:E,1,FALSE)=A617,\"Yes\")),\"\",IF(VLOOKUP(A617,Draft!E:E,1,FALSE)=A617,\"Yes\"))","v":"Yes"}]
[603,"DeJesus, Ivan",{"$f":"IF(ISNA(IF(VLOOKUP(A618,Draft!E:E,1,FALSE)=A618,\"Yes\")),\"\",IF(VLOOKUP(A618,Draft!E:E,1,FALSE)=A618,\"Yes\"))","v":""}]
[604,"Gordon, Devaris",{"$f":"IF(ISNA(IF(VLOOKUP(A619,Draft!E:E,1,FALSE)=A619,\"Yes\")),\"\",IF(VLOOKUP(A619,Draft!E:E,1,FALSE)=A619,\"Yes\"))","v":"Yes"}]
[605,"Espinosa, Danny",{"$f":"IF(ISNA(IF(VLOOKUP(A620,Draft!E:E,1,FALSE)=A620,\"Yes\")),\"\",IF(VLOOKUP(A620,Draft!E:E,1,FALSE)=A620,\"Yes\"))","v":"Yes"}]
[606,"Havens, Reese",{"$f":"IF(ISNA(IF(VLOOKUP(A621,Draft!E:E,1,FALSE)=A621,\"Yes\")),\"\",IF(VLOOKUP(A621,Draft!E:E,1,FALSE)=A621,\"Yes\"))","v":"Yes"}]
[607,"Flores, Wilmer",{"$f":"IF(ISNA(IF(VLOOKUP(A622,Draft!E:E,1,FALSE)=A622,\"Yes\")),\"\",IF(VLOOKUP(A622,Draft!E:E,1,FALSE)=A622,\"Yes\"))","v":""}]
[608,"Tejada, Ruben",{"$f":"IF(ISNA(IF(VLOOKUP(A623,Draft!E:E,1,FALSE)=A623,\"Yes\")),\"\",IF(VLOOKUP(A623,Draft!E:E,1,FALSE)=A623,\"Yes\"))","v":""}]
[609,"Shields, Robert",{"$f":"IF(ISNA(IF(VLOOKUP(A624,Draft!E:E,1,FALSE)=A624,\"Yes\")),\"\",IF(VLOOKUP(A624,Draft!E:E,1,FALSE)=A624,\"Yes\"))","v":""}]
[610,"Nelson, Chris",{"$f":"IF(ISNA(IF(VLOOKUP(A625,Draft!E:E,1,FALSE)=A625,\"Yes\")),\"\",IF(VLOOKUP(A625,Draft!E:E,1,FALSE)=A625,\"Yes\"))","v":""}]
[611,"Gomez, Hector",{"$f":"IF(ISNA(IF(VLOOKUP(A626,Draft!E:E,1,FALSE)=A626,\"Yes\")),\"\",IF(VLOOKUP(A626,Draft!E:E,1,FALSE)=A626,\"Yes\"))","v":""}]
[612,"Owings, Chris",{"$f":"IF(ISNA(IF(VLOOKUP(A627,Draft!E:E,1,FALSE)=A627,\"Yes\")),\"\",IF(VLOOKUP(A627,Draft!E:E,1,FALSE)=A627,\"Yes\"))","v":""}]
[613,"Braun(Mil), Ryan",{"$f":"IF(ISNA(IF(VLOOKUP(A628,Draft!E:E,1,FALSE)=A628,\"Yes\")),\"\",IF(VLOOKUP(A628,Draft!E:E,1,FALSE)=A628,\"Yes\"))","v":"Yes"}]
[614,"Victorino, Shane",{"$f":"IF(ISNA(IF(VLOOKUP(A629,Draft!E:E,1,FALSE)=A629,\"Yes\")),\"\",IF(VLOOKUP(A629,Draft!E:E,1,FALSE)=A629,\"Yes\"))","v":"Yes"}]
[615,"Ethier, Andre",{"$f":"IF(ISNA(IF(VLOOKUP(A630,Draft!E:E,1,FALSE)=A630,\"Yes\")),\"\",IF(VLOOKUP(A630,Draft!E:E,1,FALSE)=A630,\"Yes\"))","v":"Yes"}]
[616,"Bourn, Michael",{"$f":"IF(ISNA(IF(VLOOKUP(A631,Draft!E:E,1,FALSE)=A631,\"Yes\")),\"\",IF(VLOOKUP(A631,Draft!E:E,1,FALSE)=A631,\"Yes\"))","v":"Yes"}]
[617,"Werth, Jayson",{"$f":"IF(ISNA(IF(VLOOKUP(A632,Draft!E:E,1,FALSE)=A632,\"Yes\")),\"\",IF(VLOOKUP(A632,Draft!E:E,1,FALSE)=A632,\"Yes\"))","v":"Yes"}]
[618,"Holliday, Matt",{"$f":"IF(ISNA(IF(VLOOKUP(A633,Draft!E:E,1,FALSE)=A633,\"Yes\")),\"\",IF(VLOOKUP(A633,Draft!E:E,1,FALSE)=A633,\"Yes\"))","v":"Yes"}]
[619,"Kemp, Matt",{"$f":"IF(ISNA(IF(VLOOKUP(A634,Draft!E:E,1,FALSE)=A634,\"Yes\")),\"\",IF(VLOOKUP(A634,Draft!E:E,1,FALSE)=A634,\"Yes\"))","v":"Yes"}]
[620,"Lee, Carlos",{"$f":"IF(ISNA(IF(VLOOKUP(A635,Draft!E:E,1,FALSE)=A635,\"Yes\")),\"\",IF(VLOOKUP(A635,Draft!E:E,1,FALSE)=A635,\"Yes\"))","v":"Yes"}]
[621,"Pence, Hunter",{"$f":"IF(ISNA(IF(VLOOKUP(A636,Draft!E:E,1,FALSE)=A636,\"Yes\")),\"\",IF(VLOOKUP(A636,Draft!E:E,1,FALSE)=A636,\"Yes\"))","v":"Yes"}]
[622,"Bay, Jason",{"$f":"IF(ISNA(IF(VLOOKUP(A637,Draft!E:E,1,FALSE)=A637,\"Yes\")),\"\",IF(VLOOKUP(A637,Draft!E:E,1,FALSE)=A637,\"Yes\"))","v":"Yes"}]
[623,"Francoeur, Jeff",{"$f":"IF(ISNA(IF(VLOOKUP(A638,Draft!E:E,1,FALSE)=A638,\"Yes\")),\"\",IF(VLOOKUP(A638,Draft!E:E,1,FALSE)=A638,\"Yes\"))","v":"Yes"}]
[624,"Ross, Cody",{"$f":"IF(ISNA(IF(VLOOKUP(A639,Draft!E:E,1,FALSE)=A639,\"Yes\")),\"\",IF(VLOOKUP(A639,Draft!E:E,1,FALSE)=A639,\"Yes\"))","v":"Yes"}]
[625,"Fukudome, Kosuke",{"$f":"IF(ISNA(IF(VLOOKUP(A640,Draft!E:E,1,FALSE)=A640,\"Yes\")),\"\",IF(VLOOKUP(A640,Draft!E:E,1,FALSE)=A640,\"Yes\"))","v":"Yes"}]
[626,"Byrd, Marlon",{"$f":"IF(ISNA(IF(VLOOKUP(A641,Draft!E:E,1,FALSE)=A641,\"Yes\")),\"\",IF(VLOOKUP(A641,Draft!E:E,1,FALSE)=A641,\"Yes\"))","v":"Yes"}]
[627,"Hawpe, Brad",{"$f":"IF(ISNA(IF(VLOOKUP(A642,Draft!E:E,1,FALSE)=A642,\"Yes\")),\"\",IF(VLOOKUP(A642,Draft!E:E,1,FALSE)=A642,\"Yes\"))","v":"Yes"}]
[628,"McLouth, Nate",{"$f":"IF(ISNA(IF(VLOOKUP(A643,Draft!E:E,1,FALSE)=A643,\"Yes\")),\"\",IF(VLOOKUP(A643,Draft!E:E,1,FALSE)=A643,\"Yes\"))","v":"Yes"}]
[629,"Upton, Justin",{"$f":"IF(ISNA(IF(VLOOKUP(A644,Draft!E:E,1,FALSE)=A644,\"Yes\")),\"\",IF(VLOOKUP(A644,Draft!E:E,1,FALSE)=A644,\"Yes\"))","v":"Yes"}]
[630,"Coghlan, Chris",{"$f":"IF(ISNA(IF(VLOOKUP(A645,Draft!E:E,1,FALSE)=A645,\"Yes\")),\"\",IF(VLOOKUP(A645,Draft!E:E,1,FALSE)=A645,\"Yes\"))","v":"Yes"}]
[631,"Ibanez, Raul",{"$f":"IF(ISNA(IF(VLOOKUP(A646,Draft!E:E,1,FALSE)=A646,\"Yes\")),\"\",IF(VLOOKUP(A646,Draft!E:E,1,FALSE)=A646,\"Yes\"))","v":"Yes"}]
[632,"Rowand, Aaron",{"$f":"IF(ISNA(IF(VLOOKUP(A647,Draft!E:E,1,FALSE)=A647,\"Yes\")),\"\",IF(VLOOKUP(A647,Draft!E:E,1,FALSE)=A647,\"Yes\"))","v":"Yes"}]
[633,"Ludwick, Ryan",{"$f":"IF(ISNA(IF(VLOOKUP(A648,Draft!E:E,1,FALSE)=A648,\"Yes\")),\"\",IF(VLOOKUP(A648,Draft!E:E,1,FALSE)=A648,\"Yes\"))","v":"Yes"}]
[634,"Cabrera, Melky",{"$f":"IF(ISNA(IF(VLOOKUP(A649,Draft!E:E,1,FALSE)=A649,\"Yes\")),\"\",IF(VLOOKUP(A649,Draft!E:E,1,FALSE)=A649,\"Yes\"))","v":"Yes"}]
[635,"Soriano, Alfonso",{"$f":"IF(ISNA(IF(VLOOKUP(A650,Draft!E:E,1,FALSE)=A650,\"Yes\")),\"\",IF(VLOOKUP(A650,Draft!E:E,1,FALSE)=A650,\"Yes\"))","v":"Yes"}]
[636,"Morgan, Nyjer",{"$f":"IF(ISNA(IF(VLOOKUP(A651,Draft!E:E,1,FALSE)=A651,\"Yes\")),\"\",IF(VLOOKUP(A651,Draft!E:E,1,FALSE)=A651,\"Yes\"))","v":"Yes"}]
[637,"Rasmus, Colby",{"$f":"IF(ISNA(IF(VLOOKUP(A652,Draft!E:E,1,FALSE)=A652,\"Yes\")),\"\",IF(VLOOKUP(A652,Draft!E:E,1,FALSE)=A652,\"Yes\"))","v":"Yes"}]
[638,"Fowler, Dexter",{"$f":"IF(ISNA(IF(VLOOKUP(A653,Draft!E:E,1,FALSE)=A653,\"Yes\")),\"\",IF(VLOOKUP(A653,Draft!E:E,1,FALSE)=A653,\"Yes\"))","v":"Yes"}]
[639,"Willingham, Josh",{"$f":"IF(ISNA(IF(VLOOKUP(A654,Draft!E:E,1,FALSE)=A654,\"Yes\")),\"\",IF(VLOOKUP(A654,Draft!E:E,1,FALSE)=A654,\"Yes\"))","v":"Yes"}]
[640,"Young(Ari), ChrisB.",{"$f":"IF(ISNA(IF(VLOOKUP(A655,Draft!E:E,1,FALSE)=A655,\"Yes\")),\"\",IF(VLOOKUP(A655,Draft!E:E,1,FALSE)=A655,\"Yes\"))","v":"Yes"}]
[641,"McCutchen, Andrew",{"$f":"IF(ISNA(IF(VLOOKUP(A656,Draft!E:E,1,FALSE)=A656,\"Yes\")),\"\",IF(VLOOKUP(A656,Draft!E:E,1,FALSE)=A656,\"Yes\"))","v":"Yes"}]
[642,"Parra, Gerardo",{"$f":"IF(ISNA(IF(VLOOKUP(A657,Draft!E:E,1,FALSE)=A657,\"Yes\")),\"\",IF(VLOOKUP(A657,Draft!E:E,1,FALSE)=A657,\"Yes\"))","v":""}]
[643,"Hart(Mil), Corey",{"$f":"IF(ISNA(IF(VLOOKUP(A658,Draft!E:E,1,FALSE)=A658,\"Yes\")),\"\",IF(VLOOKUP(A658,Draft!E:E,1,FALSE)=A658,\"Yes\"))","v":"Yes"}]
[644,"Hairston, Scott",{"$f":"IF(ISNA(IF(VLOOKUP(A659,Draft!E:E,1,FALSE)=A659,\"Yes\")),\"\",IF(VLOOKUP(A659,Draft!E:E,1,FALSE)=A659,\"Yes\"))","v":"Yes"}]
[645,"Francisco, Ben",{"$f":"IF(ISNA(IF(VLOOKUP(A660,Draft!E:E,1,FALSE)=A660,\"Yes\")),\"\",IF(VLOOKUP(A660,Draft!E:E,1,FALSE)=A660,\"Yes\"))","v":"Yes"}]
[646,"Gwynn, Tony",{"$f":"IF(ISNA(IF(VLOOKUP(A661,Draft!E:E,1,FALSE)=A661,\"Yes\")),\"\",IF(VLOOKUP(A661,Draft!E:E,1,FALSE)=A661,\"Yes\"))","v":"Yes"}]
[647,"Ramirez, Manny",{"$f":"IF(ISNA(IF(VLOOKUP(A662,Draft!E:E,1,FALSE)=A662,\"Yes\")),\"\",IF(VLOOKUP(A662,Draft!E:E,1,FALSE)=A662,\"Yes\"))","v":"Yes"}]
[648,"Taveras, Willy",{"$f":"IF(ISNA(IF(VLOOKUP(A663,Draft!E:E,1,FALSE)=A663,\"Yes\")),\"\",IF(VLOOKUP(A663,Draft!E:E,1,FALSE)=A663,\"Yes\"))","v":"Yes"}]
[649,"Moss, Brandon",{"$f":"IF(ISNA(IF(VLOOKUP(A664,Draft!E:E,1,FALSE)=A664,\"Yes\")),\"\",IF(VLOOKUP(A664,Draft!E:E,1,FALSE)=A664,\"Yes\"))","v":""}]
[650,"Diaz, Matt",{"$f":"IF(ISNA(IF(VLOOKUP(A665,Draft!E:E,1,FALSE)=A665,\"Yes\")),\"\",IF(VLOOKUP(A665,Draft!E:E,1,FALSE)=A665,\"Yes\"))","v":"Yes"}]
[651,"Dukes, Elijah",{"$f":"IF(ISNA(IF(VLOOKUP(A666,Draft!E:E,1,FALSE)=A666,\"Yes\")),\"\",IF(VLOOKUP(A666,Draft!E:E,1,FALSE)=A666,\"Yes\"))","v":""}]
[652,"Church, Ryan",{"$f":"IF(ISNA(IF(VLOOKUP(A667,Draft!E:E,1,FALSE)=A667,\"Yes\")),\"\",IF(VLOOKUP(A667,Draft!E:E,1,FALSE)=A667,\"Yes\"))","v":"Yes"}]
[653,"Harris, Willie",{"$f":"IF(ISNA(IF(VLOOKUP(A668,Draft!E:E,1,FALSE)=A668,\"Yes\")),\"\",IF(VLOOKUP(A668,Draft!E:E,1,FALSE)=A668,\"Yes\"))","v":"Yes"}]
[654,"Spilborghs, Ryan",{"$f":"IF(ISNA(IF(VLOOKUP(A669,Draft!E:E,1,FALSE)=A669,\"Yes\")),\"\",IF(VLOOKUP(A669,Draft!E:E,1,FALSE)=A669,\"Yes\"))","v":"Yes"}]
[655,"Bruce, Jay",{"$f":"IF(ISNA(IF(VLOOKUP(A670,Draft!E:E,1,FALSE)=A670,\"Yes\")),\"\",IF(VLOOKUP(A670,Draft!E:E,1,FALSE)=A670,\"Yes\"))","v":"Yes"}]
[656,"Smith, Seth",{"$f":"IF(ISNA(IF(VLOOKUP(A671,Draft!E:E,1,FALSE)=A671,\"Yes\")),\"\",IF(VLOOKUP(A671,Draft!E:E,1,FALSE)=A671,\"Yes\"))","v":"Yes"}]
[657,"Pagan, Angel",{"$f":"IF(ISNA(IF(VLOOKUP(A672,Draft!E:E,1,FALSE)=A672,\"Yes\")),\"\",IF(VLOOKUP(A672,Draft!E:E,1,FALSE)=A672,\"Yes\"))","v":"Yes"}]
[658,"Beltran, Carlos",{"$f":"IF(ISNA(IF(VLOOKUP(A673,Draft!E:E,1,FALSE)=A673,\"Yes\")),\"\",IF(VLOOKUP(A673,Draft!E:E,1,FALSE)=A673,\"Yes\"))","v":"Yes"}]
[659,"Jones, Garrett",{"$f":"IF(ISNA(IF(VLOOKUP(A674,Draft!E:E,1,FALSE)=A674,\"Yes\")),\"\",IF(VLOOKUP(A674,Draft!E:E,1,FALSE)=A674,\"Yes\"))","v":"Yes"}]
[660,"Gomez, Carlos",{"$f":"IF(ISNA(IF(VLOOKUP(A675,Draft!E:E,1,FALSE)=A675,\"Yes\")),\"\",IF(VLOOKUP(A675,Draft!E:E,1,FALSE)=A675,\"Yes\"))","v":"Yes"}]
[661,"Lewis, Fred",{"$f":"IF(ISNA(IF(VLOOKUP(A676,Draft!E:E,1,FALSE)=A676,\"Yes\")),\"\",IF(VLOOKUP(A676,Draft!E:E,1,FALSE)=A676,\"Yes\"))","v":""}]
[662,"Nix, Laynce",{"$f":"IF(ISNA(IF(VLOOKUP(A677,Draft!E:E,1,FALSE)=A677,\"Yes\")),\"\",IF(VLOOKUP(A677,Draft!E:E,1,FALSE)=A677,\"Yes\"))","v":""}]
[663,"Venable, Will",{"$f":"IF(ISNA(IF(VLOOKUP(A678,Draft!E:E,1,FALSE)=A678,\"Yes\")),\"\",IF(VLOOKUP(A678,Draft!E:E,1,FALSE)=A678,\"Yes\"))","v":"Yes"}]
[664,"Gonzalez, Carlos",{"$f":"IF(ISNA(IF(VLOOKUP(A679,Draft!E:E,1,FALSE)=A679,\"Yes\")),\"\",IF(VLOOKUP(A679,Draft!E:E,1,FALSE)=A679,\"Yes\"))","v":"Yes"}]
[665,"Schierholtz, Nate",{"$f":"IF(ISNA(IF(VLOOKUP(A680,Draft!E:E,1,FALSE)=A680,\"Yes\")),\"\",IF(VLOOKUP(A680,Draft!E:E,1,FALSE)=A680,\"Yes\"))","v":"Yes"}]
[666,"Anderson, Josh",{"$f":"IF(ISNA(IF(VLOOKUP(A681,Draft!E:E,1,FALSE)=A681,\"Yes\")),\"\",IF(VLOOKUP(A681,Draft!E:E,1,FALSE)=A681,\"Yes\"))","v":""}]
[667,"Dickerson, Chris",{"$f":"IF(ISNA(IF(VLOOKUP(A682,Draft!E:E,1,FALSE)=A682,\"Yes\")),\"\",IF(VLOOKUP(A682,Draft!E:E,1,FALSE)=A682,\"Yes\"))","v":"Yes"}]
[668,"Gerut, Jody",{"$f":"IF(ISNA(IF(VLOOKUP(A683,Draft!E:E,1,FALSE)=A683,\"Yes\")),\"\",IF(VLOOKUP(A683,Draft!E:E,1,FALSE)=A683,\"Yes\"))","v":""}]
[669,"Balentien, Wladimir",{"$f":"IF(ISNA(IF(VLOOKUP(A684,Draft!E:E,1,FALSE)=A684,\"Yes\")),\"\",IF(VLOOKUP(A684,Draft!E:E,1,FALSE)=A684,\"Yes\"))","v":"Yes"}]
[670,"Milledge, Lastings",{"$f":"IF(ISNA(IF(VLOOKUP(A685,Draft!E:E,1,FALSE)=A685,\"Yes\")),\"\",IF(VLOOKUP(A685,Draft!E:E,1,FALSE)=A685,\"Yes\"))","v":"Yes"}]
[671,"Hoffpauir, Micah",{"$f":"IF(ISNA(IF(VLOOKUP(A686,Draft!E:E,1,FALSE)=A686,\"Yes\")),\"\",IF(VLOOKUP(A686,Draft!E:E,1,FALSE)=A686,\"Yes\"))","v":""}]
[672,"Hinske, Eric",{"$f":"IF(ISNA(IF(VLOOKUP(A687,Draft!E:E,1,FALSE)=A687,\"Yes\")),\"\",IF(VLOOKUP(A687,Draft!E:E,1,FALSE)=A687,\"Yes\"))","v":""}]
[673,"Stubbs, Drew",{"$f":"IF(ISNA(IF(VLOOKUP(A688,Draft!E:E,1,FALSE)=A688,\"Yes\")),\"\",IF(VLOOKUP(A688,Draft!E:E,1,FALSE)=A688,\"Yes\"))","v":"Yes"}]
[674,"Maybin, Cameron",{"$f":"IF(ISNA(IF(VLOOKUP(A689,Draft!E:E,1,FALSE)=A689,\"Yes\")),\"\",IF(VLOOKUP(A689,Draft!E:E,1,FALSE)=A689,\"Yes\"))","v":"Yes"}]
[675,"Schafer, Jordan",{"$f":"IF(ISNA(IF(VLOOKUP(A690,Draft!E:E,1,FALSE)=A690,\"Yes\")),\"\",IF(VLOOKUP(A690,Draft!E:E,1,FALSE)=A690,\"Yes\"))","v":"Yes"}]
[676,"Blanks, Kyle",{"$f":"IF(ISNA(IF(VLOOKUP(A691,Draft!E:E,1,FALSE)=A691,\"Yes\")),\"\",IF(VLOOKUP(A691,Draft!E:E,1,FALSE)=A691,\"Yes\"))","v":"Yes"}]
[677,"Torres, Andres",{"$f":"IF(ISNA(IF(VLOOKUP(A692,Draft!E:E,1,FALSE)=A692,\"Yes\")),\"\",IF(VLOOKUP(A692,Draft!E:E,1,FALSE)=A692,\"Yes\"))","v":""}]
[678,"Romero, Alex",{"$f":"IF(ISNA(IF(VLOOKUP(A693,Draft!E:E,1,FALSE)=A693,\"Yes\")),\"\",IF(VLOOKUP(A693,Draft!E:E,1,FALSE)=A693,\"Yes\"))","v":""}]
[679,"Carroll, Brett",{"$f":"IF(ISNA(IF(VLOOKUP(A694,Draft!E:E,1,FALSE)=A694,\"Yes\")),\"\",IF(VLOOKUP(A694,Draft!E:E,1,FALSE)=A694,\"Yes\"))","v":""}]
[680,"Salazar, Oscar",{"$f":"IF(ISNA(IF(VLOOKUP(A695,Draft!E:E,1,FALSE)=A695,\"Yes\")),\"\",IF(VLOOKUP(A695,Draft!E:E,1,FALSE)=A695,\"Yes\"))","v":""}]
[681,"Michaels, Jason",{"$f":"IF(ISNA(IF(VLOOKUP(A696,Draft!E:E,1,FALSE)=A696,\"Yes\")),\"\",IF(VLOOKUP(A696,Draft!E:E,1,FALSE)=A696,\"Yes\"))","v":""}]
[682,"Wise, Dewayne",{"$f":"IF(ISNA(IF(VLOOKUP(A697,Draft!E:E,1,FALSE)=A697,\"Yes\")),\"\",IF(VLOOKUP(A697,Draft!E:E,1,FALSE)=A697,\"Yes\"))","v":""}]
[683,"Fuld, Sam",{"$f":"IF(ISNA(IF(VLOOKUP(A698,Draft!E:E,1,FALSE)=A698,\"Yes\")),\"\",IF(VLOOKUP(A698,Draft!E:E,1,FALSE)=A698,\"Yes\"))","v":""}]
[684,"Jackson, Conor",{"$f":"IF(ISNA(IF(VLOOKUP(A699,Draft!E:E,1,FALSE)=A699,\"Yes\")),\"\",IF(VLOOKUP(A699,Draft!E:E,1,FALSE)=A699,\"Yes\"))","v":"Yes"}]
[685,"Maxwell, Justin",{"$f":"IF(ISNA(IF(VLOOKUP(A700,Draft!E:E,1,FALSE)=A700,\"Yes\")),\"\",IF(VLOOKUP(A700,Draft!E:E,1,FALSE)=A700,\"Yes\"))","v":""}]
[686,"Martinez, Fernando(Jesus)",{"$f":"IF(ISNA(IF(VLOOKUP(A701,Draft!E:E,1,FALSE)=A701,\"Yes\")),\"\",IF(VLOOKUP(A701,Draft!E:E,1,FALSE)=A701,\"Yes\"))","v":"Yes"}]
[687,"Macias, Drew",{"$f":"IF(ISNA(IF(VLOOKUP(A702,Draft!E:E,1,FALSE)=A702,\"Yes\")),\"\",IF(VLOOKUP(A702,Draft!E:E,1,FALSE)=A702,\"Yes\"))","v":""}]
[688,"Stavinoha, Nick",{"$f":"IF(ISNA(IF(VLOOKUP(A703,Draft!E:E,1,FALSE)=A703,\"Yes\")),\"\",IF(VLOOKUP(A703,Draft!E:E,1,FALSE)=A703,\"Yes\"))","v":""}]
[689,"Bowker, John",{"$f":"IF(ISNA(IF(VLOOKUP(A704,Draft!E:E,1,FALSE)=A704,\"Yes\")),\"\",IF(VLOOKUP(A704,Draft!E:E,1,FALSE)=A704,\"Yes\"))","v":""}]
[690,"Oeltjen, Trent",{"$f":"IF(ISNA(IF(VLOOKUP(A705,Draft!E:E,1,FALSE)=A705,\"Yes\")),\"\",IF(VLOOKUP(A705,Draft!E:E,1,FALSE)=A705,\"Yes\"))","v":""}]
[691,"Evans, Nick",{"$f":"IF(ISNA(IF(VLOOKUP(A706,Draft!E:E,1,FALSE)=A706,\"Yes\")),\"\",IF(VLOOKUP(A706,Draft!E:E,1,FALSE)=A706,\"Yes\"))","v":""}]
[692,"Mayberry, John",{"$f":"IF(ISNA(IF(VLOOKUP(A707,Draft!E:E,1,FALSE)=A707,\"Yes\")),\"\",IF(VLOOKUP(A707,Draft!E:E,1,FALSE)=A707,\"Yes\"))","v":""}]
[693,"Cunningham, Aaron",{"$f":"IF(ISNA(IF(VLOOKUP(A708,Draft!E:E,1,FALSE)=A708,\"Yes\")),\"\",IF(VLOOKUP(A708,Draft!E:E,1,FALSE)=A708,\"Yes\"))","v":""}]
[694,"Blanco, Gregor",{"$f":"IF(ISNA(IF(VLOOKUP(A709,Draft!E:E,1,FALSE)=A709,\"Yes\")),\"\",IF(VLOOKUP(A709,Draft!E:E,1,FALSE)=A709,\"Yes\"))","v":""}]
[695,"Duffy, Chris",{"$f":"IF(ISNA(IF(VLOOKUP(A710,Draft!E:E,1,FALSE)=A710,\"Yes\")),\"\",IF(VLOOKUP(A710,Draft!E:E,1,FALSE)=A710,\"Yes\"))","v":""}]
[696,"Robinson, Shane",{"$f":"IF(ISNA(IF(VLOOKUP(A711,Draft!E:E,1,FALSE)=A711,\"Yes\")),\"\",IF(VLOOKUP(A711,Draft!E:E,1,FALSE)=A711,\"Yes\"))","v":""}]
[697,"Colvin, Tyler",{"$f":"IF(ISNA(IF(VLOOKUP(A712,Draft!E:E,1,FALSE)=A712,\"Yes\")),\"\",IF(VLOOKUP(A712,Draft!E:E,1,FALSE)=A712,\"Yes\"))","v":"Yes"}]
[698,"Jones, Brandon",{"$f":"IF(ISNA(IF(VLOOKUP(A713,Draft!E:E,1,FALSE)=A713,\"Yes\")),\"\",IF(VLOOKUP(A713,Draft!E:E,1,FALSE)=A713,\"Yes\"))","v":""}]
[699,"Paul, Xavier",{"$f":"IF(ISNA(IF(VLOOKUP(A714,Draft!E:E,1,FALSE)=A714,\"Yes\")),\"\",IF(VLOOKUP(A714,Draft!E:E,1,FALSE)=A714,\"Yes\"))","v":""}]
[700,"Owens, Jerry",{"$f":"IF(ISNA(IF(VLOOKUP(A715,Draft!E:E,1,FALSE)=A715,\"Yes\")),\"\",IF(VLOOKUP(A715,Draft!E:E,1,FALSE)=A715,\"Yes\"))","v":""}]
[701,"Jones, Mitch",{"$f":"IF(ISNA(IF(VLOOKUP(A716,Draft!E:E,1,FALSE)=A716,\"Yes\")),\"\",IF(VLOOKUP(A716,Draft!E:E,1,FALSE)=A716,\"Yes\"))","v":""}]
[702,"VanEvery, Jonathan",{"$f":"IF(ISNA(IF(VLOOKUP(A717,Draft!E:E,1,FALSE)=A717,\"Yes\")),\"\",IF(VLOOKUP(A717,Draft!E:E,1,FALSE)=A717,\"Yes\"))","v":""}]
[703,"Durango, Luis",{"$f":"IF(ISNA(IF(VLOOKUP(A718,Draft!E:E,1,FALSE)=A718,\"Yes\")),\"\",IF(VLOOKUP(A718,Draft!E:E,1,FALSE)=A718,\"Yes\"))","v":""}]
[704,"Repko, Jason",{"$f":"IF(ISNA(IF(VLOOKUP(A719,Draft!E:E,1,FALSE)=A719,\"Yes\")),\"\",IF(VLOOKUP(A719,Draft!E:E,1,FALSE)=A719,\"Yes\"))","v":""}]
[705,"Bernadina, Roger",{"$f":"IF(ISNA(IF(VLOOKUP(A720,Draft!E:E,1,FALSE)=A720,\"Yes\")),\"\",IF(VLOOKUP(A720,Draft!E:E,1,FALSE)=A720,\"Yes\"))","v":""}]
[706,"Carter(NYN), Chris",{"$f":"IF(ISNA(IF(VLOOKUP(A721,Draft!E:E,1,FALSE)=A721,\"Yes\")),\"\",IF(VLOOKUP(A721,Draft!E:E,1,FALSE)=A721,\"Yes\"))","v":""}]
[707,"Castillo, Wilkin",{"$f":"IF(ISNA(IF(VLOOKUP(A722,Draft!E:E,1,FALSE)=A722,\"Yes\")),\"\",IF(VLOOKUP(A722,Draft!E:E,1,FALSE)=A722,\"Yes\"))","v":""}]
[708,"Hopper, Norris",{"$f":"IF(ISNA(IF(VLOOKUP(A723,Draft!E:E,1,FALSE)=A723,\"Yes\")),\"\",IF(VLOOKUP(A723,Draft!E:E,1,FALSE)=A723,\"Yes\"))","v":""}]
[709,"Mather, Joe",{"$f":"IF(ISNA(IF(VLOOKUP(A724,Draft!E:E,1,FALSE)=A724,\"Yes\")),\"\",IF(VLOOKUP(A724,Draft!E:E,1,FALSE)=A724,\"Yes\"))","v":""}]
[710,"Clevlen, Brent",{"$f":"IF(ISNA(IF(VLOOKUP(A725,Draft!E:E,1,FALSE)=A725,\"Yes\")),\"\",IF(VLOOKUP(A725,Draft!E:E,1,FALSE)=A725,\"Yes\"))","v":""}]
[711,"Miller, Jai",{"$f":"IF(ISNA(IF(VLOOKUP(A726,Draft!E:E,1,FALSE)=A726,\"Yes\")),\"\",IF(VLOOKUP(A726,Draft!E:E,1,FALSE)=A726,\"Yes\"))","v":""}]
[712,"Cain, Lorenzo",{"$f":"IF(ISNA(IF(VLOOKUP(A727,Draft!E:E,1,FALSE)=A727,\"Yes\")),\"\",IF(VLOOKUP(A727,Draft!E:E,1,FALSE)=A727,\"Yes\"))","v":""}]
[713,"Davis, Kentrall",{"$f":"IF(ISNA(IF(VLOOKUP(A728,Draft!E:E,1,FALSE)=A728,\"Yes\")),\"\",IF(VLOOKUP(A728,Draft!E:E,1,FALSE)=A728,\"Yes\"))","v":"Yes"}]
[714,"Walla, Maxwell",{"$f":"IF(ISNA(IF(VLOOKUP(A729,Draft!E:E,1,FALSE)=A729,\"Yes\")),\"\",IF(VLOOKUP(A729,Draft!E:E,1,FALSE)=A729,\"Yes\"))","v":""}]
[715,"Heyward, Jason",{"$f":"IF(ISNA(IF(VLOOKUP(A730,Draft!E:E,1,FALSE)=A730,\"Yes\")),\"\",IF(VLOOKUP(A730,Draft!E:E,1,FALSE)=A730,\"Yes\"))","v":"Yes"}]
[716,"Jones, Mychal",{"$f":"IF(ISNA(IF(VLOOKUP(A731,Draft!E:E,1,FALSE)=A731,\"Yes\")),\"\",IF(VLOOKUP(A731,Draft!E:E,1,FALSE)=A731,\"Yes\"))","v":""}]
[717,"Jackson, Brett",{"$f":"IF(ISNA(IF(VLOOKUP(A732,Draft!E:E,1,FALSE)=A732,\"Yes\")),\"\",IF(VLOOKUP(A732,Draft!E:E,1,FALSE)=A732,\"Yes\"))","v":"Yes"}]
[718,"Rodriguez, Yorman",{"$f":"IF(ISNA(IF(VLOOKUP(A733,Draft!E:E,1,FALSE)=A733,\"Yes\")),\"\",IF(VLOOKUP(A733,Draft!E:E,1,FALSE)=A733,\"Yes\"))","v":""}]
[719,"Heisey, Chris",{"$f":"IF(ISNA(IF(VLOOKUP(A734,Draft!E:E,1,FALSE)=A734,\"Yes\")),\"\",IF(VLOOKUP(A734,Draft!E:E,1,FALSE)=A734,\"Yes\"))","v":"Yes"}]
[720,"Bogusevic, Brian",{"$f":"IF(ISNA(IF(VLOOKUP(A735,Draft!E:E,1,FALSE)=A735,\"Yes\")),\"\",IF(VLOOKUP(A735,Draft!E:E,1,FALSE)=A735,\"Yes\"))","v":""}]
[721,"Lambo, Andrew",{"$f":"IF(ISNA(IF(VLOOKUP(A736,Draft!E:E,1,FALSE)=A736,\"Yes\")),\"\",IF(VLOOKUP(A736,Draft!E:E,1,FALSE)=A736,\"Yes\"))","v":"Yes"}]
[722,"Smith, Blake",{"$f":"IF(ISNA(IF(VLOOKUP(A737,Draft!E:E,1,FALSE)=A737,\"Yes\")),\"\",IF(VLOOKUP(A737,Draft!E:E,1,FALSE)=A737,\"Yes\"))","v":""}]
[723,"Songco, Angelo",{"$f":"IF(ISNA(IF(VLOOKUP(A738,Draft!E:E,1,FALSE)=A738,\"Yes\")),\"\",IF(VLOOKUP(A738,Draft!E:E,1,FALSE)=A738,\"Yes\"))","v":""}]
[724,"Garcia, Jonathan",{"$f":"IF(ISNA(IF(VLOOKUP(A739,Draft!E:E,1,FALSE)=A739,\"Yes\")),\"\",IF(VLOOKUP(A739,Draft!E:E,1,FALSE)=A739,\"Yes\"))","v":"Yes"}]
[725,"Brown, Dominic",{"$f":"IF(ISNA(IF(VLOOKUP(A740,Draft!E:E,1,FALSE)=A740,\"Yes\")),\"\",IF(VLOOKUP(A740,Draft!E:E,1,FALSE)=A740,\"Yes\"))","v":"Yes"}]
[726,"Gose, Anthony",{"$f":"IF(ISNA(IF(VLOOKUP(A741,Draft!E:E,1,FALSE)=A741,\"Yes\")),\"\",IF(VLOOKUP(A741,Draft!E:E,1,FALSE)=A741,\"Yes\"))","v":""}]
[727,"Dugan, Kelly",{"$f":"IF(ISNA(IF(VLOOKUP(A742,Draft!E:E,1,FALSE)=A742,\"Yes\")),\"\",IF(VLOOKUP(A742,Draft!E:E,1,FALSE)=A742,\"Yes\"))","v":""}]
[728,"Hudson, Kyrell",{"$f":"IF(ISNA(IF(VLOOKUP(A743,Draft!E:E,1,FALSE)=A743,\"Yes\")),\"\",IF(VLOOKUP(A743,Draft!E:E,1,FALSE)=A743,\"Yes\"))","v":""}]
[729,"Hernandez, Gorkys",{"$f":"IF(ISNA(IF(VLOOKUP(A744,Draft!E:E,1,FALSE)=A744,\"Yes\")),\"\",IF(VLOOKUP(A744,Draft!E:E,1,FALSE)=A744,\"Yes\"))","v":"Yes"}]
[730,"Tabata, Jose",{"$f":"IF(ISNA(IF(VLOOKUP(A745,Draft!E:E,1,FALSE)=A745,\"Yes\")),\"\",IF(VLOOKUP(A745,Draft!E:E,1,FALSE)=A745,\"Yes\"))","v":"Yes"}]
[731,"Raynor, John",{"$f":"IF(ISNA(IF(VLOOKUP(A746,Draft!E:E,1,FALSE)=A746,\"Yes\")),\"\",IF(VLOOKUP(A746,Draft!E:E,1,FALSE)=A746,\"Yes\"))","v":""}]
[732,"Chambers, Evan",{"$f":"IF(ISNA(IF(VLOOKUP(A747,Draft!E:E,1,FALSE)=A747,\"Yes\")),\"\",IF(VLOOKUP(A747,Draft!E:E,1,FALSE)=A747,\"Yes\"))","v":""}]
[733,"Jay, Jon",{"$f":"IF(ISNA(IF(VLOOKUP(A748,Draft!E:E,1,FALSE)=A748,\"Yes\")),\"\",IF(VLOOKUP(A748,Draft!E:E,1,FALSE)=A748,\"Yes\"))","v":""}]
[734,"Jones, Daryl",{"$f":"IF(ISNA(IF(VLOOKUP(A749,Draft!E:E,1,FALSE)=A749,\"Yes\")),\"\",IF(VLOOKUP(A749,Draft!E:E,1,FALSE)=A749,\"Yes\"))","v":"Yes"}]
[735,"Craig, Allen",{"$f":"IF(ISNA(IF(VLOOKUP(A750,Draft!E:E,1,FALSE)=A750,\"Yes\")),\"\",IF(VLOOKUP(A750,Draft!E:E,1,FALSE)=A750,\"Yes\"))","v":""}]
[736,"Decker, Jaff",{"$f":"IF(ISNA(IF(VLOOKUP(A751,Draft!E:E,1,FALSE)=A751,\"Yes\")),\"\",IF(VLOOKUP(A751,Draft!E:E,1,FALSE)=A751,\"Yes\"))","v":""}]
[737,"Huffman, Chad",{"$f":"IF(ISNA(IF(VLOOKUP(A752,Draft!E:E,1,FALSE)=A752,\"Yes\")),\"\",IF(VLOOKUP(A752,Draft!E:E,1,FALSE)=A752,\"Yes\"))","v":""}]
[738,"Tate, Donavan",{"$f":"IF(ISNA(IF(VLOOKUP(A753,Draft!E:E,1,FALSE)=A753,\"Yes\")),\"\",IF(VLOOKUP(A753,Draft!E:E,1,FALSE)=A753,\"Yes\"))","v":"Yes"}]
[739,"Williams, Everett",{"$f":"IF(ISNA(IF(VLOOKUP(A754,Draft!E:E,1,FALSE)=A754,\"Yes\")),\"\",IF(VLOOKUP(A754,Draft!E:E,1,FALSE)=A754,\"Yes\"))","v":""}]
[740,"Peguero, Francisco",{"$f":"IF(ISNA(IF(VLOOKUP(A755,Draft!E:E,1,FALSE)=A755,\"Yes\")),\"\",IF(VLOOKUP(A755,Draft!E:E,1,FALSE)=A755,\"Yes\"))","v":""}]
[741,"Ford, Darren",{"$f":"IF(ISNA(IF(VLOOKUP(A756,Draft!E:E,1,FALSE)=A756,\"Yes\")),\"\",IF(VLOOKUP(A756,Draft!E:E,1,FALSE)=A756,\"Yes\"))","v":""}]
[742,"Wheeler, Tim",{"$f":"IF(ISNA(IF(VLOOKUP(A757,Draft!E:E,1,FALSE)=A757,\"Yes\")),\"\",IF(VLOOKUP(A757,Draft!E:E,1,FALSE)=A757,\"Yes\"))","v":"Yes"}]
[743,"Stanton(Flo), Michael",{"$f":"IF(ISNA(IF(VLOOKUP(A758,Draft!E:E,1,FALSE)=A758,\"Yes\")),\"\",IF(VLOOKUP(A758,Draft!E:E,1,FALSE)=A758,\"Yes\"))","v":"Yes"}]
[744,"Gillespie, Cole",{"$f":"IF(ISNA(IF(VLOOKUP(A759,Draft!E:E,1,FALSE)=A759,\"Yes\")),\"\",IF(VLOOKUP(A759,Draft!E:E,1,FALSE)=A759,\"Yes\"))","v":""}]
[745,"Pollock, Allen",{"$f":"IF(ISNA(IF(VLOOKUP(A760,Draft!E:E,1,FALSE)=A760,\"Yes\")),\"\",IF(VLOOKUP(A760,Draft!E:E,1,FALSE)=A760,\"Yes\"))","v":""}]
[746,"Krauss, Marc",{"$f":"IF(ISNA(IF(VLOOKUP(A761,Draft!E:E,1,FALSE)=A761,\"Yes\")),\"\",IF(VLOOKUP(A761,Draft!E:E,1,FALSE)=A761,\"Yes\"))","v":""}]
[747,"Broxton, Keon",{"$f":"IF(ISNA(IF(VLOOKUP(A762,Draft!E:E,1,FALSE)=A762,\"Yes\")),\"\",IF(VLOOKUP(A762,Draft!E:E,1,FALSE)=A762,\"Yes\"))","v":""}]
[748,"Padilla, Vicente",{"$f":"IF(ISNA(IF(VLOOKUP(A763,Draft!E:E,1,FALSE)=A763,\"Yes\")),\"\",IF(VLOOKUP(A763,Draft!E:E,1,FALSE)=A763,\"Yes\"))","v":"Yes"}]
[749,"Dotel, Octavio",{"$f":"IF(ISNA(IF(VLOOKUP(A764,Draft!E:E,1,FALSE)=A764,\"Yes\")),\"\",IF(VLOOKUP(A764,Draft!E:E,1,FALSE)=A764,\"Yes\"))","v":"Yes"}]
[750,"Skipworth, Kyle",{"$f":"IF(ISNA(IF(VLOOKUP(A765,Draft!E:E,1,FALSE)=A765,\"Yes\")),\"\",IF(VLOOKUP(A765,Draft!E:E,1,FALSE)=A765,\"Yes\"))","v":""}]
[751,"Sullivan, Cory",{"$f":"IF(ISNA(IF(VLOOKUP(A766,Draft!E:E,1,FALSE)=A766,\"Yes\")),\"\",IF(VLOOKUP(A766,Draft!E:E,1,FALSE)=A766,\"Yes\"))","v":""}]
[752,"Arredondo, Jose",{"$f":"IF(ISNA(IF(VLOOKUP(A767,Draft!E:E,1,FALSE)=A767,\"Yes\")),\"\",IF(VLOOKUP(A767,Draft!E:E,1,FALSE)=A767,\"Yes\"))","v":""}]
[753,"Davis, Doug",{"$f":"IF(ISNA(IF(VLOOKUP(A768,Draft!E:E,1,FALSE)=A768,\"Yes\")),\"\",IF(VLOOKUP(A768,Draft!E:E,1,FALSE)=A768,\"Yes\"))","v":"Yes"}]
[754,"Molina, Bengie",{"$f":"IF(ISNA(IF(VLOOKUP(A769,Draft!E:E,1,FALSE)=A769,\"Yes\")),\"\",IF(VLOOKUP(A769,Draft!E:E,1,FALSE)=A769,\"Yes\"))","v":"Yes"}]
[755,"Stairs, Matt",{"$f":"IF(ISNA(IF(VLOOKUP(A770,Draft!E:E,1,FALSE)=A770,\"Yes\")),\"\",IF(VLOOKUP(A770,Draft!E:E,1,FALSE)=A770,\"Yes\"))","v":""}]
[756,"Rohrbaugh, Cole",{"$f":"IF(ISNA(IF(VLOOKUP(A771,Draft!E:E,1,FALSE)=A771,\"Yes\")),\"\",IF(VLOOKUP(A771,Draft!E:E,1,FALSE)=A771,\"Yes\"))","v":""}]
[757,"Hoover, J.J.",{"$f":"IF(ISNA(IF(VLOOKUP(A772,Draft!E:E,1,FALSE)=A772,\"Yes\")),\"\",IF(VLOOKUP(A772,Draft!E:E,1,FALSE)=A772,\"Yes\"))","v":""}]
[758,"Gaston, Jonathon",{"$f":"IF(ISNA(IF(VLOOKUP(A773,Draft!E:E,1,FALSE)=A773,\"Yes\")),\"\",IF(VLOOKUP(A773,Draft!E:E,1,FALSE)=A773,\"Yes\"))","v":""}]
[759,"Marte, Jefry",{"$f":"IF(ISNA(IF(VLOOKUP(A774,Draft!E:E,1,FALSE)=A774,\"Yes\")),\"\",IF(VLOOKUP(A774,Draft!E:E,1,FALSE)=A774,\"Yes\"))","v":""}]
[760,"Gillies, Tyson",{"$f":"IF(ISNA(IF(VLOOKUP(A775,Draft!E:E,1,FALSE)=A775,\"Yes\")),\"\",IF(VLOOKUP(A775,Draft!E:E,1,FALSE)=A775,\"Yes\"))","v":""}]
[761,"Inman, Will",{"$f":"IF(ISNA(IF(VLOOKUP(A776,Draft!E:E,1,FALSE)=A776,\"Yes\")),\"\",IF(VLOOKUP(A776,Draft!E:E,1,FALSE)=A776,\"Yes\"))","v":""}]
[762,"Cumberland, Andrew",{"$f":"IF(ISNA(IF(VLOOKUP(A777,Draft!E:E,1,FALSE)=A777,\"Yes\")),\"\",IF(VLOOKUP(A777,Draft!E:E,1,FALSE)=A777,\"Yes\"))","v":""}]
[763,"Noonan, Nicholas",{"$f":"IF(ISNA(IF(VLOOKUP(A778,Draft!E:E,1,FALSE)=A778,\"Yes\")),\"\",IF(VLOOKUP(A778,Draft!E:E,1,FALSE)=A778,\"Yes\"))","v":""}]
[764,"Burgess, Michael",{"$f":"IF(ISNA(IF(VLOOKUP(A779,Draft!E:E,1,FALSE)=A779,\"Yes\")),\"\",IF(VLOOKUP(A779,Draft!E:E,1,FALSE)=A779,\"Yes\"))","v":""}]
[765,"Dykstra, Cutter",{"$f":"IF(ISNA(IF(VLOOKUP(A780,Draft!E:E,1,FALSE)=A780,\"Yes\")),\"\",IF(VLOOKUP(A780,Draft!E:E,1,FALSE)=A780,\"Yes\"))","v":""}]
[766,"Belliard, Ronnie",{"$f":"IF(ISNA(IF(VLOOKUP(A781,Draft!E:E,1,FALSE)=A781,\"Yes\")),\"\",IF(VLOOKUP(A781,Draft!E:E,1,FALSE)=A781,\"Yes\"))","v":"Yes"}]
[767,"Ausmus, Brad",{"$f":"IF(ISNA(IF(VLOOKUP(A782,Draft!E:E,1,FALSE)=A782,\"Yes\")),\"\",IF(VLOOKUP(A782,Draft!E:E,1,FALSE)=A782,\"Yes\"))","v":""}]
[768,"Garland, Jon",{"$f":"IF(ISNA(IF(VLOOKUP(A783,Draft!E:E,1,FALSE)=A783,\"Yes\")),\"\",IF(VLOOKUP(A783,Draft!E:E,1,FALSE)=A783,\"Yes\"))","v":"Yes"}]
[769,"Hill, Rich",{"$f":"IF(ISNA(IF(VLOOKUP(A784,Draft!E:E,1,FALSE)=A784,\"Yes\")),\"\",IF(VLOOKUP(A784,Draft!E:E,1,FALSE)=A784,\"Yes\"))","v":""}]
[770,"Tracy, Chad",{"$f":"IF(ISNA(IF(VLOOKUP(A785,Draft!E:E,1,FALSE)=A785,\"Yes\")),\"\",IF(VLOOKUP(A785,Draft!E:E,1,FALSE)=A785,\"Yes\"))","v":""}]
[771,"Redding, Tim",{"$f":"IF(ISNA(IF(VLOOKUP(A786,Draft!E:E,1,FALSE)=A786,\"Yes\")),\"\",IF(VLOOKUP(A786,Draft!E:E,1,FALSE)=A786,\"Yes\"))","v":""}]
[772,"Giambi, Jason",{"$f":"IF(ISNA(IF(VLOOKUP(A787,Draft!E:E,1,FALSE)=A787,\"Yes\")),\"\",IF(VLOOKUP(A787,Draft!E:E,1,FALSE)=A787,\"Yes\"))","v":""}]
[773,"Gobble, Jimmy",{"$f":"IF(ISNA(IF(VLOOKUP(A788,Draft!E:E,1,FALSE)=A788,\"Yes\")),\"\",IF(VLOOKUP(A788,Draft!E:E,1,FALSE)=A788,\"Yes\"))","v":""}]
[774,"Speier, Justin",{"$f":"IF(ISNA(IF(VLOOKUP(A789,Draft!E:E,1,FALSE)=A789,\"Yes\")),\"\",IF(VLOOKUP(A789,Draft!E:E,1,FALSE)=A789,\"Yes\"))","v":""}]
[775,"Edmonds, Jim",{"$f":"IF(ISNA(IF(VLOOKUP(A790,Draft!E:E,1,FALSE)=A790,\"Yes\")),\"\",IF(VLOOKUP(A790,Draft!E:E,1,FALSE)=A790,\"Yes\"))","v":"Yes"}]
[776,"Contreras, Jose",{"$f":"IF(ISNA(IF(VLOOKUP(A791,Draft!E:E,1,FALSE)=A791,\"Yes\")),\"\",IF(VLOOKUP(A791,Draft!E:E,1,FALSE)=A791,\"Yes\"))","v":"Yes"}]
[777,"Walker, Tyler",{"$f":"IF(ISNA(IF(VLOOKUP(A792,Draft!E:E,1,FALSE)=A792,\"Yes\")),\"\",IF(VLOOKUP(A792,Draft!E:E,1,FALSE)=A792,\"Yes\"))","v":""}]
[778,"Cairo, Miguel",{"$f":"IF(ISNA(IF(VLOOKUP(A793,Draft!E:E,1,FALSE)=A793,\"Yes\")),\"\",IF(VLOOKUP(A793,Draft!E:E,1,FALSE)=A793,\"Yes\"))","v":""}]
[779,"Bethancourt, Christian",{"$f":"IF(ISNA(IF(VLOOKUP(A794,Draft!E:E,1,FALSE)=A794,\"Yes\")),\"\",IF(VLOOKUP(A794,Draft!E:E,1,FALSE)=A794,\"Yes\"))","v":""}]
[781,"Smoltz, John",{"$f":"IF(ISNA(IF(VLOOKUP(A795,Draft!E:E,1,FALSE)=A795,\"Yes\")),\"\",IF(VLOOKUP(A795,Draft!E:E,1,FALSE)=A795,\"Yes\"))","v":""}]
[782,"Park, Chan Ho",{"$f":"IF(ISNA(IF(VLOOKUP(A796,Draft!E:E,1,FALSE)=A796,\"Yes\")),\"\",IF(VLOOKUP(A796,Draft!E:E,1,FALSE)=A796,\"Yes\"))","v":""}]
[783,"Tatis, Fernando",{"$f":"IF(ISNA(IF(VLOOKUP(A797,Draft!E:E,1,FALSE)=A797,\"Yes\")),\"\",IF(VLOOKUP(A797,Draft!E:E,1,FALSE)=A797,\"Yes\"))","v":""}]
[784,"Villalona, Angel",{"$f":"IF(ISNA(IF(VLOOKUP(A798,Draft!E:E,1,FALSE)=A798,\"Yes\")),\"\",IF(VLOOKUP(A798,Draft!E:E,1,FALSE)=A798,\"Yes\"))","v":""}]
[785,"Savery, Joseph",{"$f":"IF(ISNA(IF(VLOOKUP(A799,Draft!E:E,1,FALSE)=A799,\"Yes\")),\"\",IF(VLOOKUP(A799,Draft!E:E,1,FALSE)=A799,\"Yes\"))","v":""}]
[786,"Seaton, Ross",{"$f":"IF(ISNA(IF(VLOOKUP(A800,Draft!E:E,1,FALSE)=A800,\"Yes\")),\"\",IF(VLOOKUP(A800,Draft!E:E,1,FALSE)=A800,\"Yes\"))","v":""}]
[787,"Lopez, Felipe",{"$f":"IF(ISNA(IF(VLOOKUP(A801,Draft!E:E,1,FALSE)=A801,\"Yes\")),\"\",IF(VLOOKUP(A801,Draft!E:E,1,FALSE)=A801,\"Yes\"))","v":"Yes"}]
[788,"Johnson, Cody",{"$f":"IF(ISNA(IF(VLOOKUP(A802,Draft!E:E,1,FALSE)=A802,\"Yes\")),\"\",IF(VLOOKUP(A802,Draft!E:E,1,FALSE)=A802,\"Yes\"))","v":""}]
[789,"Worthington, Tyrell",{"$f":"IF(ISNA(IF(VLOOKUP(A803,Draft!E:E,1,FALSE)=A803,\"Yes\")),\"\",IF(VLOOKUP(A803,Draft!E:E,1,FALSE)=A803,\"Yes\"))","v":""}]
[790,"Rodriguez(SF), Rafael",{"$f":"IF(ISNA(IF(VLOOKUP(A804,Draft!E:E,1,FALSE)=A804,\"Yes\")),\"\",IF(VLOOKUP(A804,Draft!E:E,1,FALSE)=A804,\"Yes\"))","v":""}]
[791,"Jeffress, Jeremy",{"$f":"IF(ISNA(IF(VLOOKUP(A805,Draft!E:E,1,FALSE)=A805,\"Yes\")),\"\",IF(VLOOKUP(A805,Draft!E:E,1,FALSE)=A805,\"Yes\"))","v":"Yes"}]
[792,"Moskos, Daniel",{"$f":"IF(ISNA(IF(VLOOKUP(A806,Draft!E:E,1,FALSE)=A806,\"Yes\")),\"\",IF(VLOOKUP(A806,Draft!E:E,1,FALSE)=A806,\"Yes\"))","v":""}]
[793,"Catlanotto, Frank",{"$f":"IF(ISNA(IF(VLOOKUP(A807,Draft!E:E,1,FALSE)=A807,\"Yes\")),\"\",IF(VLOOKUP(A807,Draft!E:E,1,FALSE)=A807,\"Yes\"))","v":""}]
[794,"Nady, Xavier",{"$f":"IF(ISNA(IF(VLOOKUP(A808,Draft!E:E,1,FALSE)=A808,\"Yes\")),\"\",IF(VLOOKUP(A808,Draft!E:E,1,FALSE)=A808,\"Yes\"))","v":"Yes"}]
[795,"Turnbow, Derrick",{"$f":"IF(ISNA(IF(VLOOKUP(A809,Draft!E:E,1,FALSE)=A809,\"Yes\")),\"\",IF(VLOOKUP(A809,Draft!E:E,1,FALSE)=A809,\"Yes\"))","v":""}]
[796,"Richar, Danny",{"$f":"IF(ISNA(IF(VLOOKUP(A810,Draft!E:E,1,FALSE)=A810,\"Yes\")),\"\",IF(VLOOKUP(A810,Draft!E:E,1,FALSE)=A810,\"Yes\"))","v":""}]
[797,"Fogg, Josh",{"$f":"IF(ISNA(IF(VLOOKUP(A811,Draft!E:E,1,FALSE)=A811,\"Yes\")),\"\",IF(VLOOKUP(A811,Draft!E:E,1,FALSE)=A811,\"Yes\"))","v":""}]
[798,"Batista, Miguel",{"$f":"IF(ISNA(IF(VLOOKUP(A812,Draft!E:E,1,FALSE)=A812,\"Yes\")),\"\",IF(VLOOKUP(A812,Draft!E:E,1,FALSE)=A812,\"Yes\"))","v":""}]
[799,"Cabrera, Orlando",{"$f":"IF(ISNA(IF(VLOOKUP(A813,Draft!E:E,1,FALSE)=A813,\"Yes\")),\"\",IF(VLOOKUP(A813,Draft!E:E,1,FALSE)=A813,\"Yes\"))","v":"Yes"}]
[800,"Johnson, Reed",{"$f":"IF(ISNA(IF(VLOOKUP(A814,Draft!E:E,1,FALSE)=A814,\"Yes\")),\"\",IF(VLOOKUP(A814,Draft!E:E,1,FALSE)=A814,\"Yes\"))","v":"Yes"}]
[4001,"Weaver, Jeff",{"$f":"IF(ISNA(IF(VLOOKUP(A815,Draft!E:E,1,FALSE)=A815,\"Yes\")),\"\",IF(VLOOKUP(A815,Draft!E:E,1,FALSE)=A815,\"Yes\"))","v":""}]
[4002,"Mota, Guillermo",{"$f":"IF(ISNA(IF(VLOOKUP(A816,Draft!E:E,1,FALSE)=A816,\"Yes\")),\"\",IF(VLOOKUP(A816,Draft!E:E,1,FALSE)=A816,\"Yes\"))","v":""}]
[4003,"Crawford, Brandon",{"$f":"IF(ISNA(IF(VLOOKUP(A817,Draft!E:E,1,FALSE)=A817,\"Yes\")),\"\",IF(VLOOKUP(A817,Draft!E:E,1,FALSE)=A817,\"Yes\"))","v":""}]
[4004,"Thompson, Daryl",{"$f":"IF(ISNA(IF(VLOOKUP(A818,Draft!E:E,1,FALSE)=A818,\"Yes\")),\"\",IF(VLOOKUP(A818,Draft!E:E,1,FALSE)=A818,\"Yes\"))","v":""}]
[4005,"Hunter, Cedric",{"$f":"IF(ISNA(IF(VLOOKUP(A819,Draft!E:E,1,FALSE)=A819,\"Yes\")),\"\",IF(VLOOKUP(A819,Draft!E:E,1,FALSE)=A819,\"Yes\"))","v":""}]
[4006,"Portillo, Adis",{"$f":"IF(ISNA(IF(VLOOKUP(A820,Draft!E:E,1,FALSE)=A820,\"Yes\")),\"\",IF(VLOOKUP(A820,Draft!E:E,1,FALSE)=A820,\"Yes\"))","v":""}]
[4007,"Green, Taylor",{"$f":"IF(ISNA(IF(VLOOKUP(A821,Draft!E:E,1,FALSE)=A821,\"Yes\")),\"\",IF(VLOOKUP(A821,Draft!E:E,1,FALSE)=A821,\"Yes\"))","v":""}]
[4009,"Diamond, Thomas",{"$f":"IF(ISNA(IF(VLOOKUP(A822,Draft!E:E,1,FALSE)=A822,\"Yes\")),\"\",IF(VLOOKUP(A822,Draft!E:E,1,FALSE)=A822,\"Yes\"))","v":""}]
[4010,"Pawelek, Mark",{"$f":"IF(ISNA(IF(VLOOKUP(A823,Draft!E:E,1,FALSE)=A823,\"Yes\")),\"\",IF(VLOOKUP(A823,Draft!E:E,1,FALSE)=A823,\"Yes\"))","v":""}]
[4011,"Duran, Juan",{"$f":"IF(ISNA(IF(VLOOKUP(A824,Draft!E:E,1,FALSE)=A824,\"Yes\")),\"\",IF(VLOOKUP(A824,Draft!E:E,1,FALSE)=A824,\"Yes\"))","v":""}]
[4013,"Kozma, Peter",{"$f":"IF(ISNA(IF(VLOOKUP(A825,Draft!E:E,1,FALSE)=A825,\"Yes\")),\"\",IF(VLOOKUP(A825,Draft!E:E,1,FALSE)=A825,\"Yes\"))","v":""}]
[4014,"Barney, Darwin",{"$f":"IF(ISNA(IF(VLOOKUP(A826,Draft!E:E,1,FALSE)=A826,\"Yes\")),\"\",IF(VLOOKUP(A826,Draft!E:E,1,FALSE)=A826,\"Yes\"))","v":""}]
[4015,"Einertson, Mitch",{"$f":"IF(ISNA(IF(VLOOKUP(A827,Draft!E:E,1,FALSE)=A827,\"Yes\")),\"\",IF(VLOOKUP(A827,Draft!E:E,1,FALSE)=A827,\"Yes\"))","v":""}]
[4016,"Sampson, Keyvius",{"$f":"IF(ISNA(IF(VLOOKUP(A828,Draft!E:E,1,FALSE)=A828,\"Yes\")),\"\",IF(VLOOKUP(A828,Draft!E:E,1,FALSE)=A828,\"Yes\"))","v":""}]
[4017,"Hood, Destin",{"$f":"IF(ISNA(IF(VLOOKUP(A829,Draft!E:E,1,FALSE)=A829,\"Yes\")),\"\",IF(VLOOKUP(A829,Draft!E:E,1,FALSE)=A829,\"Yes\"))","v":""}]
[4018,"Dykstra, Allan",{"$f":"IF(ISNA(IF(VLOOKUP(A830,Draft!E:E,1,FALSE)=A830,\"Yes\")),\"\",IF(VLOOKUP(A830,Draft!E:E,1,FALSE)=A830,\"Yes\"))","v":""}]
[4019,"Flaherty, Ryan",{"$f":"IF(ISNA(IF(VLOOKUP(A831,Draft!E:E,1,FALSE)=A831,\"Yes\")),\"\",IF(VLOOKUP(A831,Draft!E:E,1,FALSE)=A831,\"Yes\"))","v":""}]
[4020,"Austin, Jay",{"$f":"IF(ISNA(IF(VLOOKUP(A832,Draft!E:E,1,FALSE)=A832,\"Yes\")),\"\",IF(VLOOKUP(A832,Draft!E:E,1,FALSE)=A832,\"Yes\"))","v":""}]
[4021,"Fairley, Wendell",{"$f":"IF(ISNA(IF(VLOOKUP(A833,Draft!E:E,1,FALSE)=A833,\"Yes\")),\"\",IF(VLOOKUP(A833,Draft!E:E,1,FALSE)=A833,\"Yes\"))","v":""}]
[4022,"Braddock, Zachary",{"$f":"IF(ISNA(IF(VLOOKUP(A834,Draft!E:E,1,FALSE)=A834,\"Yes\")),\"\",IF(VLOOKUP(A834,Draft!E:E,1,FALSE)=A834,\"Yes\"))","v":""}]
[4023,"Collier, Zach",{"$f":"IF(ISNA(IF(VLOOKUP(A835,Draft!E:E,1,FALSE)=A835,\"Yes\")),\"\",IF(VLOOKUP(A835,Draft!E:E,1,FALSE)=A835,\"Yes\"))","v":""}]
[4024,"Willems, Colton",{"$f":"IF(ISNA(IF(VLOOKUP(A836,Draft!E:E,1,FALSE)=A836,\"Yes\")),\"\",IF(VLOOKUP(A836,Draft!E:E,1,FALSE)=A836,\"Yes\"))","v":""}]
[4025,"DeVall, Brett",{"$f":"IF(ISNA(IF(VLOOKUP(A837,Draft!E:E,1,FALSE)=A837,\"Yes\")),\"\",IF(VLOOKUP(A837,Draft!E:E,1,FALSE)=A837,\"Yes\"))","v":""}]
[4027,"Delgado, Randall",{"$f":"IF(ISNA(IF(VLOOKUP(A838,Draft!E:E,1,FALSE)=A838,\"Yes\")),\"\",IF(VLOOKUP(A838,Draft!E:E,1,FALSE)=A838,\"Yes\"))","v":""}]
[4028,"Hewitt, Anthony",{"$f":"IF(ISNA(IF(VLOOKUP(A839,Draft!E:E,1,FALSE)=A839,\"Yes\")),\"\",IF(VLOOKUP(A839,Draft!E:E,1,FALSE)=A839,\"Yes\"))","v":""}]
[4030,"Worrell, Mark",{"$f":"IF(ISNA(IF(VLOOKUP(A840,Draft!E:E,1,FALSE)=A840,\"Yes\")),\"\",IF(VLOOKUP(A840,Draft!E:E,1,FALSE)=A840,\"Yes\"))","v":""}]
[4031,"Lamahieu, David",{"$f":"IF(ISNA(IF(VLOOKUP(A841,Draft!E:E,1,FALSE)=A841,\"Yes\")),\"\",IF(VLOOKUP(A841,Draft!E:E,1,FALSE)=A841,\"Yes\"))","v":""}]
[4033,"Belnome, Vincent",{"$f":"IF(ISNA(IF(VLOOKUP(A842,Draft!E:E,1,FALSE)=A842,\"Yes\")),\"\",IF(VLOOKUP(A842,Draft!E:E,1,FALSE)=A842,\"Yes\"))","v":""}]
[4034,"McClung, Seth",{"$f":"IF(ISNA(IF(VLOOKUP(A843,Draft!E:E,1,FALSE)=A843,\"Yes\")),\"\",IF(VLOOKUP(A843,Draft!E:E,1,FALSE)=A843,\"Yes\"))","v":""}]
[4035,"Hernandez, Luis",{"$f":"IF(ISNA(IF(VLOOKUP(A844,Draft!E:E,1,FALSE)=A844,\"Yes\")),\"\",IF(VLOOKUP(A844,Draft!E:E,1,FALSE)=A844,\"Yes\"))","v":""}]
[4036,"Blackley, Travis",{"$f":"IF(ISNA(IF(VLOOKUP(A845,Draft!E:E,1,FALSE)=A845,\"Yes\")),\"\",IF(VLOOKUP(A845,Draft!E:E,1,FALSE)=A845,\"Yes\"))","v":""}]
[4037,"Cabrera, Jolbert",{"$f":"IF(ISNA(IF(VLOOKUP(A846,Draft!E:E,1,FALSE)=A846,\"Yes\")),\"\",IF(VLOOKUP(A846,Draft!E:E,1,FALSE)=A846,\"Yes\"))","v":""}]
[4038,"Muniz, Carlos",{"$f":"IF(ISNA(IF(VLOOKUP(A847,Draft!E:E,1,FALSE)=A847,\"Yes\")),\"\",IF(VLOOKUP(A847,Draft!E:E,1,FALSE)=A847,\"Yes\"))","v":""}]
[4039,"Millar, Kevin",{"$f":"IF(ISNA(IF(VLOOKUP(A848,Draft!E:E,1,FALSE)=A848,\"Yes\")),\"\",IF(VLOOKUP(A848,Draft!E:E,1,FALSE)=A848,\"Yes\"))","v":""}]
[4040,"Carpenter(ChN), Christopher",{"$f":"IF(ISNA(IF(VLOOKUP(A849,Draft!E:E,1,FALSE)=A849,\"Yes\")),\"\",IF(VLOOKUP(A849,Draft!E:E,1,FALSE)=A849,\"Yes\"))","v":""}]
[4041,"Coleman, Casey",{"$f":"IF(ISNA(IF(VLOOKUP(A850,Draft!E:E,1,FALSE)=A850,\"Yes\")),\"\",IF(VLOOKUP(A850,Draft!E:E,1,FALSE)=A850,\"Yes\"))","v":""}]
[4042,"Livingston, Bobby",{"$f":"IF(ISNA(IF(VLOOKUP(A851,Draft!E:E,1,FALSE)=A851,\"Yes\")),\"\",IF(VLOOKUP(A851,Draft!E:E,1,FALSE)=A851,\"Yes\"))","v":""}]
[4043,"Mora, Melvin",{"$f":"IF(ISNA(IF(VLOOKUP(A852,Draft!E:E,1,FALSE)=A852,\"Yes\")),\"\",IF(VLOOKUP(A852,Draft!E:E,1,FALSE)=A852,\"Yes\"))","v":""}]
[4044,"Giles, Brian",{"$f":"IF(ISNA(IF(VLOOKUP(A853,Draft!E:E,1,FALSE)=A853,\"Yes\")),\"\",IF(VLOOKUP(A853,Draft!E:E,1,FALSE)=A853,\"Yes\"))","v":""}]
[4045,"Veras, Jose",{"$f":"IF(ISNA(IF(VLOOKUP(A854,Draft!E:E,1,FALSE)=A854,\"Yes\")),\"\",IF(VLOOKUP(A854,Draft!E:E,1,FALSE)=A854,\"Yes\"))","v":""}]
[4046,"Murphy, Donnie",{"$f":"IF(ISNA(IF(VLOOKUP(A855,Draft!E:E,1,FALSE)=A855,\"Yes\")),\"\",IF(VLOOKUP(A855,Draft!E:E,1,FALSE)=A855,\"Yes\"))","v":""}]
[4047,"Kennedy, Adam",{"$f":"IF(ISNA(IF(VLOOKUP(A856,Draft!E:E,1,FALSE)=A856,\"Yes\")),\"\",IF(VLOOKUP(A856,Draft!E:E,1,FALSE)=A856,\"Yes\"))","v":"Yes"}]
[4048,"MacDougal, Mike",{"$f":"IF(ISNA(IF(VLOOKUP(A857,Draft!E:E,1,FALSE)=A857,\"Yes\")),\"\",IF(VLOOKUP(A857,Draft!E:E,1,FALSE)=A857,\"Yes\"))","v":""}]
[4049,"Looper, Braden",{"$f":"IF(ISNA(IF(VLOOKUP(A858,Draft!E:E,1,FALSE)=A858,\"Yes\")),\"\",IF(VLOOKUP(A858,Draft!E:E,1,FALSE)=A858,\"Yes\"))","v":""}]
[4050,"Hernandez, Livan",{"$f":"IF(ISNA(IF(VLOOKUP(A859,Draft!E:E,1,FALSE)=A859,\"Yes\")),\"\",IF(VLOOKUP(A859,Draft!E:E,1,FALSE)=A859,\"Yes\"))","v":""}]
[4051,"Wellemeyer, Todd",{"$f":"IF(ISNA(IF(VLOOKUP(A860,Draft!E:E,1,FALSE)=A860,\"Yes\")),\"\",IF(VLOOKUP(A860,Draft!E:E,1,FALSE)=A860,\"Yes\"))","v":"Yes"}]
[4052,"Wells, Kip",{"$f":"IF(ISNA(IF(VLOOKUP(A861,Draft!E:E,1,FALSE)=A861,\"Yes\")),\"\",IF(VLOOKUP(A861,Draft!E:E,1,FALSE)=A861,\"Yes\"))","v":""}]
[4053,"Eaton, Adam",{"$f":"IF(ISNA(IF(VLOOKUP(A862,Draft!E:E,1,FALSE)=A862,\"Yes\")),\"\",IF(VLOOKUP(A862,Draft!E:E,1,FALSE)=A862,\"Yes\"))","v":""}]
[4054,"Martinez, Pedro",{"$f":"IF(ISNA(IF(VLOOKUP(A863,Draft!E:E,1,FALSE)=A863,\"Yes\")),\"\",IF(VLOOKUP(A863,Draft!E:E,1,FALSE)=A863,\"Yes\"))","v":""}]
[4055,"Weathers, David",{"$f":"IF(ISNA(IF(VLOOKUP(A864,Draft!E:E,1,FALSE)=A864,\"Yes\")),\"\",IF(VLOOKUP(A864,Draft!E:E,1,FALSE)=A864,\"Yes\"))","v":""}]
[4056,"Calero, Kiko",{"$f":"IF(ISNA(IF(VLOOKUP(A865,Draft!E:E,1,FALSE)=A865,\"Yes\")),\"\",IF(VLOOKUP(A865,Draft!E:E,1,FALSE)=A865,\"Yes\"))","v":"Yes"}]
[4057,"Beimel, Joe",{"$f":"IF(ISNA(IF(VLOOKUP(A866,Draft!E:E,1,FALSE)=A866,\"Yes\")),\"\",IF(VLOOKUP(A866,Draft!E:E,1,FALSE)=A866,\"Yes\"))","v":""}]
[4058,"Miller, Justin",{"$f":"IF(ISNA(IF(VLOOKUP(A867,Draft!E:E,1,FALSE)=A867,\"Yes\")),\"\",IF(VLOOKUP(A867,Draft!E:E,1,FALSE)=A867,\"Yes\"))","v":""}]
[4059,"DiFelice, Mark",{"$f":"IF(ISNA(IF(VLOOKUP(A868,Draft!E:E,1,FALSE)=A868,\"Yes\")),\"\",IF(VLOOKUP(A868,Draft!E:E,1,FALSE)=A868,\"Yes\"))","v":""}]
[4060,"Torrealba, Yorvit",{"$f":"IF(ISNA(IF(VLOOKUP(A869,Draft!E:E,1,FALSE)=A869,\"Yes\")),\"\",IF(VLOOKUP(A869,Draft!E:E,1,FALSE)=A869,\"Yes\"))","v":"Yes"}]
[4061,"Delgado, Carlos",{"$f":"IF(ISNA(IF(VLOOKUP(A870,Draft!E:E,1,FALSE)=A870,\"Yes\")),\"\",IF(VLOOKUP(A870,Draft!E:E,1,FALSE)=A870,\"Yes\"))","v":""}]
[4062,"Burke, Chris",{"$f":"IF(ISNA(IF(VLOOKUP(A871,Draft!E:E,1,FALSE)=A871,\"Yes\")),\"\",IF(VLOOKUP(A871,Draft!E:E,1,FALSE)=A871,\"Yes\"))","v":""}]
[4063,"Amezaga, Alfredo",{"$f":"IF(ISNA(IF(VLOOKUP(A872,Draft!E:E,1,FALSE)=A872,\"Yes\")),\"\",IF(VLOOKUP(A872,Draft!E:E,1,FALSE)=A872,\"Yes\"))","v":""}]
[4064,"Quintanilla, Omar",{"$f":"IF(ISNA(IF(VLOOKUP(A873,Draft!E:E,1,FALSE)=A873,\"Yes\")),\"\",IF(VLOOKUP(A873,Draft!E:E,1,FALSE)=A873,\"Yes\"))","v":""}]
[4065,"Gomes, Jonny",{"$f":"IF(ISNA(IF(VLOOKUP(A874,Draft!E:E,1,FALSE)=A874,\"Yes\")),\"\",IF(VLOOKUP(A874,Draft!E:E,1,FALSE)=A874,\"Yes\"))","v":"Yes"}]
[4066,"Sheffield, Gary",{"$f":"IF(ISNA(IF(VLOOKUP(A875,Draft!E:E,1,FALSE)=A875,\"Yes\")),\"\",IF(VLOOKUP(A875,Draft!E:E,1,FALSE)=A875,\"Yes\"))","v":""}]
[4067,"Duncan, Chris",{"$f":"IF(ISNA(IF(VLOOKUP(A876,Draft!E:E,1,FALSE)=A876,\"Yes\")),\"\",IF(VLOOKUP(A876,Draft!E:E,1,FALSE)=A876,\"Yes\"))","v":""}]
[4068,"Pena, Wily Mo",{"$f":"IF(ISNA(IF(VLOOKUP(A877,Draft!E:E,1,FALSE)=A877,\"Yes\")),\"\",IF(VLOOKUP(A877,Draft!E:E,1,FALSE)=A877,\"Yes\"))","v":""}]
[4069,"Smoker, Joshua",{"$f":"IF(ISNA(IF(VLOOKUP(A878,Draft!E:E,1,FALSE)=A878,\"Yes\")),\"\",IF(VLOOKUP(A878,Draft!E:E,1,FALSE)=A878,\"Yes\"))","v":""}]
[4070,"Herrera, Jonathan",{"$f":"IF(ISNA(IF(VLOOKUP(A879,Draft!E:E,1,FALSE)=A879,\"Yes\")),\"\",IF(VLOOKUP(A879,Draft!E:E,1,FALSE)=A879,\"Yes\"))","v":""}]
[4071,"Kulbacki, Kellen",{"$f":"IF(ISNA(IF(VLOOKUP(A880,Draft!E:E,1,FALSE)=A880,\"Yes\")),\"\",IF(VLOOKUP(A880,Draft!E:E,1,FALSE)=A880,\"Yes\"))","v":""}]
[4072,"Serrano, Mark",{"$f":"IF(ISNA(IF(VLOOKUP(A881,Draft!E:E,1,FALSE)=A881,\"Yes\")),\"\",IF(VLOOKUP(A881,Draft!E:E,1,FALSE)=A881,\"Yes\"))","v":""}]
[4073,"Ka'aihue, Kala",{"$f":"IF(ISNA(IF(VLOOKUP(A882,Draft!E:E,1,FALSE)=A882,\"Yes\")),\"\",IF(VLOOKUP(A882,Draft!E:E,1,FALSE)=A882,\"Yes\"))","v":""}]
[4074,"Mesoraco, Devin",{"$f":"IF(ISNA(IF(VLOOKUP(A883,Draft!E:E,1,FALSE)=A883,\"Yes\")),\"\",IF(VLOOKUP(A883,Draft!E:E,1,FALSE)=A883,\"Yes\"))","v":""}]
[4075,"Peralta, Wily",{"$f":"IF(ISNA(IF(VLOOKUP(A884,Draft!E:E,1,FALSE)=A884,\"Yes\")),\"\",IF(VLOOKUP(A884,Draft!E:E,1,FALSE)=A884,\"Yes\"))","v":""}]
[4076,"Green(Mil), Nick",{"$f":"IF(ISNA(IF(VLOOKUP(A885,Draft!E:E,1,FALSE)=A885,\"Yes\")),\"\",IF(VLOOKUP(A885,Draft!E:E,1,FALSE)=A885,\"Yes\"))","v":""}]
[4077,"Lorin, Brett",{"$f":"IF(ISNA(IF(VLOOKUP(A886,Draft!E:E,1,FALSE)=A886,\"Yes\")),\"\",IF(VLOOKUP(A886,Draft!E:E,1,FALSE)=A886,\"Yes\"))","v":""}]
[4078,"Koshansky, Joe",{"$f":"IF(ISNA(IF(VLOOKUP(A887,Draft!E:E,1,FALSE)=A887,\"Yes\")),\"\",IF(VLOOKUP(A887,Draft!E:E,1,FALSE)=A887,\"Yes\"))","v":""}]
[4079,"Lotzkar, Kyle",{"$f":"IF(ISNA(IF(VLOOKUP(A888,Draft!E:E,1,FALSE)=A888,\"Yes\")),\"\",IF(VLOOKUP(A888,Draft!E:E,1,FALSE)=A888,\"Yes\"))","v":""}]
[4080,"Galvez, Jonathan",{"$f":"IF(ISNA(IF(VLOOKUP(A889,Draft!E:E,1,FALSE)=A889,\"Yes\")),\"\",IF(VLOOKUP(A889,Draft!E:E,1,FALSE)=A889,\"Yes\"))","v":""}]
[4081,"Takahashi, Ken",{"$f":"IF(ISNA(IF(VLOOKUP(A890,Draft!E:E,1,FALSE)=A890,\"Yes\")),\"\",IF(VLOOKUP(A890,Draft!E:E,1,FALSE)=A890,\"Yes\"))","v":""}]
[4082,"Spruill, Zeke",{"$f":"IF(ISNA(IF(VLOOKUP(A891,Draft!E:E,1,FALSE)=A891,\"Yes\")),\"\",IF(VLOOKUP(A891,Draft!E:E,1,FALSE)=A891,\"Yes\"))","v":""}]
[4083,"Cozart, Zachary",{"$f":"IF(ISNA(IF(VLOOKUP(A892,Draft!E:E,1,FALSE)=A892,\"Yes\")),\"\",IF(VLOOKUP(A892,Draft!E:E,1,FALSE)=A892,\"Yes\"))","v":""}]
[4084,"Blackmon, Charlie",{"$f":"IF(ISNA(IF(VLOOKUP(A893,Draft!E:E,1,FALSE)=A893,\"Yes\")),\"\",IF(VLOOKUP(A893,Draft!E:E,1,FALSE)=A893,\"Yes\"))","v":""}]
[4085,"Cleary, Delta",{"$f":"IF(ISNA(IF(VLOOKUP(A894,Draft!E:E,1,FALSE)=A894,\"Yes\")),\"\",IF(VLOOKUP(A894,Draft!E:E,1,FALSE)=A894,\"Yes\"))","v":""}]
[4086,"Rodgers, Chad",{"$f":"IF(ISNA(IF(VLOOKUP(A895,Draft!E:E,1,FALSE)=A895,\"Yes\")),\"\",IF(VLOOKUP(A895,Draft!E:E,1,FALSE)=A895,\"Yes\"))","v":""}]
[4087,"Locke, Jeff",{"$f":"IF(ISNA(IF(VLOOKUP(A896,Draft!E:E,1,FALSE)=A896,\"Yes\")),\"\",IF(VLOOKUP(A896,Draft!E:E,1,FALSE)=A896,\"Yes\"))","v":""}]
[4088,"Odorizzi, Jake",{"$f":"IF(ISNA(IF(VLOOKUP(A897,Draft!E:E,1,FALSE)=A897,\"Yes\")),\"\",IF(VLOOKUP(A897,Draft!E:E,1,FALSE)=A897,\"Yes\"))","v":""}]
[4090,"Miley, Wade",{"$f":"IF(ISNA(IF(VLOOKUP(A898,Draft!E:E,1,FALSE)=A898,\"Yes\")),\"\",IF(VLOOKUP(A898,Draft!E:E,1,FALSE)=A898,\"Yes\"))","v":""}]
[4091,"Torra, Matt",{"$f":"IF(ISNA(IF(VLOOKUP(A899,Draft!E:E,1,FALSE)=A899,\"Yes\")),\"\",IF(VLOOKUP(A899,Draft!E:E,1,FALSE)=A899,\"Yes\"))","v":""}]
[4092,"Navarro, Reynaldo",{"$f":"IF(ISNA(IF(VLOOKUP(A900,Draft!E:E,1,FALSE)=A900,\"Yes\")),\"\",IF(VLOOKUP(A900,Draft!E:E,1,FALSE)=A900,\"Yes\"))","v":""}]
[4093,"Hefner, Jeremy",{"$f":"IF(ISNA(IF(VLOOKUP(A901,Draft!E:E,1,FALSE)=A901,\"Yes\")),\"\",IF(VLOOKUP(A901,Draft!E:E,1,FALSE)=A901,\"Yes\"))","v":""}]
[4095,"Canham, Mitchell",{"$f":"IF(ISNA(IF(VLOOKUP(A902,Draft!E:E,1,FALSE)=A902,\"Yes\")),\"\",IF(VLOOKUP(A902,Draft!E:E,1,FALSE)=A902,\"Yes\"))","v":""}]
[4096,"Yates, Tyler",{"$f":"IF(ISNA(IF(VLOOKUP(A903,Draft!E:E,1,FALSE)=A903,\"Yes\")),\"\",IF(VLOOKUP(A903,Draft!E:E,1,FALSE)=A903,\"Yes\"))","v":""}]
[4097,"Holm, Steve",{"$f":"IF(ISNA(IF(VLOOKUP(A904,Draft!E:E,1,FALSE)=A904,\"Yes\")),\"\",IF(VLOOKUP(A904,Draft!E:E,1,FALSE)=A904,\"Yes\"))","v":""}]
[4098,"Eyre, Scott",{"$f":"IF(ISNA(IF(VLOOKUP(A905,Draft!E:E,1,FALSE)=A905,\"Yes\")),\"\",IF(VLOOKUP(A905,Draft!E:E,1,FALSE)=A905,\"Yes\"))","v":""}]
[4099,"Geer, Joshua",{"$f":"IF(ISNA(IF(VLOOKUP(A906,Draft!E:E,1,FALSE)=A906,\"Yes\")),\"\",IF(VLOOKUP(A906,Draft!E:E,1,FALSE)=A906,\"Yes\"))","v":""}]
[4100,"Owens, Rudy",{"$f":"IF(ISNA(IF(VLOOKUP(A907,Draft!E:E,1,FALSE)=A907,\"Yes\")),\"\",IF(VLOOKUP(A907,Draft!E:E,1,FALSE)=A907,\"Yes\"))","v":""}]
[4101,"Cody, Chris",{"$f":"IF(ISNA(IF(VLOOKUP(A908,Draft!E:E,1,FALSE)=A908,\"Yes\")),\"\",IF(VLOOKUP(A908,Draft!E:E,1,FALSE)=A908,\"Yes\"))","v":""}]
[4103,"Correa, Heitor",{"$f":"IF(ISNA(IF(VLOOKUP(A909,Draft!E:E,1,FALSE)=A909,\"Yes\")),\"\",IF(VLOOKUP(A909,Draft!E:E,1,FALSE)=A909,\"Yes\"))","v":""}]
[4104,"Sanchez, Eduardo",{"$f":"IF(ISNA(IF(VLOOKUP(A910,Draft!E:E,1,FALSE)=A910,\"Yes\")),\"\",IF(VLOOKUP(A910,Draft!E:E,1,FALSE)=A910,\"Yes\"))","v":""}]
[4105,"Skelton, James",{"$f":"IF(ISNA(IF(VLOOKUP(A911,Draft!E:E,1,FALSE)=A911,\"Yes\")),\"\",IF(VLOOKUP(A911,Draft!E:E,1,FALSE)=A911,\"Yes\"))","v":""}]
[4106,"Gee, Dillon",{"$f":"IF(ISNA(IF(VLOOKUP(A912,Draft!E:E,1,FALSE)=A912,\"Yes\")),\"\",IF(VLOOKUP(A912,Draft!E:E,1,FALSE)=A912,\"Yes\"))","v":""}]
[4107,"Clemens, Koby",{"$f":"IF(ISNA(IF(VLOOKUP(A913,Draft!E:E,1,FALSE)=A913,\"Yes\")),\"\",IF(VLOOKUP(A913,Draft!E:E,1,FALSE)=A913,\"Yes\"))","v":""}]
[4108,"Matos, Osiris",{"$f":"IF(ISNA(IF(VLOOKUP(A914,Draft!E:E,1,FALSE)=A914,\"Yes\")),\"\",IF(VLOOKUP(A914,Draft!E:E,1,FALSE)=A914,\"Yes\"))","v":""}]
[4109,"Weathers, Casey",{"$f":"IF(ISNA(IF(VLOOKUP(A915,Draft!E:E,1,FALSE)=A915,\"Yes\")),\"\",IF(VLOOKUP(A915,Draft!E:E,1,FALSE)=A915,\"Yes\"))","v":""}]
[4110,"Friday, Brian",{"$f":"IF(ISNA(IF(VLOOKUP(A916,Draft!E:E,1,FALSE)=A916,\"Yes\")),\"\",IF(VLOOKUP(A916,Draft!E:E,1,FALSE)=A916,\"Yes\"))","v":""}]
[4111,"Martinez, Carlos",{"$f":"IF(ISNA(IF(VLOOKUP(A917,Draft!E:E,1,FALSE)=A917,\"Yes\")),\"\",IF(VLOOKUP(A917,Draft!E:E,1,FALSE)=A917,\"Yes\"))","v":""}]
[4112,"Lowry, Noah",{"$f":"IF(ISNA(IF(VLOOKUP(A918,Draft!E:E,1,FALSE)=A918,\"Yes\")),\"\",IF(VLOOKUP(A918,Draft!E:E,1,FALSE)=A918,\"Yes\"))","v":""}]
[4113,"Schoeneweis, Scott",{"$f":"IF(ISNA(IF(VLOOKUP(A919,Draft!E:E,1,FALSE)=A919,\"Yes\")),\"\",IF(VLOOKUP(A919,Draft!E:E,1,FALSE)=A919,\"Yes\"))","v":""}]
[4114,"Kieschnick, Roger",{"$f":"IF(ISNA(IF(VLOOKUP(A920,Draft!E:E,1,FALSE)=A920,\"Yes\")),\"\",IF(VLOOKUP(A920,Draft!E:E,1,FALSE)=A920,\"Yes\"))","v":""}]
[4115,"Clark, Craig",{"$f":"IF(ISNA(IF(VLOOKUP(A921,Draft!E:E,1,FALSE)=A921,\"Yes\")),\"\",IF(VLOOKUP(A921,Draft!E:E,1,FALSE)=A921,\"Yes\"))","v":""}]
[4116,"Edlefsen, Steve",{"$f":"IF(ISNA(IF(VLOOKUP(A922,Draft!E:E,1,FALSE)=A922,\"Yes\")),\"\",IF(VLOOKUP(A922,Draft!E:E,1,FALSE)=A922,\"Yes\"))","v":""}]
[4117,"Hand, Brad",{"$f":"IF(ISNA(IF(VLOOKUP(A923,Draft!E:E,1,FALSE)=A923,\"Yes\")),\"\",IF(VLOOKUP(A923,Draft!E:E,1,FALSE)=A923,\"Yes\"))","v":""}]
[4118,"Lumsden, Tyler",{"$f":"IF(ISNA(IF(VLOOKUP(A924,Draft!E:E,1,FALSE)=A924,\"Yes\")),\"\",IF(VLOOKUP(A924,Draft!E:E,1,FALSE)=A924,\"Yes\"))","v":""}]
[4120,"Thomas, Tony",{"$f":"IF(ISNA(IF(VLOOKUP(A925,Draft!E:E,1,FALSE)=A925,\"Yes\")),\"\",IF(VLOOKUP(A925,Draft!E:E,1,FALSE)=A925,\"Yes\"))","v":""}]
[4121,"Stockman, Phil",{"$f":"IF(ISNA(IF(VLOOKUP(A926,Draft!E:E,1,FALSE)=A926,\"Yes\")),\"\",IF(VLOOKUP(A926,Draft!E:E,1,FALSE)=A926,\"Yes\"))","v":""}]
[4122,"Vineyard, Nathan",{"$f":"IF(ISNA(IF(VLOOKUP(A927,Draft!E:E,1,FALSE)=A927,\"Yes\")),\"\",IF(VLOOKUP(A927,Draft!E:E,1,FALSE)=A927,\"Yes\"))","v":""}]
[4123,"Mattingly, Preston",{"$f":"IF(ISNA(IF(VLOOKUP(A928,Draft!E:E,1,FALSE)=A928,\"Yes\")),\"\",IF(VLOOKUP(A928,Draft!E:E,1,FALSE)=A928,\"Yes\"))","v":""}]
[4124,"Schmidt, Nicholas",{"$f":"IF(ISNA(IF(VLOOKUP(A929,Draft!E:E,1,FALSE)=A929,\"Yes\")),\"\",IF(VLOOKUP(A929,Draft!E:E,1,FALSE)=A929,\"Yes\"))","v":""}]
[4125,"Soto, Neftali",{"$f":"IF(ISNA(IF(VLOOKUP(A930,Draft!E:E,1,FALSE)=A930,\"Yes\")),\"\",IF(VLOOKUP(A930,Draft!E:E,1,FALSE)=A930,\"Yes\"))","v":""}]
[4126,"Grossman, Robbie",{"$f":"IF(ISNA(IF(VLOOKUP(A931,Draft!E:E,1,FALSE)=A931,\"Yes\")),\"\",IF(VLOOKUP(A931,Draft!E:E,1,FALSE)=A931,\"Yes\"))","v":""}]
[4127,"Anundsen, Evan",{"$f":"IF(ISNA(IF(VLOOKUP(A932,Draft!E:E,1,FALSE)=A932,\"Yes\")),\"\",IF(VLOOKUP(A932,Draft!E:E,1,FALSE)=A932,\"Yes\"))","v":""}]
[4128,"Dean, P.J.",{"$f":"IF(ISNA(IF(VLOOKUP(A933,Draft!E:E,1,FALSE)=A933,\"Yes\")),\"\",IF(VLOOKUP(A933,Draft!E:E,1,FALSE)=A933,\"Yes\"))","v":""}]
[4129,"Castillo, Jesus",{"$f":"IF(ISNA(IF(VLOOKUP(A934,Draft!E:E,1,FALSE)=A934,\"Yes\")),\"\",IF(VLOOKUP(A934,Draft!E:E,1,FALSE)=A934,\"Yes\"))","v":""}]
[4130,"Marinez, Jhan",{"$f":"IF(ISNA(IF(VLOOKUP(A935,Draft!E:E,1,FALSE)=A935,\"Yes\")),\"\",IF(VLOOKUP(A935,Draft!E:E,1,FALSE)=A935,\"Yes\"))","v":""}]
[4131,"Lane, Jason",{"$f":"IF(ISNA(IF(VLOOKUP(A936,Draft!E:E,1,FALSE)=A936,\"Yes\")),\"\",IF(VLOOKUP(A936,Draft!E:E,1,FALSE)=A936,\"Yes\"))","v":""}]
[4132,"Casilla, Santiago",{"$f":"IF(ISNA(IF(VLOOKUP(A937,Draft!E:E,1,FALSE)=A937,\"Yes\")),\"\",IF(VLOOKUP(A937,Draft!E:E,1,FALSE)=A937,\"Yes\"))","v":""}]
[4133,"Burns, Mike",{"$f":"IF(ISNA(IF(VLOOKUP(A938,Draft!E:E,1,FALSE)=A938,\"Yes\")),\"\",IF(VLOOKUP(A938,Draft!E:E,1,FALSE)=A938,\"Yes\"))","v":""}]
[4134,"Reineke, Chad",{"$f":"IF(ISNA(IF(VLOOKUP(A939,Draft!E:E,1,FALSE)=A939,\"Yes\")),\"\",IF(VLOOKUP(A939,Draft!E:E,1,FALSE)=A939,\"Yes\"))","v":""}]
[4135,"Deduno, Sam",{"$f":"IF(ISNA(IF(VLOOKUP(A940,Draft!E:E,1,FALSE)=A940,\"Yes\")),\"\",IF(VLOOKUP(A940,Draft!E:E,1,FALSE)=A940,\"Yes\"))","v":""}]
[4136,"Ozuna, Marcell",{"$f":"IF(ISNA(IF(VLOOKUP(A941,Draft!E:E,1,FALSE)=A941,\"Yes\")),\"\",IF(VLOOKUP(A941,Draft!E:E,1,FALSE)=A941,\"Yes\"))","v":""}]
[4137,"Villone, Ron",{"$f":"IF(ISNA(IF(VLOOKUP(A942,Draft!E:E,1,FALSE)=A942,\"Yes\")),\"\",IF(VLOOKUP(A942,Draft!E:E,1,FALSE)=A942,\"Yes\"))","v":""}]
[4138,"Gagne, Eric",{"$f":"IF(ISNA(IF(VLOOKUP(A943,Draft!E:E,1,FALSE)=A943,\"Yes\")),\"\",IF(VLOOKUP(A943,Draft!E:E,1,FALSE)=A943,\"Yes\"))","v":""}]
[4139,"Estes, Shawn",{"$f":"IF(ISNA(IF(VLOOKUP(A944,Draft!E:E,1,FALSE)=A944,\"Yes\")),\"\",IF(VLOOKUP(A944,Draft!E:E,1,FALSE)=A944,\"Yes\"))","v":""}]
[4140,"Takahashi, Hisanori",{"$f":"IF(ISNA(IF(VLOOKUP(A945,Draft!E:E,1,FALSE)=A945,\"Yes\")),\"\",IF(VLOOKUP(A945,Draft!E:E,1,FALSE)=A945,\"Yes\"))","v":""}]
[4141,"Barton, Brian",{"$f":"IF(ISNA(IF(VLOOKUP(A946,Draft!E:E,1,FALSE)=A946,\"Yes\")),\"\",IF(VLOOKUP(A946,Draft!E:E,1,FALSE)=A946,\"Yes\"))","v":""}]
[4142,"Pelzer, Wynn",{"$f":"IF(ISNA(IF(VLOOKUP(A947,Draft!E:E,1,FALSE)=A947,\"Yes\")),\"\",IF(VLOOKUP(A947,Draft!E:E,1,FALSE)=A947,\"Yes\"))","v":""}]
[4143,"Rincon, Edinson",{"$f":"IF(ISNA(IF(VLOOKUP(A948,Draft!E:E,1,FALSE)=A948,\"Yes\")),\"\",IF(VLOOKUP(A948,Draft!E:E,1,FALSE)=A948,\"Yes\"))","v":""}]
[4144,"Valle, Sebastien",{"$f":"IF(ISNA(IF(VLOOKUP(A949,Draft!E:E,1,FALSE)=A949,\"Yes\")),\"\",IF(VLOOKUP(A949,Draft!E:E,1,FALSE)=A949,\"Yes\"))","v":""}]
[4145,"Hamilton, Mark",{"$f":"IF(ISNA(IF(VLOOKUP(A950,Draft!E:E,1,FALSE)=A950,\"Yes\")),\"\",IF(VLOOKUP(A950,Draft!E:E,1,FALSE)=A950,\"Yes\"))","v":""}]
[4146,"Petersen, Bryan",{"$f":"IF(ISNA(IF(VLOOKUP(A951,Draft!E:E,1,FALSE)=A951,\"Yes\")),\"\",IF(VLOOKUP(A951,Draft!E:E,1,FALSE)=A951,\"Yes\"))","v":""}]
[4147,"Russell, Kyle",{"$f":"IF(ISNA(IF(VLOOKUP(A952,Draft!E:E,1,FALSE)=A952,\"Yes\")),\"\",IF(VLOOKUP(A952,Draft!E:E,1,FALSE)=A952,\"Yes\"))","v":""}]
[4148,"Gindl, Caleb",{"$f":"IF(ISNA(IF(VLOOKUP(A953,Draft!E:E,1,FALSE)=A953,\"Yes\")),\"\",IF(VLOOKUP(A953,Draft!E:E,1,FALSE)=A953,\"Yes\"))","v":""}]
[4149,"Holcomb, Darin",{"$f":"IF(ISNA(IF(VLOOKUP(A954,Draft!E:E,1,FALSE)=A954,\"Yes\")),\"\",IF(VLOOKUP(A954,Draft!E:E,1,FALSE)=A954,\"Yes\"))","v":""}]
[4150,"Salcedo, Edward",{"$f":"IF(ISNA(IF(VLOOKUP(A955,Draft!E:E,1,FALSE)=A955,\"Yes\")),\"\",IF(VLOOKUP(A955,Draft!E:E,1,FALSE)=A955,\"Yes\"))","v":""}]
[4152,"Descalso, Daniel",{"$f":"IF(ISNA(IF(VLOOKUP(A956,Draft!E:E,1,FALSE)=A956,\"Yes\")),\"\",IF(VLOOKUP(A956,Draft!E:E,1,FALSE)=A956,\"Yes\"))","v":""}]
[4153,"Santana, Domingo",{"$f":"IF(ISNA(IF(VLOOKUP(A957,Draft!E:E,1,FALSE)=A957,\"Yes\")),\"\",IF(VLOOKUP(A957,Draft!E:E,1,FALSE)=A957,\"Yes\"))","v":"Yes"}]
[4154,"Martin, Rafael",{"$f":"IF(ISNA(IF(VLOOKUP(A958,Draft!E:E,1,FALSE)=A958,\"Yes\")),\"\",IF(VLOOKUP(A958,Draft!E:E,1,FALSE)=A958,\"Yes\"))","v":""}]
[4155,"Urbina, Juan",{"$f":"IF(ISNA(IF(VLOOKUP(A959,Draft!E:E,1,FALSE)=A959,\"Yes\")),\"\",IF(VLOOKUP(A959,Draft!E:E,1,FALSE)=A959,\"Yes\"))","v":""}]
[4156,"DelRosario, Enerio",{"$f":"IF(ISNA(IF(VLOOKUP(A960,Draft!E:E,1,FALSE)=A960,\"Yes\")),\"\",IF(VLOOKUP(A960,Draft!E:E,1,FALSE)=A960,\"Yes\"))","v":""}]
[4157,"Pill, Brett",{"$f":"IF(ISNA(IF(VLOOKUP(A961,Draft!E:E,1,FALSE)=A961,\"Yes\")),\"\",IF(VLOOKUP(A961,Draft!E:E,1,FALSE)=A961,\"Yes\"))","v":""}]
[4158,"Alvarez, Jose",{"$f":"IF(ISNA(IF(VLOOKUP(A962,Draft!E:E,1,FALSE)=A962,\"Yes\")),\"\",IF(VLOOKUP(A962,Draft!E:E,1,FALSE)=A962,\"Yes\"))","v":""}]
[4159,"Spencer, Matt",{"$f":"IF(ISNA(IF(VLOOKUP(A963,Draft!E:E,1,FALSE)=A963,\"Yes\")),\"\",IF(VLOOKUP(A963,Draft!E:E,1,FALSE)=A963,\"Yes\"))","v":""}]
[4160,"Morla, Ronny",{"$f":"IF(ISNA(IF(VLOOKUP(A964,Draft!E:E,1,FALSE)=A964,\"Yes\")),\"\",IF(VLOOKUP(A964,Draft!E:E,1,FALSE)=A964,\"Yes\"))","v":""}]
[4161,"Anderson, Garret",{"$f":"IF(ISNA(IF(VLOOKUP(A965,Draft!E:E,1,FALSE)=A965,\"Yes\")),\"\",IF(VLOOKUP(A965,Draft!E:E,1,FALSE)=A965,\"Yes\"))","v":""}]
[4162,"Morse, Mike",{"$f":"IF(ISNA(IF(VLOOKUP(A966,Draft!E:E,1,FALSE)=A966,\"Yes\")),\"\",IF(VLOOKUP(A966,Draft!E:E,1,FALSE)=A966,\"Yes\"))","v":""}]
[4163,"Aguero, Ramon",{"$f":"IF(ISNA(IF(VLOOKUP(A967,Draft!E:E,1,FALSE)=A967,\"Yes\")),\"\",IF(VLOOKUP(A967,Draft!E:E,1,FALSE)=A967,\"Yes\"))","v":""}]
[4164,"Nieuwenhuis, Kirk",{"$f":"IF(ISNA(IF(VLOOKUP(A968,Draft!E:E,1,FALSE)=A968,\"Yes\")),\"\",IF(VLOOKUP(A968,Draft!E:E,1,FALSE)=A968,\"Yes\"))","v":""}]
[4165,"Kelly, Joe",{"$f":"IF(ISNA(IF(VLOOKUP(A969,Draft!E:E,1,FALSE)=A969,\"Yes\")),\"\",IF(VLOOKUP(A969,Draft!E:E,1,FALSE)=A969,\"Yes\"))","v":""}]
[4166,"Samuel, Francisco",{"$f":"IF(ISNA(IF(VLOOKUP(A970,Draft!E:E,1,FALSE)=A970,\"Yes\")),\"\",IF(VLOOKUP(A970,Draft!E:E,1,FALSE)=A970,\"Yes\"))","v":""}]
[4167,"Bittle, Scott",{"$f":"IF(ISNA(IF(VLOOKUP(A971,Draft!E:E,1,FALSE)=A971,\"Yes\")),\"\",IF(VLOOKUP(A971,Draft!E:E,1,FALSE)=A971,\"Yes\"))","v":""}]
[4168,"Norrick, Tyler",{"$f":"IF(ISNA(IF(VLOOKUP(A972,Draft!E:E,1,FALSE)=A972,\"Yes\")),\"\",IF(VLOOKUP(A972,Draft!E:E,1,FALSE)=A972,\"Yes\"))","v":""}]
[4169,"King, Blake",{"$f":"IF(ISNA(IF(VLOOKUP(A973,Draft!E:E,1,FALSE)=A973,\"Yes\")),\"\",IF(VLOOKUP(A973,Draft!E:E,1,FALSE)=A973,\"Yes\"))","v":""}]
[4170,"Reifer, Adam",{"$f":"IF(ISNA(IF(VLOOKUP(A974,Draft!E:E,1,FALSE)=A974,\"Yes\")),\"\",IF(VLOOKUP(A974,Draft!E:E,1,FALSE)=A974,\"Yes\"))","v":""}]
[4171,"Rivas, Amauary",{"$f":"IF(ISNA(IF(VLOOKUP(A975,Draft!E:E,1,FALSE)=A975,\"Yes\")),\"\",IF(VLOOKUP(A975,Draft!E:E,1,FALSE)=A975,\"Yes\"))","v":""}]
[4172,"Monasterios, Carlos",{"$f":"IF(ISNA(IF(VLOOKUP(A976,Draft!E:E,1,FALSE)=A976,\"Yes\")),\"\",IF(VLOOKUP(A976,Draft!E:E,1,FALSE)=A976,\"Yes\"))","v":""}]
[4173,"Smolinski, Jacob",{"$f":"IF(ISNA(IF(VLOOKUP(A977,Draft!E:E,1,FALSE)=A977,\"Yes\")),\"\",IF(VLOOKUP(A977,Draft!E:E,1,FALSE)=A977,\"Yes\"))","v":""}]
[4174,"Garner, Cole",{"$f":"IF(ISNA(IF(VLOOKUP(A978,Draft!E:E,1,FALSE)=A978,\"Yes\")),\"\",IF(VLOOKUP(A978,Draft!E:E,1,FALSE)=A978,\"Yes\"))","v":""}]
[4175,"Ortiz, Russ",{"$f":"IF(ISNA(IF(VLOOKUP(A979,Draft!E:E,1,FALSE)=A979,\"Yes\")),\"\",IF(VLOOKUP(A979,Draft!E:E,1,FALSE)=A979,\"Yes\"))","v":""}]
[4176,"Marte, Starling",{"$f":"IF(ISNA(IF(VLOOKUP(A980,Draft!E:E,1,FALSE)=A980,\"Yes\")),\"\",IF(VLOOKUP(A980,Draft!E:E,1,FALSE)=A980,\"Yes\"))","v":""}]
[4177,"Milligan, Adam",{"$f":"IF(ISNA(IF(VLOOKUP(A981,Draft!E:E,1,FALSE)=A981,\"Yes\")),\"\",IF(VLOOKUP(A981,Draft!E:E,1,FALSE)=A981,\"Yes\"))","v":""}]
[4178,"Ortiz, Ramon",{"$f":"IF(ISNA(IF(VLOOKUP(A982,Draft!E:E,1,FALSE)=A982,\"Yes\")),\"\",IF(VLOOKUP(A982,Draft!E:E,1,FALSE)=A982,\"Yes\"))","v":""}]
[4179,"Cousins, Scott",{"$f":"IF(ISNA(IF(VLOOKUP(A983,Draft!E:E,1,FALSE)=A983,\"Yes\")),\"\",IF(VLOOKUP(A983,Draft!E:E,1,FALSE)=A983,\"Yes\"))","v":""}]
[4180,"Link, Jon",{"$f":"IF(ISNA(IF(VLOOKUP(A984,Draft!E:E,1,FALSE)=A984,\"Yes\")),\"\",IF(VLOOKUP(A984,Draft!E:E,1,FALSE)=A984,\"Yes\"))","v":""}]
[4181,"Lopez, Rod",{"$f":"IF(ISNA(IF(VLOOKUP(A985,Draft!E:E,1,FALSE)=A985,\"Yes\")),\"\",IF(VLOOKUP(A985,Draft!E:E,1,FALSE)=A985,\"Yes\"))","v":"Yes"}]
[4182,", ",{"$f":"IF(ISNA(IF(VLOOKUP(A986,Draft!E:E,1,FALSE)=A986,\"Yes\")),\"\",IF(VLOOKUP(A986,Draft!E:E,1,FALSE)=A986,\"Yes\"))","v":""}]
[4183,", ",{"$f":"IF(ISNA(IF(VLOOKUP(A987,Draft!E:E,1,FALSE)=A987,\"Yes\")),\"\",IF(VLOOKUP(A987,Draft!E:E,1,FALSE)=A987,\"Yes\"))","v":""}]
[4184,", ",{"$f":"IF(ISNA(IF(VLOOKUP(A988,Draft!E:E,1,FALSE)=A988,\"Yes\")),\"\",IF(VLOOKUP(A988,Draft!E:E,1,FALSE)=A988,\"Yes\"))","v":""}]
[4185,", ",{"$f":"IF(ISNA(IF(VLOOKUP(A989,Draft!E:E,1,FALSE)=A989,\"Yes\")),\"\",IF(VLOOKUP(A989,Draft!E:E,1,FALSE)=A989,\"Yes\"))","v":""}]
[4186,", ",{"$f":"IF(ISNA(IF(VLOOKUP(A990,Draft!E:E,1,FALSE)=A990,\"Yes\")),\"\",IF(VLOOKUP(A990,Draft!E:E,1,FALSE)=A990,\"Yes\"))","v":""}]
[4187,", ",{"$f":"IF(ISNA(IF(VLOOKUP(A991,Draft!E:E,1,FALSE)=A991,\"Yes\")),\"\",IF(VLOOKUP(A991,Draft!E:E,1,FALSE)=A991,\"Yes\"))","v":""}]
[4188,", ",{"$f":"IF(ISNA(IF(VLOOKUP(A992,Draft!E:E,1,FALSE)=A992,\"Yes\")),\"\",IF(VLOOKUP(A992,Draft!E:E,1,FALSE)=A992,\"Yes\"))","v":""}]
[4189,", ",{"$f":"IF(ISNA(IF(VLOOKUP(A993,Draft!E:E,1,FALSE)=A993,\"Yes\")),\"\",IF(VLOOKUP(A993,Draft!E:E,1,FALSE)=A993,\"Yes\"))","v":""}]
[4190,", ",{"$f":"IF(ISNA(IF(VLOOKUP(A994,Draft!E:E,1,FALSE)=A994,\"Yes\")),\"\",IF(VLOOKUP(A994,Draft!E:E,1,FALSE)=A994,\"Yes\"))","v":""}]
[4191,", ",{"$f":"IF(ISNA(IF(VLOOKUP(A995,Draft!E:E,1,FALSE)=A995,\"Yes\")),\"\",IF(VLOOKUP(A995,Draft!E:E,1,FALSE)=A995,\"Yes\"))","v":""}]
[4192,", ",{"$f":"IF(ISNA(IF(VLOOKUP(A996,Draft!E:E,1,FALSE)=A996,\"Yes\")),\"\",IF(VLOOKUP(A996,Draft!E:E,1,FALSE)=A996,\"Yes\"))","v":""}]
[4193,", ",{"$f":"IF(ISNA(IF(VLOOKUP(A997,Draft!E:E,1,FALSE)=A997,\"Yes\")),\"\",IF(VLOOKUP(A997,Draft!E:E,1,FALSE)=A997,\"Yes\"))","v":""}]
[4194,", ",{"$f":"IF(ISNA(IF(VLOOKUP(A998,Draft!E:E,1,FALSE)=A998,\"Yes\")),\"\",IF(VLOOKUP(A998,Draft!E:E,1,FALSE)=A998,\"Yes\"))","v":""}]
[4195,", ",{"$f":"IF(ISNA(IF(VLOOKUP(A999,Draft!E:E,1,FALSE)=A999,\"Yes\")),\"\",IF(VLOOKUP(A999,Draft!E:E,1,FALSE)=A999,\"Yes\"))","v":""}]
[4196,", ",{"$f":"IF(ISNA(IF(VLOOKUP(A1000,Draft!E:E,1,FALSE)=A1000,\"Yes\")),\"\",IF(VLOOKUP(A1000,Draft!E:E,1,FALSE)=A1000,\"Yes\"))","v":""}]
[4197,", ",{"$f":"IF(ISNA(IF(VLOOKUP(A1001,Draft!E:E,1,FALSE)=A1001,\"Yes\")),\"\",IF(VLOOKUP(A1001,Draft!E:E,1,FALSE)=A1001,\"Yes\"))","v":""}]
[4198,", ",{"$f":"IF(ISNA(IF(VLOOKUP(A1002,Draft!E:E,1,FALSE)=A1002,\"Yes\")),\"\",IF(VLOOKUP(A1002,Draft!E:E,1,FALSE)=A1002,\"Yes\"))","v":""}]
[4199,", ",{"$f":"IF(ISNA(IF(VLOOKUP(A1003,Draft!E:E,1,FALSE)=A1003,\"Yes\")),\"\",IF(VLOOKUP(A1003,Draft!E:E,1,FALSE)=A1003,\"Yes\"))","v":""}]
[4200,", ",{"$f":"IF(ISNA(IF(VLOOKUP(A1004,Draft!E:E,1,FALSE)=A1004,\"Yes\")),\"\",IF(VLOOKUP(A1004,Draft!E:E,1,FALSE)=A1004,\"Yes\"))","v":""}]
[4201,", ",{"$f":"IF(ISNA(IF(VLOOKUP(A1005,Draft!E:E,1,FALSE)=A1005,\"Yes\")),\"\",IF(VLOOKUP(A1005,Draft!E:E,1,FALSE)=A1005,\"Yes\"))","v":""}]
[1001,"Verlander, Justin",{"$f":"IF(ISNA(IF(VLOOKUP(A1006,Draft!E:E,1,FALSE)=A1006,\"Yes\")),\"\",IF(VLOOKUP(A1006,Draft!E:E,1,FALSE)=A1006,\"Yes\"))","v":""}]
[1002,"Hernandez, Felix",{"$f":"IF(ISNA(IF(VLOOKUP(A1007,Draft!E:E,1,FALSE)=A1007,\"Yes\")),\"\",IF(VLOOKUP(A1007,Draft!E:E,1,FALSE)=A1007,\"Yes\"))","v":""}]
[1003,"Lee, Cliff",{"$f":"IF(ISNA(IF(VLOOKUP(A1008,Draft!E:E,1,FALSE)=A1008,\"Yes\")),\"\",IF(VLOOKUP(A1008,Draft!E:E,1,FALSE)=A1008,\"Yes\"))","v":"Yes"}]
[1004,"Sabathia, C.C.",{"$f":"IF(ISNA(IF(VLOOKUP(A1009,Draft!E:E,1,FALSE)=A1009,\"Yes\")),\"\",IF(VLOOKUP(A1009,Draft!E:E,1,FALSE)=A1009,\"Yes\"))","v":"Yes"}]
[1005,"Greinke, Zack",{"$f":"IF(ISNA(IF(VLOOKUP(A1010,Draft!E:E,1,FALSE)=A1010,\"Yes\")),\"\",IF(VLOOKUP(A1010,Draft!E:E,1,FALSE)=A1010,\"Yes\"))","v":""}]
[1006,"Shields, James",{"$f":"IF(ISNA(IF(VLOOKUP(A1011,Draft!E:E,1,FALSE)=A1011,\"Yes\")),\"\",IF(VLOOKUP(A1011,Draft!E:E,1,FALSE)=A1011,\"Yes\"))","v":""}]
[1007,"Vazquez, Javier",{"$f":"IF(ISNA(IF(VLOOKUP(A1012,Draft!E:E,1,FALSE)=A1012,\"Yes\")),\"\",IF(VLOOKUP(A1012,Draft!E:E,1,FALSE)=A1012,\"Yes\"))","v":"Yes"}]
[1008,"Buehrle, Mark",{"$f":"IF(ISNA(IF(VLOOKUP(A1013,Draft!E:E,1,FALSE)=A1013,\"Yes\")),\"\",IF(VLOOKUP(A1013,Draft!E:E,1,FALSE)=A1013,\"Yes\"))","v":""}]
[1009,"Beckett, Josh",{"$f":"IF(ISNA(IF(VLOOKUP(A1014,Draft!E:E,1,FALSE)=A1014,\"Yes\")),\"\",IF(VLOOKUP(A1014,Draft!E:E,1,FALSE)=A1014,\"Yes\"))","v":"Yes"}]
[1010,"Weaver(ANA), Jered",{"$f":"IF(ISNA(IF(VLOOKUP(A1015,Draft!E:E,1,FALSE)=A1015,\"Yes\")),\"\",IF(VLOOKUP(A1015,Draft!E:E,1,FALSE)=A1015,\"Yes\"))","v":""}]
[1011,"Burnett, A.J.",{"$f":"IF(ISNA(IF(VLOOKUP(A1016,Draft!E:E,1,FALSE)=A1016,\"Yes\")),\"\",IF(VLOOKUP(A1016,Draft!E:E,1,FALSE)=A1016,\"Yes\"))","v":"Yes"}]
[1012,"Blackburn, Nick",{"$f":"IF(ISNA(IF(VLOOKUP(A1017,Draft!E:E,1,FALSE)=A1017,\"Yes\")),\"\",IF(VLOOKUP(A1017,Draft!E:E,1,FALSE)=A1017,\"Yes\"))","v":""}]
[1013,"Lester, Jon",{"$f":"IF(ISNA(IF(VLOOKUP(A1018,Draft!E:E,1,FALSE)=A1018,\"Yes\")),\"\",IF(VLOOKUP(A1018,Draft!E:E,1,FALSE)=A1018,\"Yes\"))","v":""}]
[1014,"Garza, Matt",{"$f":"IF(ISNA(IF(VLOOKUP(A1019,Draft!E:E,1,FALSE)=A1019,\"Yes\")),\"\",IF(VLOOKUP(A1019,Draft!E:E,1,FALSE)=A1019,\"Yes\"))","v":""}]
[1015,"Danks, John",{"$f":"IF(ISNA(IF(VLOOKUP(A1020,Draft!E:E,1,FALSE)=A1020,\"Yes\")),\"\",IF(VLOOKUP(A1020,Draft!E:E,1,FALSE)=A1020,\"Yes\"))","v":""}]
[1016,"Guthrie, Jeremy",{"$f":"IF(ISNA(IF(VLOOKUP(A1021,Draft!E:E,1,FALSE)=A1021,\"Yes\")),\"\",IF(VLOOKUP(A1021,Draft!E:E,1,FALSE)=A1021,\"Yes\"))","v":""}]
[1017,"Pavano, Carl",{"$f":"IF(ISNA(IF(VLOOKUP(A1022,Draft!E:E,1,FALSE)=A1022,\"Yes\")),\"\",IF(VLOOKUP(A1022,Draft!E:E,1,FALSE)=A1022,\"Yes\"))","v":""}]
[1018,"Millwood, Kevin",{"$f":"IF(ISNA(IF(VLOOKUP(A1023,Draft!E:E,1,FALSE)=A1023,\"Yes\")),\"\",IF(VLOOKUP(A1023,Draft!E:E,1,FALSE)=A1023,\"Yes\"))","v":""}]
[1019,"Pettitte, Andy",{"$f":"IF(ISNA(IF(VLOOKUP(A1024,Draft!E:E,1,FALSE)=A1024,\"Yes\")),\"\",IF(VLOOKUP(A1024,Draft!E:E,1,FALSE)=A1024,\"Yes\"))","v":""}]
[1020,"Baker, Scott",{"$f":"IF(ISNA(IF(VLOOKUP(A1025,Draft!E:E,1,FALSE)=A1025,\"Yes\")),\"\",IF(VLOOKUP(A1025,Draft!E:E,1,FALSE)=A1025,\"Yes\"))","v":""}]
[1021,"Floyd, Gavin",{"$f":"IF(ISNA(IF(VLOOKUP(A1026,Draft!E:E,1,FALSE)=A1026,\"Yes\")),\"\",IF(VLOOKUP(A1026,Draft!E:E,1,FALSE)=A1026,\"Yes\"))","v":""}]
[1022,"Feldman, Scott",{"$f":"IF(ISNA(IF(VLOOKUP(A1027,Draft!E:E,1,FALSE)=A1027,\"Yes\")),\"\",IF(VLOOKUP(A1027,Draft!E:E,1,FALSE)=A1027,\"Yes\"))","v":""}]
[1023,"Saunders, Joe",{"$f":"IF(ISNA(IF(VLOOKUP(A1028,Draft!E:E,1,FALSE)=A1028,\"Yes\")),\"\",IF(VLOOKUP(A1028,Draft!E:E,1,FALSE)=A1028,\"Yes\"))","v":""}]
[1024,"Niemann, Jeff",{"$f":"IF(ISNA(IF(VLOOKUP(A1029,Draft!E:E,1,FALSE)=A1029,\"Yes\")),\"\",IF(VLOOKUP(A1029,Draft!E:E,1,FALSE)=A1029,\"Yes\"))","v":""}]
[1025,"Cahill, Trevor",{"$f":"IF(ISNA(IF(VLOOKUP(A1030,Draft!E:E,1,FALSE)=A1030,\"Yes\")),\"\",IF(VLOOKUP(A1030,Draft!E:E,1,FALSE)=A1030,\"Yes\"))","v":""}]
[1026,"Romero, Ricky",{"$f":"IF(ISNA(IF(VLOOKUP(A1031,Draft!E:E,1,FALSE)=A1031,\"Yes\")),\"\",IF(VLOOKUP(A1031,Draft!E:E,1,FALSE)=A1031,\"Yes\"))","v":""}]
[1027,"Lackey, John",{"$f":"IF(ISNA(IF(VLOOKUP(A1032,Draft!E:E,1,FALSE)=A1032,\"Yes\")),\"\",IF(VLOOKUP(A1032,Draft!E:E,1,FALSE)=A1032,\"Yes\"))","v":""}]
[1028,"Anderson, Brett",{"$f":"IF(ISNA(IF(VLOOKUP(A1033,Draft!E:E,1,FALSE)=A1033,\"Yes\")),\"\",IF(VLOOKUP(A1033,Draft!E:E,1,FALSE)=A1033,\"Yes\"))","v":""}]
[1029,"Scherzer, Max",{"$f":"IF(ISNA(IF(VLOOKUP(A1034,Draft!E:E,1,FALSE)=A1034,\"Yes\")),\"\",IF(VLOOKUP(A1034,Draft!E:E,1,FALSE)=A1034,\"Yes\"))","v":"Yes"}]
[1030,"Porcello, Rick",{"$f":"IF(ISNA(IF(VLOOKUP(A1035,Draft!E:E,1,FALSE)=A1035,\"Yes\")),\"\",IF(VLOOKUP(A1035,Draft!E:E,1,FALSE)=A1035,\"Yes\"))","v":""}]
[1031,"Tallet, Brian",{"$f":"IF(ISNA(IF(VLOOKUP(A1036,Draft!E:E,1,FALSE)=A1036,\"Yes\")),\"\",IF(VLOOKUP(A1036,Draft!E:E,1,FALSE)=A1036,\"Yes\"))","v":""}]
[1032,"Chamberlain, Joba",{"$f":"IF(ISNA(IF(VLOOKUP(A1037,Draft!E:E,1,FALSE)=A1037,\"Yes\")),\"\",IF(VLOOKUP(A1037,Draft!E:E,1,FALSE)=A1037,\"Yes\"))","v":""}]
[1033,"Bannister, Brian",{"$f":"IF(ISNA(IF(VLOOKUP(A1038,Draft!E:E,1,FALSE)=A1038,\"Yes\")),\"\",IF(VLOOKUP(A1038,Draft!E:E,1,FALSE)=A1038,\"Yes\"))","v":""}]
[1034,"Kazmir, Scott",{"$f":"IF(ISNA(IF(VLOOKUP(A1039,Draft!E:E,1,FALSE)=A1039,\"Yes\")),\"\",IF(VLOOKUP(A1039,Draft!E:E,1,FALSE)=A1039,\"Yes\"))","v":"Yes"}]
[1035,"Gaudin, Chad",{"$f":"IF(ISNA(IF(VLOOKUP(A1040,Draft!E:E,1,FALSE)=A1040,\"Yes\")),\"\",IF(VLOOKUP(A1040,Draft!E:E,1,FALSE)=A1040,\"Yes\"))","v":""}]
[1036,"Snell, Ian",{"$f":"IF(ISNA(IF(VLOOKUP(A1041,Draft!E:E,1,FALSE)=A1041,\"Yes\")),\"\",IF(VLOOKUP(A1041,Draft!E:E,1,FALSE)=A1041,\"Yes\"))","v":""}]
[1037,"Galarraga, Armando",{"$f":"IF(ISNA(IF(VLOOKUP(A1042,Draft!E:E,1,FALSE)=A1042,\"Yes\")),\"\",IF(VLOOKUP(A1042,Draft!E:E,1,FALSE)=A1042,\"Yes\"))","v":""}]
[1038,"Hochevar, Luke",{"$f":"IF(ISNA(IF(VLOOKUP(A1043,Draft!E:E,1,FALSE)=A1043,\"Yes\")),\"\",IF(VLOOKUP(A1043,Draft!E:E,1,FALSE)=A1043,\"Yes\"))","v":"Yes"}]
[1039,"Harden, Rich",{"$f":"IF(ISNA(IF(VLOOKUP(A1044,Draft!E:E,1,FALSE)=A1044,\"Yes\")),\"\",IF(VLOOKUP(A1044,Draft!E:E,1,FALSE)=A1044,\"Yes\"))","v":""}]
[1040,"Santana, Ervin",{"$f":"IF(ISNA(IF(VLOOKUP(A1045,Draft!E:E,1,FALSE)=A1045,\"Yes\")),\"\",IF(VLOOKUP(A1045,Draft!E:E,1,FALSE)=A1045,\"Yes\"))","v":""}]
[1041,"Richmond, Scott",{"$f":"IF(ISNA(IF(VLOOKUP(A1046,Draft!E:E,1,FALSE)=A1046,\"Yes\")),\"\",IF(VLOOKUP(A1046,Draft!E:E,1,FALSE)=A1046,\"Yes\"))","v":""}]
[1042,"Holland, Derek",{"$f":"IF(ISNA(IF(VLOOKUP(A1047,Draft!E:E,1,FALSE)=A1047,\"Yes\")),\"\",IF(VLOOKUP(A1047,Draft!E:E,1,FALSE)=A1047,\"Yes\"))","v":""}]
[1043,"Liriano, Francisco",{"$f":"IF(ISNA(IF(VLOOKUP(A1048,Draft!E:E,1,FALSE)=A1048,\"Yes\")),\"\",IF(VLOOKUP(A1048,Draft!E:E,1,FALSE)=A1048,\"Yes\"))","v":""}]
[1044,"Braden, Dallas",{"$f":"IF(ISNA(IF(VLOOKUP(A1049,Draft!E:E,1,FALSE)=A1049,\"Yes\")),\"\",IF(VLOOKUP(A1049,Draft!E:E,1,FALSE)=A1049,\"Yes\"))","v":""}]
[1045,"Wakefield, Tim",{"$f":"IF(ISNA(IF(VLOOKUP(A1050,Draft!E:E,1,FALSE)=A1050,\"Yes\")),\"\",IF(VLOOKUP(A1050,Draft!E:E,1,FALSE)=A1050,\"Yes\"))","v":""}]
[1046,"Masterson, Justin",{"$f":"IF(ISNA(IF(VLOOKUP(A1051,Draft!E:E,1,FALSE)=A1051,\"Yes\")),\"\",IF(VLOOKUP(A1051,Draft!E:E,1,FALSE)=A1051,\"Yes\"))","v":""}]
[1047,"Meche, Gil",{"$f":"IF(ISNA(IF(VLOOKUP(A1052,Draft!E:E,1,FALSE)=A1052,\"Yes\")),\"\",IF(VLOOKUP(A1052,Draft!E:E,1,FALSE)=A1052,\"Yes\"))","v":""}]
[1048,"Price, David",{"$f":"IF(ISNA(IF(VLOOKUP(A1053,Draft!E:E,1,FALSE)=A1053,\"Yes\")),\"\",IF(VLOOKUP(A1053,Draft!E:E,1,FALSE)=A1053,\"Yes\"))","v":""}]
[1049,"Huff, David",{"$f":"IF(ISNA(IF(VLOOKUP(A1054,Draft!E:E,1,FALSE)=A1054,\"Yes\")),\"\",IF(VLOOKUP(A1054,Draft!E:E,1,FALSE)=A1054,\"Yes\"))","v":""}]
[1050,"Carmona, Fausto",{"$f":"IF(ISNA(IF(VLOOKUP(A1055,Draft!E:E,1,FALSE)=A1055,\"Yes\")),\"\",IF(VLOOKUP(A1055,Draft!E:E,1,FALSE)=A1055,\"Yes\"))","v":""}]
[1051,"Sowers, Jeremy",{"$f":"IF(ISNA(IF(VLOOKUP(A1056,Draft!E:E,1,FALSE)=A1056,\"Yes\")),\"\",IF(VLOOKUP(A1056,Draft!E:E,1,FALSE)=A1056,\"Yes\"))","v":""}]
[1052,"Bergesen, Bradley",{"$f":"IF(ISNA(IF(VLOOKUP(A1057,Draft!E:E,1,FALSE)=A1057,\"Yes\")),\"\",IF(VLOOKUP(A1057,Draft!E:E,1,FALSE)=A1057,\"Yes\"))","v":""}]
[1053,"Davies, Kyle",{"$f":"IF(ISNA(IF(VLOOKUP(A1058,Draft!E:E,1,FALSE)=A1058,\"Yes\")),\"\",IF(VLOOKUP(A1058,Draft!E:E,1,FALSE)=A1058,\"Yes\"))","v":""}]
[1054,"Laffey, Aaron",{"$f":"IF(ISNA(IF(VLOOKUP(A1059,Draft!E:E,1,FALSE)=A1059,\"Yes\")),\"\",IF(VLOOKUP(A1059,Draft!E:E,1,FALSE)=A1059,\"Yes\"))","v":""}]
[1055,"Palmer, Matt",{"$f":"IF(ISNA(IF(VLOOKUP(A1060,Draft!E:E,1,FALSE)=A1060,\"Yes\")),\"\",IF(VLOOKUP(A1060,Draft!E:E,1,FALSE)=A1060,\"Yes\"))","v":""}]
[1056,"Berken, Jason",{"$f":"IF(ISNA(IF(VLOOKUP(A1061,Draft!E:E,1,FALSE)=A1061,\"Yes\")),\"\",IF(VLOOKUP(A1061,Draft!E:E,1,FALSE)=A1061,\"Yes\"))","v":""}]
[1057,"Hunter, Tommy",{"$f":"IF(ISNA(IF(VLOOKUP(A1062,Draft!E:E,1,FALSE)=A1062,\"Yes\")),\"\",IF(VLOOKUP(A1062,Draft!E:E,1,FALSE)=A1062,\"Yes\"))","v":""}]
[1058,"Peavy, Jake",{"$f":"IF(ISNA(IF(VLOOKUP(A1063,Draft!E:E,1,FALSE)=A1063,\"Yes\")),\"\",IF(VLOOKUP(A1063,Draft!E:E,1,FALSE)=A1063,\"Yes\"))","v":"Yes"}]
[1059,"Hernandez, David",{"$f":"IF(ISNA(IF(VLOOKUP(A1064,Draft!E:E,1,FALSE)=A1064,\"Yes\")),\"\",IF(VLOOKUP(A1064,Draft!E:E,1,FALSE)=A1064,\"Yes\"))","v":""}]
[1060,"Sonnanstine, Andy",{"$f":"IF(ISNA(IF(VLOOKUP(A1065,Draft!E:E,1,FALSE)=A1065,\"Yes\")),\"\",IF(VLOOKUP(A1065,Draft!E:E,1,FALSE)=A1065,\"Yes\"))","v":""}]
[1061,"Gonzalez, Gio",{"$f":"IF(ISNA(IF(VLOOKUP(A1066,Draft!E:E,1,FALSE)=A1066,\"Yes\")),\"\",IF(VLOOKUP(A1066,Draft!E:E,1,FALSE)=A1066,\"Yes\"))","v":""}]
[1062,"McCarthy, Brandon",{"$f":"IF(ISNA(IF(VLOOKUP(A1067,Draft!E:E,1,FALSE)=A1067,\"Yes\")),\"\",IF(VLOOKUP(A1067,Draft!E:E,1,FALSE)=A1067,\"Yes\"))","v":""}]
[1063,"Perkins, Glen",{"$f":"IF(ISNA(IF(VLOOKUP(A1068,Draft!E:E,1,FALSE)=A1068,\"Yes\")),\"\",IF(VLOOKUP(A1068,Draft!E:E,1,FALSE)=A1068,\"Yes\"))","v":""}]
[1064,"Rowland-Smith, Ryan",{"$f":"IF(ISNA(IF(VLOOKUP(A1069,Draft!E:E,1,FALSE)=A1069,\"Yes\")),\"\",IF(VLOOKUP(A1069,Draft!E:E,1,FALSE)=A1069,\"Yes\"))","v":""}]
[1065,"Cecil, Brett",{"$f":"IF(ISNA(IF(VLOOKUP(A1070,Draft!E:E,1,FALSE)=A1070,\"Yes\")),\"\",IF(VLOOKUP(A1070,Draft!E:E,1,FALSE)=A1070,\"Yes\"))","v":""}]
[1066,"Buchholz, Clay",{"$f":"IF(ISNA(IF(VLOOKUP(A1071,Draft!E:E,1,FALSE)=A1071,\"Yes\")),\"\",IF(VLOOKUP(A1071,Draft!E:E,1,FALSE)=A1071,\"Yes\"))","v":""}]
[1067,"Miner, Zach",{"$f":"IF(ISNA(IF(VLOOKUP(A1072,Draft!E:E,1,FALSE)=A1072,\"Yes\")),\"\",IF(VLOOKUP(A1072,Draft!E:E,1,FALSE)=A1072,\"Yes\"))","v":""}]
[1068,"Vargas, Jason",{"$f":"IF(ISNA(IF(VLOOKUP(A1073,Draft!E:E,1,FALSE)=A1073,\"Yes\")),\"\",IF(VLOOKUP(A1073,Draft!E:E,1,FALSE)=A1073,\"Yes\"))","v":""}]
[1069,"Mazzaro, Vincent",{"$f":"IF(ISNA(IF(VLOOKUP(A1074,Draft!E:E,1,FALSE)=A1074,\"Yes\")),\"\",IF(VLOOKUP(A1074,Draft!E:E,1,FALSE)=A1074,\"Yes\"))","v":""}]
[1070,"Slowey, Kevin",{"$f":"IF(ISNA(IF(VLOOKUP(A1075,Draft!E:E,1,FALSE)=A1075,\"Yes\")),\"\",IF(VLOOKUP(A1075,Draft!E:E,1,FALSE)=A1075,\"Yes\"))","v":""}]
[1071,"Petit, Yusmeiro",{"$f":"IF(ISNA(IF(VLOOKUP(A1076,Draft!E:E,1,FALSE)=A1076,\"Yes\")),\"\",IF(VLOOKUP(A1076,Draft!E:E,1,FALSE)=A1076,\"Yes\"))","v":""}]
[1072,"Hughes, Philip",{"$f":"IF(ISNA(IF(VLOOKUP(A1077,Draft!E:E,1,FALSE)=A1077,\"Yes\")),\"\",IF(VLOOKUP(A1077,Draft!E:E,1,FALSE)=A1077,\"Yes\"))","v":""}]
[1073,"Aceves, Alfredo",{"$f":"IF(ISNA(IF(VLOOKUP(A1078,Draft!E:E,1,FALSE)=A1078,\"Yes\")),\"\",IF(VLOOKUP(A1078,Draft!E:E,1,FALSE)=A1078,\"Yes\"))","v":""}]
[1074,"Duensing, Brian",{"$f":"IF(ISNA(IF(VLOOKUP(A1079,Draft!E:E,1,FALSE)=A1079,\"Yes\")),\"\",IF(VLOOKUP(A1079,Draft!E:E,1,FALSE)=A1079,\"Yes\"))","v":""}]
[1075,"Olson, Garrett",{"$f":"IF(ISNA(IF(VLOOKUP(A1080,Draft!E:E,1,FALSE)=A1080,\"Yes\")),\"\",IF(VLOOKUP(A1080,Draft!E:E,1,FALSE)=A1080,\"Yes\"))","v":""}]
[1076,"Thompson, Brad",{"$f":"IF(ISNA(IF(VLOOKUP(A1081,Draft!E:E,1,FALSE)=A1081,\"Yes\")),\"\",IF(VLOOKUP(A1081,Draft!E:E,1,FALSE)=A1081,\"Yes\"))","v":""}]
[1077,"Tejeda, Robinson",{"$f":"IF(ISNA(IF(VLOOKUP(A1082,Draft!E:E,1,FALSE)=A1082,\"Yes\")),\"\",IF(VLOOKUP(A1082,Draft!E:E,1,FALSE)=A1082,\"Yes\"))","v":""}]
[1078,"Oliver, Darren",{"$f":"IF(ISNA(IF(VLOOKUP(A1083,Draft!E:E,1,FALSE)=A1083,\"Yes\")),\"\",IF(VLOOKUP(A1083,Draft!E:E,1,FALSE)=A1083,\"Yes\"))","v":""}]
[1079,"Nippert, Dustin",{"$f":"IF(ISNA(IF(VLOOKUP(A1084,Draft!E:E,1,FALSE)=A1084,\"Yes\")),\"\",IF(VLOOKUP(A1084,Draft!E:E,1,FALSE)=A1084,\"Yes\"))","v":""}]
[1080,"Morrow, Brandon",{"$f":"IF(ISNA(IF(VLOOKUP(A1085,Draft!E:E,1,FALSE)=A1085,\"Yes\")),\"\",IF(VLOOKUP(A1085,Draft!E:E,1,FALSE)=A1085,\"Yes\"))","v":""}]
[1081,"Outman, Josh",{"$f":"IF(ISNA(IF(VLOOKUP(A1086,Draft!E:E,1,FALSE)=A1086,\"Yes\")),\"\",IF(VLOOKUP(A1086,Draft!E:E,1,FALSE)=A1086,\"Yes\"))","v":""}]
[1082,"French, Luke",{"$f":"IF(ISNA(IF(VLOOKUP(A1087,Draft!E:E,1,FALSE)=A1087,\"Yes\")),\"\",IF(VLOOKUP(A1087,Draft!E:E,1,FALSE)=A1087,\"Yes\"))","v":""}]
[1083,"Uehara, Koji",{"$f":"IF(ISNA(IF(VLOOKUP(A1088,Draft!E:E,1,FALSE)=A1088,\"Yes\")),\"\",IF(VLOOKUP(A1088,Draft!E:E,1,FALSE)=A1088,\"Yes\"))","v":""}]
[1084,"Tillman, Chris",{"$f":"IF(ISNA(IF(VLOOKUP(A1089,Draft!E:E,1,FALSE)=A1089,\"Yes\")),\"\",IF(VLOOKUP(A1089,Draft!E:E,1,FALSE)=A1089,\"Yes\"))","v":""}]
[1085,"Harrison, Matt",{"$f":"IF(ISNA(IF(VLOOKUP(A1090,Draft!E:E,1,FALSE)=A1090,\"Yes\")),\"\",IF(VLOOKUP(A1090,Draft!E:E,1,FALSE)=A1090,\"Yes\"))","v":""}]
[1086,"Chen, Bruce",{"$f":"IF(ISNA(IF(VLOOKUP(A1091,Draft!E:E,1,FALSE)=A1091,\"Yes\")),\"\",IF(VLOOKUP(A1091,Draft!E:E,1,FALSE)=A1091,\"Yes\"))","v":""}]
[1087,"Rzepczynski, Marc",{"$f":"IF(ISNA(IF(VLOOKUP(A1092,Draft!E:E,1,FALSE)=A1092,\"Yes\")),\"\",IF(VLOOKUP(A1092,Draft!E:E,1,FALSE)=A1092,\"Yes\"))","v":""}]
[1088,"Fister, Doug",{"$f":"IF(ISNA(IF(VLOOKUP(A1093,Draft!E:E,1,FALSE)=A1093,\"Yes\")),\"\",IF(VLOOKUP(A1093,Draft!E:E,1,FALSE)=A1093,\"Yes\"))","v":""}]
[1089,"Matsuzaka, Daisuke",{"$f":"IF(ISNA(IF(VLOOKUP(A1094,Draft!E:E,1,FALSE)=A1094,\"Yes\")),\"\",IF(VLOOKUP(A1094,Draft!E:E,1,FALSE)=A1094,\"Yes\"))","v":""}]
[1090,"Swarzak, Anthony",{"$f":"IF(ISNA(IF(VLOOKUP(A1095,Draft!E:E,1,FALSE)=A1095,\"Yes\")),\"\",IF(VLOOKUP(A1095,Draft!E:E,1,FALSE)=A1095,\"Yes\"))","v":""}]
[1091,"Garcia, Freddy",{"$f":"IF(ISNA(IF(VLOOKUP(A1096,Draft!E:E,1,FALSE)=A1096,\"Yes\")),\"\",IF(VLOOKUP(A1096,Draft!E:E,1,FALSE)=A1096,\"Yes\"))","v":""}]
[1092,"Mitre, Sergio",{"$f":"IF(ISNA(IF(VLOOKUP(A1097,Draft!E:E,1,FALSE)=A1097,\"Yes\")),\"\",IF(VLOOKUP(A1097,Draft!E:E,1,FALSE)=A1097,\"Yes\"))","v":""}]
[1093,"O'Sullivan, Sean",{"$f":"IF(ISNA(IF(VLOOKUP(A1098,Draft!E:E,1,FALSE)=A1098,\"Yes\")),\"\",IF(VLOOKUP(A1098,Draft!E:E,1,FALSE)=A1098,\"Yes\"))","v":""}]
[1094,"Cabrera, Daniel",{"$f":"IF(ISNA(IF(VLOOKUP(A1099,Draft!E:E,1,FALSE)=A1099,\"Yes\")),\"\",IF(VLOOKUP(A1099,Draft!E:E,1,FALSE)=A1099,\"Yes\"))","v":""}]
[1095,"Robertson, Nate",{"$f":"IF(ISNA(IF(VLOOKUP(A1100,Draft!E:E,1,FALSE)=A1100,\"Yes\")),\"\",IF(VLOOKUP(A1100,Draft!E:E,1,FALSE)=A1100,\"Yes\"))","v":""}]
[1096,"Purcey, David",{"$f":"IF(ISNA(IF(VLOOKUP(A1101,Draft!E:E,1,FALSE)=A1101,\"Yes\")),\"\",IF(VLOOKUP(A1101,Draft!E:E,1,FALSE)=A1101,\"Yes\"))","v":""}]
[1097,"Matusz, Brian",{"$f":"IF(ISNA(IF(VLOOKUP(A1102,Draft!E:E,1,FALSE)=A1102,\"Yes\")),\"\",IF(VLOOKUP(A1102,Draft!E:E,1,FALSE)=A1102,\"Yes\"))","v":""}]
[1098,"Eveland, Dana",{"$f":"IF(ISNA(IF(VLOOKUP(A1103,Draft!E:E,1,FALSE)=A1103,\"Yes\")),\"\",IF(VLOOKUP(A1103,Draft!E:E,1,FALSE)=A1103,\"Yes\"))","v":""}]
[1099,"Mathis, Doug",{"$f":"IF(ISNA(IF(VLOOKUP(A1104,Draft!E:E,1,FALSE)=A1104,\"Yes\")),\"\",IF(VLOOKUP(A1104,Draft!E:E,1,FALSE)=A1104,\"Yes\"))","v":""}]
[1100,"Janssen, Casey",{"$f":"IF(ISNA(IF(VLOOKUP(A1105,Draft!E:E,1,FALSE)=A1105,\"Yes\")),\"\",IF(VLOOKUP(A1105,Draft!E:E,1,FALSE)=A1105,\"Yes\"))","v":""}]
[1101,"Reyes, Anthony",{"$f":"IF(ISNA(IF(VLOOKUP(A1106,Draft!E:E,1,FALSE)=A1106,\"Yes\")),\"\",IF(VLOOKUP(A1106,Draft!E:E,1,FALSE)=A1106,\"Yes\"))","v":""}]
[1102,"Davis, Wade",{"$f":"IF(ISNA(IF(VLOOKUP(A1107,Draft!E:E,1,FALSE)=A1107,\"Yes\")),\"\",IF(VLOOKUP(A1107,Draft!E:E,1,FALSE)=A1107,\"Yes\"))","v":""}]
[1103,"Bonine, Eddie",{"$f":"IF(ISNA(IF(VLOOKUP(A1108,Draft!E:E,1,FALSE)=A1108,\"Yes\")),\"\",IF(VLOOKUP(A1108,Draft!E:E,1,FALSE)=A1108,\"Yes\"))","v":""}]
[1104,"Willis, Dontrelle",{"$f":"IF(ISNA(IF(VLOOKUP(A1109,Draft!E:E,1,FALSE)=A1109,\"Yes\")),\"\",IF(VLOOKUP(A1109,Draft!E:E,1,FALSE)=A1109,\"Yes\"))","v":""}]
[1105,"Manship, Jeffrey",{"$f":"IF(ISNA(IF(VLOOKUP(A1110,Draft!E:E,1,FALSE)=A1110,\"Yes\")),\"\",IF(VLOOKUP(A1110,Draft!E:E,1,FALSE)=A1110,\"Yes\"))","v":""}]
[1106,"Feliz, Neftali",{"$f":"IF(ISNA(IF(VLOOKUP(A1111,Draft!E:E,1,FALSE)=A1111,\"Yes\")),\"\",IF(VLOOKUP(A1111,Draft!E:E,1,FALSE)=A1111,\"Yes\"))","v":""}]
[1107,"Broadway, Lance",{"$f":"IF(ISNA(IF(VLOOKUP(A1112,Draft!E:E,1,FALSE)=A1112,\"Yes\")),\"\",IF(VLOOKUP(A1112,Draft!E:E,1,FALSE)=A1112,\"Yes\"))","v":""}]
[1108,"Mortensen, Clayton",{"$f":"IF(ISNA(IF(VLOOKUP(A1113,Draft!E:E,1,FALSE)=A1113,\"Yes\")),\"\",IF(VLOOKUP(A1113,Draft!E:E,1,FALSE)=A1113,\"Yes\"))","v":""}]
[1109,"Tazawa, Junichi",{"$f":"IF(ISNA(IF(VLOOKUP(A1114,Draft!E:E,1,FALSE)=A1114,\"Yes\")),\"\",IF(VLOOKUP(A1114,Draft!E:E,1,FALSE)=A1114,\"Yes\"))","v":""}]
[1110,"Gosling, Mike",{"$f":"IF(ISNA(IF(VLOOKUP(A1115,Draft!E:E,1,FALSE)=A1115,\"Yes\")),\"\",IF(VLOOKUP(A1115,Draft!E:E,1,FALSE)=A1115,\"Yes\"))","v":""}]
[1111,"Ray, Robert",{"$f":"IF(ISNA(IF(VLOOKUP(A1116,Draft!E:E,1,FALSE)=A1116,\"Yes\")),\"\",IF(VLOOKUP(A1116,Draft!E:E,1,FALSE)=A1116,\"Yes\"))","v":""}]
[1112,"Hayhurst, Dirk",{"$f":"IF(ISNA(IF(VLOOKUP(A1117,Draft!E:E,1,FALSE)=A1117,\"Yes\")),\"\",IF(VLOOKUP(A1117,Draft!E:E,1,FALSE)=A1117,\"Yes\"))","v":""}]
[1113,"Sosa, Jorge",{"$f":"IF(ISNA(IF(VLOOKUP(A1118,Draft!E:E,1,FALSE)=A1118,\"Yes\")),\"\",IF(VLOOKUP(A1118,Draft!E:E,1,FALSE)=A1118,\"Yes\"))","v":""}]
[1114,"Carrasco, Carlos",{"$f":"IF(ISNA(IF(VLOOKUP(A1119,Draft!E:E,1,FALSE)=A1119,\"Yes\")),\"\",IF(VLOOKUP(A1119,Draft!E:E,1,FALSE)=A1119,\"Yes\"))","v":"Yes"}]
[1115,"Bell, Trevor",{"$f":"IF(ISNA(IF(VLOOKUP(A1120,Draft!E:E,1,FALSE)=A1120,\"Yes\")),\"\",IF(VLOOKUP(A1120,Draft!E:E,1,FALSE)=A1120,\"Yes\"))","v":""}]
[1116,"Hudson, Daniel",{"$f":"IF(ISNA(IF(VLOOKUP(A1121,Draft!E:E,1,FALSE)=A1121,\"Yes\")),\"\",IF(VLOOKUP(A1121,Draft!E:E,1,FALSE)=A1121,\"Yes\"))","v":""}]
[1117,"Eyre, Willie",{"$f":"IF(ISNA(IF(VLOOKUP(A1122,Draft!E:E,1,FALSE)=A1122,\"Yes\")),\"\",IF(VLOOKUP(A1122,Draft!E:E,1,FALSE)=A1122,\"Yes\"))","v":""}]
[1118,"Figaro, Alfredo",{"$f":"IF(ISNA(IF(VLOOKUP(A1123,Draft!E:E,1,FALSE)=A1123,\"Yes\")),\"\",IF(VLOOKUP(A1123,Draft!E:E,1,FALSE)=A1123,\"Yes\"))","v":""}]
[1119,"Kilby, Brad",{"$f":"IF(ISNA(IF(VLOOKUP(A1124,Draft!E:E,1,FALSE)=A1124,\"Yes\")),\"\",IF(VLOOKUP(A1124,Draft!E:E,1,FALSE)=A1124,\"Yes\"))","v":""}]
[1120,"Melancon, Mark",{"$f":"IF(ISNA(IF(VLOOKUP(A1125,Draft!E:E,1,FALSE)=A1125,\"Yes\")),\"\",IF(VLOOKUP(A1125,Draft!E:E,1,FALSE)=A1125,\"Yes\"))","v":""}]
[1121,"Bowden, Michael",{"$f":"IF(ISNA(IF(VLOOKUP(A1126,Draft!E:E,1,FALSE)=A1126,\"Yes\")),\"\",IF(VLOOKUP(A1126,Draft!E:E,1,FALSE)=A1126,\"Yes\"))","v":""}]
[1122,"Hughes, Dusty",{"$f":"IF(ISNA(IF(VLOOKUP(A1127,Draft!E:E,1,FALSE)=A1127,\"Yes\")),\"\",IF(VLOOKUP(A1127,Draft!E:E,1,FALSE)=A1127,\"Yes\"))","v":""}]
[1123,"Moscoso, Guillermo",{"$f":"IF(ISNA(IF(VLOOKUP(A1128,Draft!E:E,1,FALSE)=A1128,\"Yes\")),\"\",IF(VLOOKUP(A1128,Draft!E:E,1,FALSE)=A1128,\"Yes\"))","v":""}]
[1124,"Lerew, Anthony",{"$f":"IF(ISNA(IF(VLOOKUP(A1129,Draft!E:E,1,FALSE)=A1129,\"Yes\")),\"\",IF(VLOOKUP(A1129,Draft!E:E,1,FALSE)=A1129,\"Yes\"))","v":""}]
[1125,"Ortega, Anthony",{"$f":"IF(ISNA(IF(VLOOKUP(A1130,Draft!E:E,1,FALSE)=A1130,\"Yes\")),\"\",IF(VLOOKUP(A1130,Draft!E:E,1,FALSE)=A1130,\"Yes\"))","v":""}]
[1126,"Ramirez(Bos), RamonA.",{"$f":"IF(ISNA(IF(VLOOKUP(A1131,Draft!E:E,1,FALSE)=A1131,\"Yes\")),\"\",IF(VLOOKUP(A1131,Draft!E:E,1,FALSE)=A1131,\"Yes\"))","v":""}]
[1127,"Bonderman, Jeremy",{"$f":"IF(ISNA(IF(VLOOKUP(A1132,Draft!E:E,1,FALSE)=A1132,\"Yes\")),\"\",IF(VLOOKUP(A1132,Draft!E:E,1,FALSE)=A1132,\"Yes\"))","v":""}]
[1128,"Segovia, Zack",{"$f":"IF(ISNA(IF(VLOOKUP(A1133,Draft!E:E,1,FALSE)=A1133,\"Yes\")),\"\",IF(VLOOKUP(A1133,Draft!E:E,1,FALSE)=A1133,\"Yes\"))","v":""}]
[1129,"Litsch, Jesse",{"$f":"IF(ISNA(IF(VLOOKUP(A1134,Draft!E:E,1,FALSE)=A1134,\"Yes\")),\"\",IF(VLOOKUP(A1134,Draft!E:E,1,FALSE)=A1134,\"Yes\"))","v":""}]
[1130,"Humber, Philip",{"$f":"IF(ISNA(IF(VLOOKUP(A1135,Draft!E:E,1,FALSE)=A1135,\"Yes\")),\"\",IF(VLOOKUP(A1135,Draft!E:E,1,FALSE)=A1135,\"Yes\"))","v":""}]
[1131,"Jackson, Zach",{"$f":"IF(ISNA(IF(VLOOKUP(A1136,Draft!E:E,1,FALSE)=A1136,\"Yes\")),\"\",IF(VLOOKUP(A1136,Draft!E:E,1,FALSE)=A1136,\"Yes\"))","v":""}]
[1132,"Meloan, John",{"$f":"IF(ISNA(IF(VLOOKUP(A1137,Draft!E:E,1,FALSE)=A1137,\"Yes\")),\"\",IF(VLOOKUP(A1137,Draft!E:E,1,FALSE)=A1137,\"Yes\"))","v":""}]
[1133,"Mills, Brad",{"$f":"IF(ISNA(IF(VLOOKUP(A1138,Draft!E:E,1,FALSE)=A1138,\"Yes\")),\"\",IF(VLOOKUP(A1138,Draft!E:E,1,FALSE)=A1138,\"Yes\"))","v":""}]
[1134,"Bullington, Bryan",{"$f":"IF(ISNA(IF(VLOOKUP(A1139,Draft!E:E,1,FALSE)=A1139,\"Yes\")),\"\",IF(VLOOKUP(A1139,Draft!E:E,1,FALSE)=A1139,\"Yes\"))","v":""}]
[1135,"Rupe, Josh",{"$f":"IF(ISNA(IF(VLOOKUP(A1140,Draft!E:E,1,FALSE)=A1140,\"Yes\")),\"\",IF(VLOOKUP(A1140,Draft!E:E,1,FALSE)=A1140,\"Yes\"))","v":""}]
[1136,"Campillo, Jorge",{"$f":"IF(ISNA(IF(VLOOKUP(A1141,Draft!E:E,1,FALSE)=A1141,\"Yes\")),\"\",IF(VLOOKUP(A1141,Draft!E:E,1,FALSE)=A1141,\"Yes\"))","v":""}]
[1137,"Gabino, Armando",{"$f":"IF(ISNA(IF(VLOOKUP(A1142,Draft!E:E,1,FALSE)=A1142,\"Yes\")),\"\",IF(VLOOKUP(A1142,Draft!E:E,1,FALSE)=A1142,\"Yes\"))","v":""}]
[1138,"Mendoza, Luis",{"$f":"IF(ISNA(IF(VLOOKUP(A1143,Draft!E:E,1,FALSE)=A1143,\"Yes\")),\"\",IF(VLOOKUP(A1143,Draft!E:E,1,FALSE)=A1143,\"Yes\"))","v":""}]
[1139,"Westbrook, Jake",{"$f":"IF(ISNA(IF(VLOOKUP(A1144,Draft!E:E,1,FALSE)=A1144,\"Yes\")),\"\",IF(VLOOKUP(A1144,Draft!E:E,1,FALSE)=A1144,\"Yes\"))","v":""}]
[1140,"Maroth, Mike",{"$f":"IF(ISNA(IF(VLOOKUP(A1145,Draft!E:E,1,FALSE)=A1145,\"Yes\")),\"\",IF(VLOOKUP(A1145,Draft!E:E,1,FALSE)=A1145,\"Yes\"))","v":""}]
[1141,"Duchscherer, Justin",{"$f":"IF(ISNA(IF(VLOOKUP(A1146,Draft!E:E,1,FALSE)=A1146,\"Yes\")),\"\",IF(VLOOKUP(A1146,Draft!E:E,1,FALSE)=A1146,\"Yes\"))","v":""}]
[1142,"Marcum, Shaun",{"$f":"IF(ISNA(IF(VLOOKUP(A1147,Draft!E:E,1,FALSE)=A1147,\"Yes\")),\"\",IF(VLOOKUP(A1147,Draft!E:E,1,FALSE)=A1147,\"Yes\"))","v":""}]
[1143,"Bonser, Boof",{"$f":"IF(ISNA(IF(VLOOKUP(A1148,Draft!E:E,1,FALSE)=A1148,\"Yes\")),\"\",IF(VLOOKUP(A1148,Draft!E:E,1,FALSE)=A1148,\"Yes\"))","v":""}]
[1144,"McGowan, Dustin",{"$f":"IF(ISNA(IF(VLOOKUP(A1149,Draft!E:E,1,FALSE)=A1149,\"Yes\")),\"\",IF(VLOOKUP(A1149,Draft!E:E,1,FALSE)=A1149,\"Yes\"))","v":""}]
[1145,"Parrish, John",{"$f":"IF(ISNA(IF(VLOOKUP(A1150,Draft!E:E,1,FALSE)=A1150,\"Yes\")),\"\",IF(VLOOKUP(A1150,Draft!E:E,1,FALSE)=A1150,\"Yes\"))","v":""}]
[1146,"Hernandez, Carlos",{"$f":"IF(ISNA(IF(VLOOKUP(A1151,Draft!E:E,1,FALSE)=A1151,\"Yes\")),\"\",IF(VLOOKUP(A1151,Draft!E:E,1,FALSE)=A1151,\"Yes\"))","v":""}]
[1147,"Feierabend, Ryan",{"$f":"IF(ISNA(IF(VLOOKUP(A1152,Draft!E:E,1,FALSE)=A1152,\"Yes\")),\"\",IF(VLOOKUP(A1152,Draft!E:E,1,FALSE)=A1152,\"Yes\"))","v":""}]
[1148,"Rosario, Francisco",{"$f":"IF(ISNA(IF(VLOOKUP(A1153,Draft!E:E,1,FALSE)=A1153,\"Yes\")),\"\",IF(VLOOKUP(A1153,Draft!E:E,1,FALSE)=A1153,\"Yes\"))","v":""}]
[1149,"Castro, Fabio",{"$f":"IF(ISNA(IF(VLOOKUP(A1154,Draft!E:E,1,FALSE)=A1154,\"Yes\")),\"\",IF(VLOOKUP(A1154,Draft!E:E,1,FALSE)=A1154,\"Yes\"))","v":""}]
[1150,"Sanchez, Romulo",{"$f":"IF(ISNA(IF(VLOOKUP(A1155,Draft!E:E,1,FALSE)=A1155,\"Yes\")),\"\",IF(VLOOKUP(A1155,Draft!E:E,1,FALSE)=A1155,\"Yes\"))","v":""}]
[1151,"Hurley, Eric",{"$f":"IF(ISNA(IF(VLOOKUP(A1156,Draft!E:E,1,FALSE)=A1156,\"Yes\")),\"\",IF(VLOOKUP(A1156,Draft!E:E,1,FALSE)=A1156,\"Yes\"))","v":""}]
[1152,"Patton, Troy",{"$f":"IF(ISNA(IF(VLOOKUP(A1157,Draft!E:E,1,FALSE)=A1157,\"Yes\")),\"\",IF(VLOOKUP(A1157,Draft!E:E,1,FALSE)=A1157,\"Yes\"))","v":"Yes"}]
[1153,"Talbot, Mitch",{"$f":"IF(ISNA(IF(VLOOKUP(A1158,Draft!E:E,1,FALSE)=A1158,\"Yes\")),\"\",IF(VLOOKUP(A1158,Draft!E:E,1,FALSE)=A1158,\"Yes\"))","v":""}]
[1154,"Erbe, Brandon",{"$f":"IF(ISNA(IF(VLOOKUP(A1159,Draft!E:E,1,FALSE)=A1159,\"Yes\")),\"\",IF(VLOOKUP(A1159,Draft!E:E,1,FALSE)=A1159,\"Yes\"))","v":""}]
[1155,"Spoone, Chorye",{"$f":"IF(ISNA(IF(VLOOKUP(A1160,Draft!E:E,1,FALSE)=A1160,\"Yes\")),\"\",IF(VLOOKUP(A1160,Draft!E:E,1,FALSE)=A1160,\"Yes\"))","v":""}]
[1156,"Arrieta, Jake",{"$f":"IF(ISNA(IF(VLOOKUP(A1161,Draft!E:E,1,FALSE)=A1161,\"Yes\")),\"\",IF(VLOOKUP(A1161,Draft!E:E,1,FALSE)=A1161,\"Yes\"))","v":""}]
[1157,"Hobgood, Matthew",{"$f":"IF(ISNA(IF(VLOOKUP(A1162,Draft!E:E,1,FALSE)=A1162,\"Yes\")),\"\",IF(VLOOKUP(A1162,Draft!E:E,1,FALSE)=A1162,\"Yes\"))","v":""}]
[1158,"Britton, Zach",{"$f":"IF(ISNA(IF(VLOOKUP(A1163,Draft!E:E,1,FALSE)=A1163,\"Yes\")),\"\",IF(VLOOKUP(A1163,Draft!E:E,1,FALSE)=A1163,\"Yes\"))","v":""}]
[1159,"Kelly, Casey",{"$f":"IF(ISNA(IF(VLOOKUP(A1164,Draft!E:E,1,FALSE)=A1164,\"Yes\")),\"\",IF(VLOOKUP(A1164,Draft!E:E,1,FALSE)=A1164,\"Yes\"))","v":""}]
[1160,"Wilson, William",{"$f":"IF(ISNA(IF(VLOOKUP(A1165,Draft!E:E,1,FALSE)=A1165,\"Yes\")),\"\",IF(VLOOKUP(A1165,Draft!E:E,1,FALSE)=A1165,\"Yes\"))","v":""}]
[1161,"Doubront, Felix",{"$f":"IF(ISNA(IF(VLOOKUP(A1166,Draft!E:E,1,FALSE)=A1166,\"Yes\")),\"\",IF(VLOOKUP(A1166,Draft!E:E,1,FALSE)=A1166,\"Yes\"))","v":""}]
[1162,"Walden, Jordan",{"$f":"IF(ISNA(IF(VLOOKUP(A1167,Draft!E:E,1,FALSE)=A1167,\"Yes\")),\"\",IF(VLOOKUP(A1167,Draft!E:E,1,FALSE)=A1167,\"Yes\"))","v":""}]
[1163,"Reckling, Trevor",{"$f":"IF(ISNA(IF(VLOOKUP(A1168,Draft!E:E,1,FALSE)=A1168,\"Yes\")),\"\",IF(VLOOKUP(A1168,Draft!E:E,1,FALSE)=A1168,\"Yes\"))","v":""}]
[1164,"Chatwood, Tyler",{"$f":"IF(ISNA(IF(VLOOKUP(A1169,Draft!E:E,1,FALSE)=A1169,\"Yes\")),\"\",IF(VLOOKUP(A1169,Draft!E:E,1,FALSE)=A1169,\"Yes\"))","v":""}]
[1165,"Skaggs, Tyler",{"$f":"IF(ISNA(IF(VLOOKUP(A1170,Draft!E:E,1,FALSE)=A1170,\"Yes\")),\"\",IF(VLOOKUP(A1170,Draft!E:E,1,FALSE)=A1170,\"Yes\"))","v":""}]
[1166,"Richards, Garrett",{"$f":"IF(ISNA(IF(VLOOKUP(A1171,Draft!E:E,1,FALSE)=A1171,\"Yes\")),\"\",IF(VLOOKUP(A1171,Draft!E:E,1,FALSE)=A1171,\"Yes\"))","v":""}]
[1167,"Kehrer, Tyler",{"$f":"IF(ISNA(IF(VLOOKUP(A1172,Draft!E:E,1,FALSE)=A1172,\"Yes\")),\"\",IF(VLOOKUP(A1172,Draft!E:E,1,FALSE)=A1172,\"Yes\"))","v":""}]
[1168,"Corbin, Patrick",{"$f":"IF(ISNA(IF(VLOOKUP(A1173,Draft!E:E,1,FALSE)=A1173,\"Yes\")),\"\",IF(VLOOKUP(A1173,Draft!E:E,1,FALSE)=A1173,\"Yes\"))","v":""}]
[1169,"Martinez, Fabio",{"$f":"IF(ISNA(IF(VLOOKUP(A1174,Draft!E:E,1,FALSE)=A1174,\"Yes\")),\"\",IF(VLOOKUP(A1174,Draft!E:E,1,FALSE)=A1174,\"Yes\"))","v":""}]
[1170,"Marquez, Jeff",{"$f":"IF(ISNA(IF(VLOOKUP(A1175,Draft!E:E,1,FALSE)=A1175,\"Yes\")),\"\",IF(VLOOKUP(A1175,Draft!E:E,1,FALSE)=A1175,\"Yes\"))","v":""}]
[1171,"Holmberg, David",{"$f":"IF(ISNA(IF(VLOOKUP(A1176,Draft!E:E,1,FALSE)=A1176,\"Yes\")),\"\",IF(VLOOKUP(A1176,Draft!E:E,1,FALSE)=A1176,\"Yes\"))","v":""}]
[1172,"Hynick, Brandon",{"$f":"IF(ISNA(IF(VLOOKUP(A1177,Draft!E:E,1,FALSE)=A1177,\"Yes\")),\"\",IF(VLOOKUP(A1177,Draft!E:E,1,FALSE)=A1177,\"Yes\"))","v":""}]
[1173,"Hagadone, Nicholas",{"$f":"IF(ISNA(IF(VLOOKUP(A1178,Draft!E:E,1,FALSE)=A1178,\"Yes\")),\"\",IF(VLOOKUP(A1178,Draft!E:E,1,FALSE)=A1178,\"Yes\"))","v":""}]
[1174,"Rondon, Hector",{"$f":"IF(ISNA(IF(VLOOKUP(A1179,Draft!E:E,1,FALSE)=A1179,\"Yes\")),\"\",IF(VLOOKUP(A1179,Draft!E:E,1,FALSE)=A1179,\"Yes\"))","v":""}]
[1175,"DeLaCruz, Kelvin",{"$f":"IF(ISNA(IF(VLOOKUP(A1180,Draft!E:E,1,FALSE)=A1180,\"Yes\")),\"\",IF(VLOOKUP(A1180,Draft!E:E,1,FALSE)=A1180,\"Yes\"))","v":""}]
[1176,"Perez, Alexander",{"$f":"IF(ISNA(IF(VLOOKUP(A1181,Draft!E:E,1,FALSE)=A1181,\"Yes\")),\"\",IF(VLOOKUP(A1181,Draft!E:E,1,FALSE)=A1181,\"Yes\"))","v":""}]
[1177,"Gomez, Jeanmar",{"$f":"IF(ISNA(IF(VLOOKUP(A1182,Draft!E:E,1,FALSE)=A1182,\"Yes\")),\"\",IF(VLOOKUP(A1182,Draft!E:E,1,FALSE)=A1182,\"Yes\"))","v":""}]
[1178,"White, Alex",{"$f":"IF(ISNA(IF(VLOOKUP(A1183,Draft!E:E,1,FALSE)=A1183,\"Yes\")),\"\",IF(VLOOKUP(A1183,Draft!E:E,1,FALSE)=A1183,\"Yes\"))","v":""}]
[1179,"Ambriz, Hector",{"$f":"IF(ISNA(IF(VLOOKUP(A1184,Draft!E:E,1,FALSE)=A1184,\"Yes\")),\"\",IF(VLOOKUP(A1184,Draft!E:E,1,FALSE)=A1184,\"Yes\"))","v":""}]
[1180,"Knapp, Jason",{"$f":"IF(ISNA(IF(VLOOKUP(A1185,Draft!E:E,1,FALSE)=A1185,\"Yes\")),\"\",IF(VLOOKUP(A1185,Draft!E:E,1,FALSE)=A1185,\"Yes\"))","v":""}]
[1181,"Crosby, Casey",{"$f":"IF(ISNA(IF(VLOOKUP(A1186,Draft!E:E,1,FALSE)=A1186,\"Yes\")),\"\",IF(VLOOKUP(A1186,Draft!E:E,1,FALSE)=A1186,\"Yes\"))","v":""}]
[1182,"Turner, Jacob",{"$f":"IF(ISNA(IF(VLOOKUP(A1187,Draft!E:E,1,FALSE)=A1187,\"Yes\")),\"\",IF(VLOOKUP(A1187,Draft!E:E,1,FALSE)=A1187,\"Yes\"))","v":""}]
[1183,"Oliver, Andrew",{"$f":"IF(ISNA(IF(VLOOKUP(A1188,Draft!E:E,1,FALSE)=A1188,\"Yes\")),\"\",IF(VLOOKUP(A1188,Draft!E:E,1,FALSE)=A1188,\"Yes\"))","v":""}]
[1184,"Montgomery, Mike",{"$f":"IF(ISNA(IF(VLOOKUP(A1189,Draft!E:E,1,FALSE)=A1189,\"Yes\")),\"\",IF(VLOOKUP(A1189,Draft!E:E,1,FALSE)=A1189,\"Yes\"))","v":""}]
[1185,"Melville, Tim",{"$f":"IF(ISNA(IF(VLOOKUP(A1190,Draft!E:E,1,FALSE)=A1190,\"Yes\")),\"\",IF(VLOOKUP(A1190,Draft!E:E,1,FALSE)=A1190,\"Yes\"))","v":""}]
[1186,"Crow, Aaron",{"$f":"IF(ISNA(IF(VLOOKUP(A1191,Draft!E:E,1,FALSE)=A1191,\"Yes\")),\"\",IF(VLOOKUP(A1191,Draft!E:E,1,FALSE)=A1191,\"Yes\"))","v":"Yes"}]
[1187,"Wood, Blake",{"$f":"IF(ISNA(IF(VLOOKUP(A1192,Draft!E:E,1,FALSE)=A1192,\"Yes\")),\"\",IF(VLOOKUP(A1192,Draft!E:E,1,FALSE)=A1192,\"Yes\"))","v":""}]
[1188,"Arguelles, Noel",{"$f":"IF(ISNA(IF(VLOOKUP(A1193,Draft!E:E,1,FALSE)=A1193,\"Yes\")),\"\",IF(VLOOKUP(A1193,Draft!E:E,1,FALSE)=A1193,\"Yes\"))","v":""}]
[1189,"Osuna, Edgar",{"$f":"IF(ISNA(IF(VLOOKUP(A1194,Draft!E:E,1,FALSE)=A1194,\"Yes\")),\"\",IF(VLOOKUP(A1194,Draft!E:E,1,FALSE)=A1194,\"Yes\"))","v":""}]
[1190,"Bostick, Adam",{"$f":"IF(ISNA(IF(VLOOKUP(A1195,Draft!E:E,1,FALSE)=A1195,\"Yes\")),\"\",IF(VLOOKUP(A1195,Draft!E:E,1,FALSE)=A1195,\"Yes\"))","v":""}]
[1191,"Guerra, Deolis",{"$f":"IF(ISNA(IF(VLOOKUP(A1196,Draft!E:E,1,FALSE)=A1196,\"Yes\")),\"\",IF(VLOOKUP(A1196,Draft!E:E,1,FALSE)=A1196,\"Yes\"))","v":""}]
[1192,"Gibson, Kyle",{"$f":"IF(ISNA(IF(VLOOKUP(A1197,Draft!E:E,1,FALSE)=A1197,\"Yes\")),\"\",IF(VLOOKUP(A1197,Draft!E:E,1,FALSE)=A1197,\"Yes\"))","v":""}]
[1193,"Bashore, Matthew",{"$f":"IF(ISNA(IF(VLOOKUP(A1198,Draft!E:E,1,FALSE)=A1198,\"Yes\")),\"\",IF(VLOOKUP(A1198,Draft!E:E,1,FALSE)=A1198,\"Yes\"))","v":""}]
[1194,"Bullock, William",{"$f":"IF(ISNA(IF(VLOOKUP(A1199,Draft!E:E,1,FALSE)=A1199,\"Yes\")),\"\",IF(VLOOKUP(A1199,Draft!E:E,1,FALSE)=A1199,\"Yes\"))","v":""}]
[1195,"Brackman, Andrew",{"$f":"IF(ISNA(IF(VLOOKUP(A1200,Draft!E:E,1,FALSE)=A1200,\"Yes\")),\"\",IF(VLOOKUP(A1200,Draft!E:E,1,FALSE)=A1200,\"Yes\"))","v":""}]
[1196,"Garcia, Christian",{"$f":"IF(ISNA(IF(VLOOKUP(A1201,Draft!E:E,1,FALSE)=A1201,\"Yes\")),\"\",IF(VLOOKUP(A1201,Draft!E:E,1,FALSE)=A1201,\"Yes\"))","v":""}]
[1197,"McAllister, Zach",{"$f":"IF(ISNA(IF(VLOOKUP(A1202,Draft!E:E,1,FALSE)=A1202,\"Yes\")),\"\",IF(VLOOKUP(A1202,Draft!E:E,1,FALSE)=A1202,\"Yes\"))","v":""}]
[1198,"Banuelos, Manny",{"$f":"IF(ISNA(IF(VLOOKUP(A1203,Draft!E:E,1,FALSE)=A1203,\"Yes\")),\"\",IF(VLOOKUP(A1203,Draft!E:E,1,FALSE)=A1203,\"Yes\"))","v":""}]
[1199,"Nova, Ivan",{"$f":"IF(ISNA(IF(VLOOKUP(A1204,Draft!E:E,1,FALSE)=A1204,\"Yes\")),\"\",IF(VLOOKUP(A1204,Draft!E:E,1,FALSE)=A1204,\"Yes\"))","v":""}]
[1200,"DeLosSantos, Fautino",{"$f":"IF(ISNA(IF(VLOOKUP(A1205,Draft!E:E,1,FALSE)=A1205,\"Yes\")),\"\",IF(VLOOKUP(A1205,Draft!E:E,1,FALSE)=A1205,\"Yes\"))","v":""}]
[1201,"Inoa, Michel",{"$f":"IF(ISNA(IF(VLOOKUP(A1206,Draft!E:E,1,FALSE)=A1206,\"Yes\")),\"\",IF(VLOOKUP(A1206,Draft!E:E,1,FALSE)=A1206,\"Yes\"))","v":""}]
[1202,"Ross, Tyson",{"$f":"IF(ISNA(IF(VLOOKUP(A1207,Draft!E:E,1,FALSE)=A1207,\"Yes\")),\"\",IF(VLOOKUP(A1207,Draft!E:E,1,FALSE)=A1207,\"Yes\"))","v":""}]
[1203,"Cortes, Daniel",{"$f":"IF(ISNA(IF(VLOOKUP(A1208,Draft!E:E,1,FALSE)=A1208,\"Yes\")),\"\",IF(VLOOKUP(A1208,Draft!E:E,1,FALSE)=A1208,\"Yes\"))","v":""}]
[1204,"Fields(Sea), Joshua",{"$f":"IF(ISNA(IF(VLOOKUP(A1209,Draft!E:E,1,FALSE)=A1209,\"Yes\")),\"\",IF(VLOOKUP(A1209,Draft!E:E,1,FALSE)=A1209,\"Yes\"))","v":""}]
[1205,"Hernandez, Gaby",{"$f":"IF(ISNA(IF(VLOOKUP(A1210,Draft!E:E,1,FALSE)=A1210,\"Yes\")),\"\",IF(VLOOKUP(A1210,Draft!E:E,1,FALSE)=A1210,\"Yes\"))","v":""}]
[1206,"Varvaro, Anthony",{"$f":"IF(ISNA(IF(VLOOKUP(A1211,Draft!E:E,1,FALSE)=A1211,\"Yes\")),\"\",IF(VLOOKUP(A1211,Draft!E:E,1,FALSE)=A1211,\"Yes\"))","v":""}]
[1207,"Texeira, Kanekoa",{"$f":"IF(ISNA(IF(VLOOKUP(A1212,Draft!E:E,1,FALSE)=A1212,\"Yes\")),\"\",IF(VLOOKUP(A1212,Draft!E:E,1,FALSE)=A1212,\"Yes\"))","v":""}]
[1208,"Hensley, Steven",{"$f":"IF(ISNA(IF(VLOOKUP(A1213,Draft!E:E,1,FALSE)=A1213,\"Yes\")),\"\",IF(VLOOKUP(A1213,Draft!E:E,1,FALSE)=A1213,\"Yes\"))","v":""}]
[1209,"Main, Michael",{"$f":"IF(ISNA(IF(VLOOKUP(A1214,Draft!E:E,1,FALSE)=A1214,\"Yes\")),\"\",IF(VLOOKUP(A1214,Draft!E:E,1,FALSE)=A1214,\"Yes\"))","v":""}]
[1210,"Perez, Martin",{"$f":"IF(ISNA(IF(VLOOKUP(A1215,Draft!E:E,1,FALSE)=A1215,\"Yes\")),\"\",IF(VLOOKUP(A1215,Draft!E:E,1,FALSE)=A1215,\"Yes\"))","v":""}]
[1211,"Scheppers, Tanner",{"$f":"IF(ISNA(IF(VLOOKUP(A1216,Draft!E:E,1,FALSE)=A1216,\"Yes\")),\"\",IF(VLOOKUP(A1216,Draft!E:E,1,FALSE)=A1216,\"Yes\"))","v":""}]
[1212,"Phillips, Zach",{"$f":"IF(ISNA(IF(VLOOKUP(A1217,Draft!E:E,1,FALSE)=A1217,\"Yes\")),\"\",IF(VLOOKUP(A1217,Draft!E:E,1,FALSE)=A1217,\"Yes\"))","v":""}]
[1213,"Font, Wilmer",{"$f":"IF(ISNA(IF(VLOOKUP(A1218,Draft!E:E,1,FALSE)=A1218,\"Yes\")),\"\",IF(VLOOKUP(A1218,Draft!E:E,1,FALSE)=A1218,\"Yes\"))","v":""}]
[1214,"Snyder, Ben",{"$f":"IF(ISNA(IF(VLOOKUP(A1219,Draft!E:E,1,FALSE)=A1219,\"Yes\")),\"\",IF(VLOOKUP(A1219,Draft!E:E,1,FALSE)=A1219,\"Yes\"))","v":""}]
[1215,"Jenkins, Chad",{"$f":"IF(ISNA(IF(VLOOKUP(A1220,Draft!E:E,1,FALSE)=A1220,\"Yes\")),\"\",IF(VLOOKUP(A1220,Draft!E:E,1,FALSE)=A1220,\"Yes\"))","v":""}]
[1216,"Perez, Luis",{"$f":"IF(ISNA(IF(VLOOKUP(A1221,Draft!E:E,1,FALSE)=A1221,\"Yes\")),\"\",IF(VLOOKUP(A1221,Draft!E:E,1,FALSE)=A1221,\"Yes\"))","v":""}]
[1217,"Drabek, Kyle",{"$f":"IF(ISNA(IF(VLOOKUP(A1222,Draft!E:E,1,FALSE)=A1222,\"Yes\")),\"\",IF(VLOOKUP(A1222,Draft!E:E,1,FALSE)=A1222,\"Yes\"))","v":"Yes"}]
[1218,"Stewart, Zach",{"$f":"IF(ISNA(IF(VLOOKUP(A1223,Draft!E:E,1,FALSE)=A1223,\"Yes\")),\"\",IF(VLOOKUP(A1223,Draft!E:E,1,FALSE)=A1223,\"Yes\"))","v":""}]
[1219,"McGee, Jacob",{"$f":"IF(ISNA(IF(VLOOKUP(A1224,Draft!E:E,1,FALSE)=A1224,\"Yes\")),\"\",IF(VLOOKUP(A1224,Draft!E:E,1,FALSE)=A1224,\"Yes\"))","v":""}]
[1220,"Hellickson, Jeremy",{"$f":"IF(ISNA(IF(VLOOKUP(A1225,Draft!E:E,1,FALSE)=A1225,\"Yes\")),\"\",IF(VLOOKUP(A1225,Draft!E:E,1,FALSE)=A1225,\"Yes\"))","v":""}]
[1221,"Moore, Matt",{"$f":"IF(ISNA(IF(VLOOKUP(A1226,Draft!E:E,1,FALSE)=A1226,\"Yes\")),\"\",IF(VLOOKUP(A1226,Draft!E:E,1,FALSE)=A1226,\"Yes\"))","v":""}]
[1222,"Torres, Alex",{"$f":"IF(ISNA(IF(VLOOKUP(A1227,Draft!E:E,1,FALSE)=A1227,\"Yes\")),\"\",IF(VLOOKUP(A1227,Draft!E:E,1,FALSE)=A1227,\"Yes\"))","v":""}]
[1223,"Bailey, Andrew",{"$f":"IF(ISNA(IF(VLOOKUP(A1228,Draft!E:E,1,FALSE)=A1228,\"Yes\")),\"\",IF(VLOOKUP(A1228,Draft!E:E,1,FALSE)=A1228,\"Yes\"))","v":""}]
[1224,"Lowe, Mark",{"$f":"IF(ISNA(IF(VLOOKUP(A1229,Draft!E:E,1,FALSE)=A1229,\"Yes\")),\"\",IF(VLOOKUP(A1229,Draft!E:E,1,FALSE)=A1229,\"Yes\"))","v":""}]
[1225,"Camp, Shawn",{"$f":"IF(ISNA(IF(VLOOKUP(A1230,Draft!E:E,1,FALSE)=A1230,\"Yes\")),\"\",IF(VLOOKUP(A1230,Draft!E:E,1,FALSE)=A1230,\"Yes\"))","v":""}]
[1226,"Wuertz, Michael",{"$f":"IF(ISNA(IF(VLOOKUP(A1231,Draft!E:E,1,FALSE)=A1231,\"Yes\")),\"\",IF(VLOOKUP(A1231,Draft!E:E,1,FALSE)=A1231,\"Yes\"))","v":""}]
[1227,"Cormier, Lance",{"$f":"IF(ISNA(IF(VLOOKUP(A1232,Draft!E:E,1,FALSE)=A1232,\"Yes\")),\"\",IF(VLOOKUP(A1232,Draft!E:E,1,FALSE)=A1232,\"Yes\"))","v":""}]
[1228,"Guerrier, Matt",{"$f":"IF(ISNA(IF(VLOOKUP(A1233,Draft!E:E,1,FALSE)=A1233,\"Yes\")),\"\",IF(VLOOKUP(A1233,Draft!E:E,1,FALSE)=A1233,\"Yes\"))","v":""}]
[1229,"Soriano, Rafael",{"$f":"IF(ISNA(IF(VLOOKUP(A1234,Draft!E:E,1,FALSE)=A1234,\"Yes\")),\"\",IF(VLOOKUP(A1234,Draft!E:E,1,FALSE)=A1234,\"Yes\"))","v":"Yes"}]
[1230,"League, Brandon",{"$f":"IF(ISNA(IF(VLOOKUP(A1235,Draft!E:E,1,FALSE)=A1235,\"Yes\")),\"\",IF(VLOOKUP(A1235,Draft!E:E,1,FALSE)=A1235,\"Yes\"))","v":""}]
[1231,"Gonzalez, Mike",{"$f":"IF(ISNA(IF(VLOOKUP(A1236,Draft!E:E,1,FALSE)=A1236,\"Yes\")),\"\",IF(VLOOKUP(A1236,Draft!E:E,1,FALSE)=A1236,\"Yes\"))","v":""}]
[1232,"Wilson, C.J.",{"$f":"IF(ISNA(IF(VLOOKUP(A1237,Draft!E:E,1,FALSE)=A1237,\"Yes\")),\"\",IF(VLOOKUP(A1237,Draft!E:E,1,FALSE)=A1237,\"Yes\"))","v":""}]
[1233,"Ziegler, Brad",{"$f":"IF(ISNA(IF(VLOOKUP(A1238,Draft!E:E,1,FALSE)=A1238,\"Yes\")),\"\",IF(VLOOKUP(A1238,Draft!E:E,1,FALSE)=A1238,\"Yes\"))","v":""}]
[1234,"Rodney, Fernando",{"$f":"IF(ISNA(IF(VLOOKUP(A1239,Draft!E:E,1,FALSE)=A1239,\"Yes\")),\"\",IF(VLOOKUP(A1239,Draft!E:E,1,FALSE)=A1239,\"Yes\"))","v":""}]
[1235,"Thornton, Matt",{"$f":"IF(ISNA(IF(VLOOKUP(A1240,Draft!E:E,1,FALSE)=A1240,\"Yes\")),\"\",IF(VLOOKUP(A1240,Draft!E:E,1,FALSE)=A1240,\"Yes\"))","v":""}]
[1236,"Aardsma, David",{"$f":"IF(ISNA(IF(VLOOKUP(A1241,Draft!E:E,1,FALSE)=A1241,\"Yes\")),\"\",IF(VLOOKUP(A1241,Draft!E:E,1,FALSE)=A1241,\"Yes\"))","v":""}]
[1237,"Pena(ChA), Tony(was/Adriano/Rosario)",{"$f":"IF(ISNA(IF(VLOOKUP(A1242,Draft!E:E,1,FALSE)=A1242,\"Yes\")),\"\",IF(VLOOKUP(A1242,Draft!E:E,1,FALSE)=A1242,\"Yes\"))","v":""}]
[1238,"Johnson, Jim",{"$f":"IF(ISNA(IF(VLOOKUP(A1243,Draft!E:E,1,FALSE)=A1243,\"Yes\")),\"\",IF(VLOOKUP(A1243,Draft!E:E,1,FALSE)=A1243,\"Yes\"))","v":""}]
[1239,"Ramirez(Bos), RamonB.",{"$f":"IF(ISNA(IF(VLOOKUP(A1244,Draft!E:E,1,FALSE)=A1244,\"Yes\")),\"\",IF(VLOOKUP(A1244,Draft!E:E,1,FALSE)=A1244,\"Yes\"))","v":""}]
[1240,"Breslow, Craig",{"$f":"IF(ISNA(IF(VLOOKUP(A1245,Draft!E:E,1,FALSE)=A1245,\"Yes\")),\"\",IF(VLOOKUP(A1245,Draft!E:E,1,FALSE)=A1245,\"Yes\"))","v":""}]
[1241,"Rauch, Jon",{"$f":"IF(ISNA(IF(VLOOKUP(A1246,Draft!E:E,1,FALSE)=A1246,\"Yes\")),\"\",IF(VLOOKUP(A1246,Draft!E:E,1,FALSE)=A1246,\"Yes\"))","v":""}]
[1242,"Papelbon, Jonathan",{"$f":"IF(ISNA(IF(VLOOKUP(A1247,Draft!E:E,1,FALSE)=A1247,\"Yes\")),\"\",IF(VLOOKUP(A1247,Draft!E:E,1,FALSE)=A1247,\"Yes\"))","v":""}]
[1243,"Carlson, Jesse",{"$f":"IF(ISNA(IF(VLOOKUP(A1248,Draft!E:E,1,FALSE)=A1248,\"Yes\")),\"\",IF(VLOOKUP(A1248,Draft!E:E,1,FALSE)=A1248,\"Yes\"))","v":""}]
[1244,"Balfour, Grant",{"$f":"IF(ISNA(IF(VLOOKUP(A1249,Draft!E:E,1,FALSE)=A1249,\"Yes\")),\"\",IF(VLOOKUP(A1249,Draft!E:E,1,FALSE)=A1249,\"Yes\"))","v":""}]
[1245,"Nathan, Joe",{"$f":"IF(ISNA(IF(VLOOKUP(A1250,Draft!E:E,1,FALSE)=A1250,\"Yes\")),\"\",IF(VLOOKUP(A1250,Draft!E:E,1,FALSE)=A1250,\"Yes\"))","v":""}]
[1246,"Albers, Matt",{"$f":"IF(ISNA(IF(VLOOKUP(A1251,Draft!E:E,1,FALSE)=A1251,\"Yes\")),\"\",IF(VLOOKUP(A1251,Draft!E:E,1,FALSE)=A1251,\"Yes\"))","v":""}]
[1247,"Howell, J.P.",{"$f":"IF(ISNA(IF(VLOOKUP(A1252,Draft!E:E,1,FALSE)=A1252,\"Yes\")),\"\",IF(VLOOKUP(A1252,Draft!E:E,1,FALSE)=A1252,\"Yes\"))","v":""}]
[1248,"Rivera, Mariano",{"$f":"IF(ISNA(IF(VLOOKUP(A1253,Draft!E:E,1,FALSE)=A1253,\"Yes\")),\"\",IF(VLOOKUP(A1253,Draft!E:E,1,FALSE)=A1253,\"Yes\"))","v":""}]
[1249,"Lewis, Jensen",{"$f":"IF(ISNA(IF(VLOOKUP(A1254,Draft!E:E,1,FALSE)=A1254,\"Yes\")),\"\",IF(VLOOKUP(A1254,Draft!E:E,1,FALSE)=A1254,\"Yes\"))","v":""}]
[1250,"Bulger, Jason",{"$f":"IF(ISNA(IF(VLOOKUP(A1255,Draft!E:E,1,FALSE)=A1255,\"Yes\")),\"\",IF(VLOOKUP(A1255,Draft!E:E,1,FALSE)=A1255,\"Yes\"))","v":""}]
[1251,"Meredith, Cla",{"$f":"IF(ISNA(IF(VLOOKUP(A1256,Draft!E:E,1,FALSE)=A1256,\"Yes\")),\"\",IF(VLOOKUP(A1256,Draft!E:E,1,FALSE)=A1256,\"Yes\"))","v":""}]
[1252,"White, Sean",{"$f":"IF(ISNA(IF(VLOOKUP(A1257,Draft!E:E,1,FALSE)=A1257,\"Yes\")),\"\",IF(VLOOKUP(A1257,Draft!E:E,1,FALSE)=A1257,\"Yes\"))","v":""}]
[1253,"Mijares, Jose",{"$f":"IF(ISNA(IF(VLOOKUP(A1258,Draft!E:E,1,FALSE)=A1258,\"Yes\")),\"\",IF(VLOOKUP(A1258,Draft!E:E,1,FALSE)=A1258,\"Yes\"))","v":""}]
[1254,"Perry, Ryan",{"$f":"IF(ISNA(IF(VLOOKUP(A1259,Draft!E:E,1,FALSE)=A1259,\"Yes\")),\"\",IF(VLOOKUP(A1259,Draft!E:E,1,FALSE)=A1259,\"Yes\"))","v":""}]
[1255,"Okajima, Hideki",{"$f":"IF(ISNA(IF(VLOOKUP(A1260,Draft!E:E,1,FALSE)=A1260,\"Yes\")),\"\",IF(VLOOKUP(A1260,Draft!E:E,1,FALSE)=A1260,\"Yes\"))","v":""}]
[1256,"Coke, Phil",{"$f":"IF(ISNA(IF(VLOOKUP(A1261,Draft!E:E,1,FALSE)=A1261,\"Yes\")),\"\",IF(VLOOKUP(A1261,Draft!E:E,1,FALSE)=A1261,\"Yes\"))","v":""}]
[1257,"DelCarmen, Manny",{"$f":"IF(ISNA(IF(VLOOKUP(A1262,Draft!E:E,1,FALSE)=A1262,\"Yes\")),\"\",IF(VLOOKUP(A1262,Draft!E:E,1,FALSE)=A1262,\"Yes\"))","v":""}]
[1258,"O'Day, Darren",{"$f":"IF(ISNA(IF(VLOOKUP(A1263,Draft!E:E,1,FALSE)=A1263,\"Yes\")),\"\",IF(VLOOKUP(A1263,Draft!E:E,1,FALSE)=A1263,\"Yes\"))","v":""}]
[1259,"Wheeler, Dan",{"$f":"IF(ISNA(IF(VLOOKUP(A1264,Draft!E:E,1,FALSE)=A1264,\"Yes\")),\"\",IF(VLOOKUP(A1264,Draft!E:E,1,FALSE)=A1264,\"Yes\"))","v":""}]
[1260,"Frasor, Jason",{"$f":"IF(ISNA(IF(VLOOKUP(A1265,Draft!E:E,1,FALSE)=A1265,\"Yes\")),\"\",IF(VLOOKUP(A1265,Draft!E:E,1,FALSE)=A1265,\"Yes\"))","v":""}]
[1261,"Perez, Chris",{"$f":"IF(ISNA(IF(VLOOKUP(A1266,Draft!E:E,1,FALSE)=A1266,\"Yes\")),\"\",IF(VLOOKUP(A1266,Draft!E:E,1,FALSE)=A1266,\"Yes\"))","v":""}]
[1262,"Linebrink, Scott",{"$f":"IF(ISNA(IF(VLOOKUP(A1267,Draft!E:E,1,FALSE)=A1267,\"Yes\")),\"\",IF(VLOOKUP(A1267,Draft!E:E,1,FALSE)=A1267,\"Yes\"))","v":""}]
[1263,"Wood, Kerry",{"$f":"IF(ISNA(IF(VLOOKUP(A1268,Draft!E:E,1,FALSE)=A1268,\"Yes\")),\"\",IF(VLOOKUP(A1268,Draft!E:E,1,FALSE)=A1268,\"Yes\"))","v":""}]
[1264,"Fuentes, Brian",{"$f":"IF(ISNA(IF(VLOOKUP(A1269,Draft!E:E,1,FALSE)=A1269,\"Yes\")),\"\",IF(VLOOKUP(A1269,Draft!E:E,1,FALSE)=A1269,\"Yes\"))","v":""}]
[1265,"Jepsen, Kevin",{"$f":"IF(ISNA(IF(VLOOKUP(A1270,Draft!E:E,1,FALSE)=A1270,\"Yes\")),\"\",IF(VLOOKUP(A1270,Draft!E:E,1,FALSE)=A1270,\"Yes\"))","v":""}]
[1266,"Valverde, Jose",{"$f":"IF(ISNA(IF(VLOOKUP(A1271,Draft!E:E,1,FALSE)=A1271,\"Yes\")),\"\",IF(VLOOKUP(A1271,Draft!E:E,1,FALSE)=A1271,\"Yes\"))","v":""}]
[1267,"Jenks, Bobby",{"$f":"IF(ISNA(IF(VLOOKUP(A1272,Draft!E:E,1,FALSE)=A1272,\"Yes\")),\"\",IF(VLOOKUP(A1272,Draft!E:E,1,FALSE)=A1272,\"Yes\"))","v":""}]
[1268,"Soria, Joakim",{"$f":"IF(ISNA(IF(VLOOKUP(A1273,Draft!E:E,1,FALSE)=A1273,\"Yes\")),\"\",IF(VLOOKUP(A1273,Draft!E:E,1,FALSE)=A1273,\"Yes\"))","v":""}]
[1269,"Cruz, Juan",{"$f":"IF(ISNA(IF(VLOOKUP(A1274,Draft!E:E,1,FALSE)=A1274,\"Yes\")),\"\",IF(VLOOKUP(A1274,Draft!E:E,1,FALSE)=A1274,\"Yes\"))","v":""}]
[1270,"Crain, Jesse",{"$f":"IF(ISNA(IF(VLOOKUP(A1275,Draft!E:E,1,FALSE)=A1275,\"Yes\")),\"\",IF(VLOOKUP(A1275,Draft!E:E,1,FALSE)=A1275,\"Yes\"))","v":""}]
[1271,"Colon, Roman",{"$f":"IF(ISNA(IF(VLOOKUP(A1276,Draft!E:E,1,FALSE)=A1276,\"Yes\")),\"\",IF(VLOOKUP(A1276,Draft!E:E,1,FALSE)=A1276,\"Yes\"))","v":""}]
[1272,"Francisco, Frank",{"$f":"IF(ISNA(IF(VLOOKUP(A1277,Draft!E:E,1,FALSE)=A1277,\"Yes\")),\"\",IF(VLOOKUP(A1277,Draft!E:E,1,FALSE)=A1277,\"Yes\"))","v":""}]
[1273,"Valdez, Merkin",{"$f":"IF(ISNA(IF(VLOOKUP(A1278,Draft!E:E,1,FALSE)=A1278,\"Yes\")),\"\",IF(VLOOKUP(A1278,Draft!E:E,1,FALSE)=A1278,\"Yes\"))","v":""}]
[1274,"Bard, Daniel",{"$f":"IF(ISNA(IF(VLOOKUP(A1279,Draft!E:E,1,FALSE)=A1279,\"Yes\")),\"\",IF(VLOOKUP(A1279,Draft!E:E,1,FALSE)=A1279,\"Yes\"))","v":""}]
[1275,"Seay, Bobby",{"$f":"IF(ISNA(IF(VLOOKUP(A1280,Draft!E:E,1,FALSE)=A1280,\"Yes\")),\"\",IF(VLOOKUP(A1280,Draft!E:E,1,FALSE)=A1280,\"Yes\"))","v":""}]
[1276,"Perez, Rafael",{"$f":"IF(ISNA(IF(VLOOKUP(A1281,Draft!E:E,1,FALSE)=A1281,\"Yes\")),\"\",IF(VLOOKUP(A1281,Draft!E:E,1,FALSE)=A1281,\"Yes\"))","v":""}]
[1277,"Downs, Scott",{"$f":"IF(ISNA(IF(VLOOKUP(A1282,Draft!E:E,1,FALSE)=A1282,\"Yes\")),\"\",IF(VLOOKUP(A1282,Draft!E:E,1,FALSE)=A1282,\"Yes\"))","v":""}]
[1278,"Bennett, Jeff",{"$f":"IF(ISNA(IF(VLOOKUP(A1283,Draft!E:E,1,FALSE)=A1283,\"Yes\")),\"\",IF(VLOOKUP(A1283,Draft!E:E,1,FALSE)=A1283,\"Yes\"))","v":""}]
[1279,"Kelley, Shawn",{"$f":"IF(ISNA(IF(VLOOKUP(A1284,Draft!E:E,1,FALSE)=A1284,\"Yes\")),\"\",IF(VLOOKUP(A1284,Draft!E:E,1,FALSE)=A1284,\"Yes\"))","v":""}]
[1280,"Grilli, Jason",{"$f":"IF(ISNA(IF(VLOOKUP(A1285,Draft!E:E,1,FALSE)=A1285,\"Yes\")),\"\",IF(VLOOKUP(A1285,Draft!E:E,1,FALSE)=A1285,\"Yes\"))","v":""}]
[1281,"Robertson, David",{"$f":"IF(ISNA(IF(VLOOKUP(A1286,Draft!E:E,1,FALSE)=A1286,\"Yes\")),\"\",IF(VLOOKUP(A1286,Draft!E:E,1,FALSE)=A1286,\"Yes\"))","v":""}]
[1282,"Ray, Chris",{"$f":"IF(ISNA(IF(VLOOKUP(A1287,Draft!E:E,1,FALSE)=A1287,\"Yes\")),\"\",IF(VLOOKUP(A1287,Draft!E:E,1,FALSE)=A1287,\"Yes\"))","v":""}]
[1283,"Condrey, Clay",{"$f":"IF(ISNA(IF(VLOOKUP(A1288,Draft!E:E,1,FALSE)=A1288,\"Yes\")),\"\",IF(VLOOKUP(A1288,Draft!E:E,1,FALSE)=A1288,\"Yes\"))","v":""}]
[1284,"Sipp, Tony",{"$f":"IF(ISNA(IF(VLOOKUP(A1289,Draft!E:E,1,FALSE)=A1289,\"Yes\")),\"\",IF(VLOOKUP(A1289,Draft!E:E,1,FALSE)=A1289,\"Yes\"))","v":""}]
[1285,"Rivera, Saul",{"$f":"IF(ISNA(IF(VLOOKUP(A1290,Draft!E:E,1,FALSE)=A1290,\"Yes\")),\"\",IF(VLOOKUP(A1290,Draft!E:E,1,FALSE)=A1290,\"Yes\"))","v":""}]
[1286,"Farnsworth, Kyle",{"$f":"IF(ISNA(IF(VLOOKUP(A1291,Draft!E:E,1,FALSE)=A1291,\"Yes\")),\"\",IF(VLOOKUP(A1291,Draft!E:E,1,FALSE)=A1291,\"Yes\"))","v":""}]
[1287,"Choate, Randy",{"$f":"IF(ISNA(IF(VLOOKUP(A1292,Draft!E:E,1,FALSE)=A1292,\"Yes\")),\"\",IF(VLOOKUP(A1292,Draft!E:E,1,FALSE)=A1292,\"Yes\"))","v":""}]
[1288,"Herges, Matt",{"$f":"IF(ISNA(IF(VLOOKUP(A1293,Draft!E:E,1,FALSE)=A1293,\"Yes\")),\"\",IF(VLOOKUP(A1293,Draft!E:E,1,FALSE)=A1293,\"Yes\"))","v":""}]
[1289,"Albaladejo, Jonathan",{"$f":"IF(ISNA(IF(VLOOKUP(A1294,Draft!E:E,1,FALSE)=A1294,\"Yes\")),\"\",IF(VLOOKUP(A1294,Draft!E:E,1,FALSE)=A1294,\"Yes\"))","v":""}]
[1290,"Smith, Joe",{"$f":"IF(ISNA(IF(VLOOKUP(A1295,Draft!E:E,1,FALSE)=A1295,\"Yes\")),\"\",IF(VLOOKUP(A1295,Draft!E:E,1,FALSE)=A1295,\"Yes\"))","v":""}]
[1291,"Zumaya, Joel",{"$f":"IF(ISNA(IF(VLOOKUP(A1296,Draft!E:E,1,FALSE)=A1296,\"Yes\")),\"\",IF(VLOOKUP(A1296,Draft!E:E,1,FALSE)=A1296,\"Yes\"))","v":""}]
[1292,"Roenicke, Josh",{"$f":"IF(ISNA(IF(VLOOKUP(A1297,Draft!E:E,1,FALSE)=A1297,\"Yes\")),\"\",IF(VLOOKUP(A1297,Draft!E:E,1,FALSE)=A1297,\"Yes\"))","v":""}]
[1293,"Rodriguez(Ana), Rafael",{"$f":"IF(ISNA(IF(VLOOKUP(A1298,Draft!E:E,1,FALSE)=A1298,\"Yes\")),\"\",IF(VLOOKUP(A1298,Draft!E:E,1,FALSE)=A1298,\"Yes\"))","v":""}]
[1294,"Ni, Fu-Te",{"$f":"IF(ISNA(IF(VLOOKUP(A1299,Draft!E:E,1,FALSE)=A1299,\"Yes\")),\"\",IF(VLOOKUP(A1299,Draft!E:E,1,FALSE)=A1299,\"Yes\"))","v":""}]
[1295,"Putz, J.J.",{"$f":"IF(ISNA(IF(VLOOKUP(A1300,Draft!E:E,1,FALSE)=A1300,\"Yes\")),\"\",IF(VLOOKUP(A1300,Draft!E:E,1,FALSE)=A1300,\"Yes\"))","v":""}]
[1296,"Shouse, Brian",{"$f":"IF(ISNA(IF(VLOOKUP(A1301,Draft!E:E,1,FALSE)=A1301,\"Yes\")),\"\",IF(VLOOKUP(A1301,Draft!E:E,1,FALSE)=A1301,\"Yes\"))","v":""}]
[1297,"Accardo, Jeremy",{"$f":"IF(ISNA(IF(VLOOKUP(A1302,Draft!E:E,1,FALSE)=A1302,\"Yes\")),\"\",IF(VLOOKUP(A1302,Draft!E:E,1,FALSE)=A1302,\"Yes\"))","v":""}]
[1298,"Sarfate, Dennis",{"$f":"IF(ISNA(IF(VLOOKUP(A1303,Draft!E:E,1,FALSE)=A1303,\"Yes\")),\"\",IF(VLOOKUP(A1303,Draft!E:E,1,FALSE)=A1303,\"Yes\"))","v":""}]
[1299,"Blevins, Jerry",{"$f":"IF(ISNA(IF(VLOOKUP(A1304,Draft!E:E,1,FALSE)=A1304,\"Yes\")),\"\",IF(VLOOKUP(A1304,Draft!E:E,1,FALSE)=A1304,\"Yes\"))","v":""}]
[1300,"Todd, Jess",{"$f":"IF(ISNA(IF(VLOOKUP(A1305,Draft!E:E,1,FALSE)=A1305,\"Yes\")),\"\",IF(VLOOKUP(A1305,Draft!E:E,1,FALSE)=A1305,\"Yes\"))","v":""}]
[1301,"Ramirez, Edwar",{"$f":"IF(ISNA(IF(VLOOKUP(A1306,Draft!E:E,1,FALSE)=A1306,\"Yes\")),\"\",IF(VLOOKUP(A1306,Draft!E:E,1,FALSE)=A1306,\"Yes\"))","v":""}]
[1302,"Geary, Geoff",{"$f":"IF(ISNA(IF(VLOOKUP(A1307,Draft!E:E,1,FALSE)=A1307,\"Yes\")),\"\",IF(VLOOKUP(A1307,Draft!E:E,1,FALSE)=A1307,\"Yes\"))","v":""}]
[1303,"Thompson(Ana), Rich",{"$f":"IF(ISNA(IF(VLOOKUP(A1308,Draft!E:E,1,FALSE)=A1308,\"Yes\")),\"\",IF(VLOOKUP(A1308,Draft!E:E,1,FALSE)=A1308,\"Yes\"))","v":""}]
[1304,"Schlereth, Daniel",{"$f":"IF(ISNA(IF(VLOOKUP(A1309,Draft!E:E,1,FALSE)=A1309,\"Yes\")),\"\",IF(VLOOKUP(A1309,Draft!E:E,1,FALSE)=A1309,\"Yes\"))","v":"Yes"}]
[1305,"Shields, Scot",{"$f":"IF(ISNA(IF(VLOOKUP(A1310,Draft!E:E,1,FALSE)=A1310,\"Yes\")),\"\",IF(VLOOKUP(A1310,Draft!E:E,1,FALSE)=A1310,\"Yes\"))","v":""}]
[1306,"Williams, Randy",{"$f":"IF(ISNA(IF(VLOOKUP(A1311,Draft!E:E,1,FALSE)=A1311,\"Yes\")),\"\",IF(VLOOKUP(A1311,Draft!E:E,1,FALSE)=A1311,\"Yes\"))","v":""}]
[1307,"Logan, Boone",{"$f":"IF(ISNA(IF(VLOOKUP(A1312,Draft!E:E,1,FALSE)=A1312,\"Yes\")),\"\",IF(VLOOKUP(A1312,Draft!E:E,1,FALSE)=A1312,\"Yes\"))","v":""}]
[1308,"Aquino, Greg",{"$f":"IF(ISNA(IF(VLOOKUP(A1313,Draft!E:E,1,FALSE)=A1313,\"Yes\")),\"\",IF(VLOOKUP(A1313,Draft!E:E,1,FALSE)=A1313,\"Yes\"))","v":""}]
[1309,"Henn, Sean",{"$f":"IF(ISNA(IF(VLOOKUP(A1314,Draft!E:E,1,FALSE)=A1314,\"Yes\")),\"\",IF(VLOOKUP(A1314,Draft!E:E,1,FALSE)=A1314,\"Yes\"))","v":""}]
[1310,"Mickolio, Kameron",{"$f":"IF(ISNA(IF(VLOOKUP(A1315,Draft!E:E,1,FALSE)=A1315,\"Yes\")),\"\",IF(VLOOKUP(A1315,Draft!E:E,1,FALSE)=A1315,\"Yes\"))","v":""}]
[1311,"Thayer, Dale",{"$f":"IF(ISNA(IF(VLOOKUP(A1316,Draft!E:E,1,FALSE)=A1316,\"Yes\")),\"\",IF(VLOOKUP(A1316,Draft!E:E,1,FALSE)=A1316,\"Yes\"))","v":""}]
[1312,"Marte, Damaso",{"$f":"IF(ISNA(IF(VLOOKUP(A1317,Draft!E:E,1,FALSE)=A1317,\"Yes\")),\"\",IF(VLOOKUP(A1317,Draft!E:E,1,FALSE)=A1317,\"Yes\"))","v":""}]
[1313,"Madrigal, Warner",{"$f":"IF(ISNA(IF(VLOOKUP(A1318,Draft!E:E,1,FALSE)=A1318,\"Yes\")),\"\",IF(VLOOKUP(A1318,Draft!E:E,1,FALSE)=A1318,\"Yes\"))","v":""}]
[1314,"Castillo, Alberto",{"$f":"IF(ISNA(IF(VLOOKUP(A1319,Draft!E:E,1,FALSE)=A1319,\"Yes\")),\"\",IF(VLOOKUP(A1319,Draft!E:E,1,FALSE)=A1319,\"Yes\"))","v":""}]
[1315,"Marte, Victor",{"$f":"IF(ISNA(IF(VLOOKUP(A1320,Draft!E:E,1,FALSE)=A1320,\"Yes\")),\"\",IF(VLOOKUP(A1320,Draft!E:E,1,FALSE)=A1320,\"Yes\"))","v":""}]
[1316,"Fien, Casey",{"$f":"IF(ISNA(IF(VLOOKUP(A1321,Draft!E:E,1,FALSE)=A1321,\"Yes\")),\"\",IF(VLOOKUP(A1321,Draft!E:E,1,FALSE)=A1321,\"Yes\"))","v":""}]
[1317,"Dolsi, Freddy",{"$f":"IF(ISNA(IF(VLOOKUP(A1322,Draft!E:E,1,FALSE)=A1322,\"Yes\")),\"\",IF(VLOOKUP(A1322,Draft!E:E,1,FALSE)=A1322,\"Yes\"))","v":""}]
[1318,"Rosa, Carlos",{"$f":"IF(ISNA(IF(VLOOKUP(A1323,Draft!E:E,1,FALSE)=A1323,\"Yes\")),\"\",IF(VLOOKUP(A1323,Draft!E:E,1,FALSE)=A1323,\"Yes\"))","v":""}]
[1319,"Strop, Pedro",{"$f":"IF(ISNA(IF(VLOOKUP(A1324,Draft!E:E,1,FALSE)=A1324,\"Yes\")),\"\",IF(VLOOKUP(A1324,Draft!E:E,1,FALSE)=A1324,\"Yes\"))","v":""}]
[1320,"Swindle, R.J.",{"$f":"IF(ISNA(IF(VLOOKUP(A1325,Draft!E:E,1,FALSE)=A1325,\"Yes\")),\"\",IF(VLOOKUP(A1325,Draft!E:E,1,FALSE)=A1325,\"Yes\"))","v":""}]
[1321,"Abreu, Winston",{"$f":"IF(ISNA(IF(VLOOKUP(A1326,Draft!E:E,1,FALSE)=A1326,\"Yes\")),\"\",IF(VLOOKUP(A1326,Draft!E:E,1,FALSE)=A1326,\"Yes\"))","v":""}]
[1322,"Nunez, Jhonny",{"$f":"IF(ISNA(IF(VLOOKUP(A1327,Draft!E:E,1,FALSE)=A1327,\"Yes\")),\"\",IF(VLOOKUP(A1327,Draft!E:E,1,FALSE)=A1327,\"Yes\"))","v":""}]
[1323,"Manuel, Robert",{"$f":"IF(ISNA(IF(VLOOKUP(A1328,Draft!E:E,1,FALSE)=A1328,\"Yes\")),\"\",IF(VLOOKUP(A1328,Draft!E:E,1,FALSE)=A1328,\"Yes\"))","v":""}]
[1324,"Rodriguez, Henry",{"$f":"IF(ISNA(IF(VLOOKUP(A1329,Draft!E:E,1,FALSE)=A1329,\"Yes\")),\"\",IF(VLOOKUP(A1329,Draft!E:E,1,FALSE)=A1329,\"Yes\"))","v":""}]
[1325,"Rapada, Clay",{"$f":"IF(ISNA(IF(VLOOKUP(A1330,Draft!E:E,1,FALSE)=A1330,\"Yes\")),\"\",IF(VLOOKUP(A1330,Draft!E:E,1,FALSE)=A1330,\"Yes\"))","v":""}]
[1326,"Richardson, Dustin",{"$f":"IF(ISNA(IF(VLOOKUP(A1331,Draft!E:E,1,FALSE)=A1331,\"Yes\")),\"\",IF(VLOOKUP(A1331,Draft!E:E,1,FALSE)=A1331,\"Yes\"))","v":""}]
[1327,"Mosebach, Bobby",{"$f":"IF(ISNA(IF(VLOOKUP(A1332,Draft!E:E,1,FALSE)=A1332,\"Yes\")),\"\",IF(VLOOKUP(A1332,Draft!E:E,1,FALSE)=A1332,\"Yes\"))","v":""}]
[1328,"Rodriguez, Fernando",{"$f":"IF(ISNA(IF(VLOOKUP(A1333,Draft!E:E,1,FALSE)=A1333,\"Yes\")),\"\",IF(VLOOKUP(A1333,Draft!E:E,1,FALSE)=A1333,\"Yes\"))","v":""}]
[1329,"Cordero, Chad",{"$f":"IF(ISNA(IF(VLOOKUP(A1334,Draft!E:E,1,FALSE)=A1334,\"Yes\")),\"\",IF(VLOOKUP(A1334,Draft!E:E,1,FALSE)=A1334,\"Yes\"))","v":""}]
[1330,"Lewis, Colby",{"$f":"IF(ISNA(IF(VLOOKUP(A1335,Draft!E:E,1,FALSE)=A1335,\"Yes\")),\"\",IF(VLOOKUP(A1335,Draft!E:E,1,FALSE)=A1335,\"Yes\"))","v":""}]
[1331,"Neshek, Pat",{"$f":"IF(ISNA(IF(VLOOKUP(A1336,Draft!E:E,1,FALSE)=A1336,\"Yes\")),\"\",IF(VLOOKUP(A1336,Draft!E:E,1,FALSE)=A1336,\"Yes\"))","v":""}]
[1332,"Devine, Joey",{"$f":"IF(ISNA(IF(VLOOKUP(A1337,Draft!E:E,1,FALSE)=A1337,\"Yes\")),\"\",IF(VLOOKUP(A1337,Draft!E:E,1,FALSE)=A1337,\"Yes\"))","v":""}]
[1333,"Mcbeth, Marcus",{"$f":"IF(ISNA(IF(VLOOKUP(A1338,Draft!E:E,1,FALSE)=A1338,\"Yes\")),\"\",IF(VLOOKUP(A1338,Draft!E:E,1,FALSE)=A1338,\"Yes\"))","v":""}]
[1334,"Bowers, Cedrick",{"$f":"IF(ISNA(IF(VLOOKUP(A1339,Draft!E:E,1,FALSE)=A1339,\"Yes\")),\"\",IF(VLOOKUP(A1339,Draft!E:E,1,FALSE)=A1339,\"Yes\"))","v":""}]
[1335,"Hernandez, Fernando",{"$f":"IF(ISNA(IF(VLOOKUP(A1340,Draft!E:E,1,FALSE)=A1340,\"Yes\")),\"\",IF(VLOOKUP(A1340,Draft!E:E,1,FALSE)=A1340,\"Yes\"))","v":""}]
[1336,"Slama, Anthony",{"$f":"IF(ISNA(IF(VLOOKUP(A1341,Draft!E:E,1,FALSE)=A1341,\"Yes\")),\"\",IF(VLOOKUP(A1341,Draft!E:E,1,FALSE)=A1341,\"Yes\"))","v":""}]
[1337,"Delaney, Robert",{"$f":"IF(ISNA(IF(VLOOKUP(A1342,Draft!E:E,1,FALSE)=A1342,\"Yes\")),\"\",IF(VLOOKUP(A1342,Draft!E:E,1,FALSE)=A1342,\"Yes\"))","v":""}]
[1338,"Cassevah, Robert",{"$f":"IF(ISNA(IF(VLOOKUP(A1343,Draft!E:E,1,FALSE)=A1343,\"Yes\")),\"\",IF(VLOOKUP(A1343,Draft!E:E,1,FALSE)=A1343,\"Yes\"))","v":""}]
[1339,"Martinez, Victor",{"$f":"IF(ISNA(IF(VLOOKUP(A1344,Draft!E:E,1,FALSE)=A1344,\"Yes\")),\"\",IF(VLOOKUP(A1344,Draft!E:E,1,FALSE)=A1344,\"Yes\"))","v":""}]
[1340,"Suzuki, Kurt",{"$f":"IF(ISNA(IF(VLOOKUP(A1345,Draft!E:E,1,FALSE)=A1345,\"Yes\")),\"\",IF(VLOOKUP(A1345,Draft!E:E,1,FALSE)=A1345,\"Yes\"))","v":""}]
[1341,"Mauer, Joe",{"$f":"IF(ISNA(IF(VLOOKUP(A1346,Draft!E:E,1,FALSE)=A1346,\"Yes\")),\"\",IF(VLOOKUP(A1346,Draft!E:E,1,FALSE)=A1346,\"Yes\"))","v":""}]
[1342,"Pierzynski, A.J.",{"$f":"IF(ISNA(IF(VLOOKUP(A1347,Draft!E:E,1,FALSE)=A1347,\"Yes\")),\"\",IF(VLOOKUP(A1347,Draft!E:E,1,FALSE)=A1347,\"Yes\"))","v":""}]
[1343,"Kendall, Jason",{"$f":"IF(ISNA(IF(VLOOKUP(A1348,Draft!E:E,1,FALSE)=A1348,\"Yes\")),\"\",IF(VLOOKUP(A1348,Draft!E:E,1,FALSE)=A1348,\"Yes\"))","v":""}]
[1344,"Laird, Gerald",{"$f":"IF(ISNA(IF(VLOOKUP(A1349,Draft!E:E,1,FALSE)=A1349,\"Yes\")),\"\",IF(VLOOKUP(A1349,Draft!E:E,1,FALSE)=A1349,\"Yes\"))","v":""}]
[1345,"Posada, Jorge",{"$f":"IF(ISNA(IF(VLOOKUP(A1350,Draft!E:E,1,FALSE)=A1350,\"Yes\")),\"\",IF(VLOOKUP(A1350,Draft!E:E,1,FALSE)=A1350,\"Yes\"))","v":""}]
[1346,"Napoli, Mike",{"$f":"IF(ISNA(IF(VLOOKUP(A1351,Draft!E:E,1,FALSE)=A1351,\"Yes\")),\"\",IF(VLOOKUP(A1351,Draft!E:E,1,FALSE)=A1351,\"Yes\"))","v":""}]
[1347,"Varitek, Jason",{"$f":"IF(ISNA(IF(VLOOKUP(A1352,Draft!E:E,1,FALSE)=A1352,\"Yes\")),\"\",IF(VLOOKUP(A1352,Draft!E:E,1,FALSE)=A1352,\"Yes\"))","v":""}]
[1348,"Navarro, Dioner",{"$f":"IF(ISNA(IF(VLOOKUP(A1353,Draft!E:E,1,FALSE)=A1353,\"Yes\")),\"\",IF(VLOOKUP(A1353,Draft!E:E,1,FALSE)=A1353,\"Yes\"))","v":""}]
[1349,"Wieters, Matt",{"$f":"IF(ISNA(IF(VLOOKUP(A1354,Draft!E:E,1,FALSE)=A1354,\"Yes\")),\"\",IF(VLOOKUP(A1354,Draft!E:E,1,FALSE)=A1354,\"Yes\"))","v":""}]
[1350,"Shoppach, Kelly",{"$f":"IF(ISNA(IF(VLOOKUP(A1355,Draft!E:E,1,FALSE)=A1355,\"Yes\")),\"\",IF(VLOOKUP(A1355,Draft!E:E,1,FALSE)=A1355,\"Yes\"))","v":""}]
[1351,"Saltalamacchia, Jarrod",{"$f":"IF(ISNA(IF(VLOOKUP(A1356,Draft!E:E,1,FALSE)=A1356,\"Yes\")),\"\",IF(VLOOKUP(A1356,Draft!E:E,1,FALSE)=A1356,\"Yes\"))","v":""}]
[1352,"Bard, Josh",{"$f":"IF(ISNA(IF(VLOOKUP(A1357,Draft!E:E,1,FALSE)=A1357,\"Yes\")),\"\",IF(VLOOKUP(A1357,Draft!E:E,1,FALSE)=A1357,\"Yes\"))","v":""}]
[1353,"Johnson, Rob",{"$f":"IF(ISNA(IF(VLOOKUP(A1358,Draft!E:E,1,FALSE)=A1358,\"Yes\")),\"\",IF(VLOOKUP(A1358,Draft!E:E,1,FALSE)=A1358,\"Yes\"))","v":""}]
[1354,"Mathis, Jeff",{"$f":"IF(ISNA(IF(VLOOKUP(A1359,Draft!E:E,1,FALSE)=A1359,\"Yes\")),\"\",IF(VLOOKUP(A1359,Draft!E:E,1,FALSE)=A1359,\"Yes\"))","v":""}]
[1355,"Teagarden, Taylor",{"$f":"IF(ISNA(IF(VLOOKUP(A1360,Draft!E:E,1,FALSE)=A1360,\"Yes\")),\"\",IF(VLOOKUP(A1360,Draft!E:E,1,FALSE)=A1360,\"Yes\"))","v":""}]
[1356,"Buck, John",{"$f":"IF(ISNA(IF(VLOOKUP(A1361,Draft!E:E,1,FALSE)=A1361,\"Yes\")),\"\",IF(VLOOKUP(A1361,Draft!E:E,1,FALSE)=A1361,\"Yes\"))","v":""}]
[1357,"Pena, Brayan",{"$f":"IF(ISNA(IF(VLOOKUP(A1362,Draft!E:E,1,FALSE)=A1362,\"Yes\")),\"\",IF(VLOOKUP(A1362,Draft!E:E,1,FALSE)=A1362,\"Yes\"))","v":""}]
[1358,"Castro, Ramon",{"$f":"IF(ISNA(IF(VLOOKUP(A1363,Draft!E:E,1,FALSE)=A1363,\"Yes\")),\"\",IF(VLOOKUP(A1363,Draft!E:E,1,FALSE)=A1363,\"Yes\"))","v":""}]
[1359,"Chavez, Raul",{"$f":"IF(ISNA(IF(VLOOKUP(A1364,Draft!E:E,1,FALSE)=A1364,\"Yes\")),\"\",IF(VLOOKUP(A1364,Draft!E:E,1,FALSE)=A1364,\"Yes\"))","v":""}]
[1360,"Powell, Landon",{"$f":"IF(ISNA(IF(VLOOKUP(A1365,Draft!E:E,1,FALSE)=A1365,\"Yes\")),\"\",IF(VLOOKUP(A1365,Draft!E:E,1,FALSE)=A1365,\"Yes\"))","v":""}]
[1361,"Redmond, Mike",{"$f":"IF(ISNA(IF(VLOOKUP(A1366,Draft!E:E,1,FALSE)=A1366,\"Yes\")),\"\",IF(VLOOKUP(A1366,Draft!E:E,1,FALSE)=A1366,\"Yes\"))","v":""}]
[1362,"Rivera, Mike",{"$f":"IF(ISNA(IF(VLOOKUP(A1367,Draft!E:E,1,FALSE)=A1367,\"Yes\")),\"\",IF(VLOOKUP(A1367,Draft!E:E,1,FALSE)=A1367,\"Yes\"))","v":""}]
[1363,"Morales, Jose",{"$f":"IF(ISNA(IF(VLOOKUP(A1368,Draft!E:E,1,FALSE)=A1368,\"Yes\")),\"\",IF(VLOOKUP(A1368,Draft!E:E,1,FALSE)=A1368,\"Yes\"))","v":""}]
[1364,"Hernandez, Michel",{"$f":"IF(ISNA(IF(VLOOKUP(A1369,Draft!E:E,1,FALSE)=A1369,\"Yes\")),\"\",IF(VLOOKUP(A1369,Draft!E:E,1,FALSE)=A1369,\"Yes\"))","v":""}]
[1365,"Cervelli, Francisco",{"$f":"IF(ISNA(IF(VLOOKUP(A1370,Draft!E:E,1,FALSE)=A1370,\"Yes\")),\"\",IF(VLOOKUP(A1370,Draft!E:E,1,FALSE)=A1370,\"Yes\"))","v":""}]
[1366,"Tatum, Craig",{"$f":"IF(ISNA(IF(VLOOKUP(A1371,Draft!E:E,1,FALSE)=A1371,\"Yes\")),\"\",IF(VLOOKUP(A1371,Draft!E:E,1,FALSE)=A1371,\"Yes\"))","v":""}]
[1367,"Marson, Lou",{"$f":"IF(ISNA(IF(VLOOKUP(A1372,Draft!E:E,1,FALSE)=A1372,\"Yes\")),\"\",IF(VLOOKUP(A1372,Draft!E:E,1,FALSE)=A1372,\"Yes\"))","v":"Yes"}]
[1368,"Avila, Alex",{"$f":"IF(ISNA(IF(VLOOKUP(A1373,Draft!E:E,1,FALSE)=A1373,\"Yes\")),\"\",IF(VLOOKUP(A1373,Draft!E:E,1,FALSE)=A1373,\"Yes\"))","v":""}]
[1369,"Toregas, Wyatt",{"$f":"IF(ISNA(IF(VLOOKUP(A1374,Draft!E:E,1,FALSE)=A1374,\"Yes\")),\"\",IF(VLOOKUP(A1374,Draft!E:E,1,FALSE)=A1374,\"Yes\"))","v":""}]
[1370,"Moore, Adam",{"$f":"IF(ISNA(IF(VLOOKUP(A1375,Draft!E:E,1,FALSE)=A1375,\"Yes\")),\"\",IF(VLOOKUP(A1375,Draft!E:E,1,FALSE)=A1375,\"Yes\"))","v":""}]
[1371,"Flowers, Tyler",{"$f":"IF(ISNA(IF(VLOOKUP(A1376,Draft!E:E,1,FALSE)=A1376,\"Yes\")),\"\",IF(VLOOKUP(A1376,Draft!E:E,1,FALSE)=A1376,\"Yes\"))","v":""}]
[1372,"Lobaton, Jose",{"$f":"IF(ISNA(IF(VLOOKUP(A1377,Draft!E:E,1,FALSE)=A1377,\"Yes\")),\"\",IF(VLOOKUP(A1377,Draft!E:E,1,FALSE)=A1377,\"Yes\"))","v":""}]
[1373,"Bellorin, Edwin",{"$f":"IF(ISNA(IF(VLOOKUP(A1378,Draft!E:E,1,FALSE)=A1378,\"Yes\")),\"\",IF(VLOOKUP(A1378,Draft!E:E,1,FALSE)=A1378,\"Yes\"))","v":""}]
[1374,"Richardson, Kevin",{"$f":"IF(ISNA(IF(VLOOKUP(A1379,Draft!E:E,1,FALSE)=A1379,\"Yes\")),\"\",IF(VLOOKUP(A1379,Draft!E:E,1,FALSE)=A1379,\"Yes\"))","v":""}]
[1375,"Wilson, Bobby",{"$f":"IF(ISNA(IF(VLOOKUP(A1380,Draft!E:E,1,FALSE)=A1380,\"Yes\")),\"\",IF(VLOOKUP(A1380,Draft!E:E,1,FALSE)=A1380,\"Yes\"))","v":""}]
[1376,"Brown, Dustin",{"$f":"IF(ISNA(IF(VLOOKUP(A1381,Draft!E:E,1,FALSE)=A1381,\"Yes\")),\"\",IF(VLOOKUP(A1381,Draft!E:E,1,FALSE)=A1381,\"Yes\"))","v":""}]
[1377,"Budde, Ryan",{"$f":"IF(ISNA(IF(VLOOKUP(A1382,Draft!E:E,1,FALSE)=A1382,\"Yes\")),\"\",IF(VLOOKUP(A1382,Draft!E:E,1,FALSE)=A1382,\"Yes\"))","v":""}]
[1378,"Wilson, Vance",{"$f":"IF(ISNA(IF(VLOOKUP(A1383,Draft!E:E,1,FALSE)=A1383,\"Yes\")),\"\",IF(VLOOKUP(A1383,Draft!E:E,1,FALSE)=A1383,\"Yes\"))","v":""}]
[1379,"Ramirez, Max",{"$f":"IF(ISNA(IF(VLOOKUP(A1384,Draft!E:E,1,FALSE)=A1384,\"Yes\")),\"\",IF(VLOOKUP(A1384,Draft!E:E,1,FALSE)=A1384,\"Yes\"))","v":""}]
[1380,"Jaso, John",{"$f":"IF(ISNA(IF(VLOOKUP(A1385,Draft!E:E,1,FALSE)=A1385,\"Yes\")),\"\",IF(VLOOKUP(A1385,Draft!E:E,1,FALSE)=A1385,\"Yes\"))","v":""}]
[1381,"Wagner, Mark",{"$f":"IF(ISNA(IF(VLOOKUP(A1386,Draft!E:E,1,FALSE)=A1386,\"Yes\")),\"\",IF(VLOOKUP(A1386,Draft!E:E,1,FALSE)=A1386,\"Yes\"))","v":""}]
[1382,"Conger, Hank",{"$f":"IF(ISNA(IF(VLOOKUP(A1387,Draft!E:E,1,FALSE)=A1387,\"Yes\")),\"\",IF(VLOOKUP(A1387,Draft!E:E,1,FALSE)=A1387,\"Yes\"))","v":""}]
[1383,"Armstrong, Cole",{"$f":"IF(ISNA(IF(VLOOKUP(A1388,Draft!E:E,1,FALSE)=A1388,\"Yes\")),\"\",IF(VLOOKUP(A1388,Draft!E:E,1,FALSE)=A1388,\"Yes\"))","v":""}]
[1384,"Phegley, Joshua",{"$f":"IF(ISNA(IF(VLOOKUP(A1389,Draft!E:E,1,FALSE)=A1389,\"Yes\")),\"\",IF(VLOOKUP(A1389,Draft!E:E,1,FALSE)=A1389,\"Yes\"))","v":""}]
[1385,"Santana, Carlos",{"$f":"IF(ISNA(IF(VLOOKUP(A1390,Draft!E:E,1,FALSE)=A1390,\"Yes\")),\"\",IF(VLOOKUP(A1390,Draft!E:E,1,FALSE)=A1390,\"Yes\"))","v":""}]
[1386,"Pina, Manny",{"$f":"IF(ISNA(IF(VLOOKUP(A1391,Draft!E:E,1,FALSE)=A1391,\"Yes\")),\"\",IF(VLOOKUP(A1391,Draft!E:E,1,FALSE)=A1391,\"Yes\"))","v":""}]
[1387,"Myers, William",{"$f":"IF(ISNA(IF(VLOOKUP(A1392,Draft!E:E,1,FALSE)=A1392,\"Yes\")),\"\",IF(VLOOKUP(A1392,Draft!E:E,1,FALSE)=A1392,\"Yes\"))","v":""}]
[1388,"Lerud, Steve",{"$f":"IF(ISNA(IF(VLOOKUP(A1393,Draft!E:E,1,FALSE)=A1393,\"Yes\")),\"\",IF(VLOOKUP(A1393,Draft!E:E,1,FALSE)=A1393,\"Yes\"))","v":""}]
[1389,"Ramos, Wilson",{"$f":"IF(ISNA(IF(VLOOKUP(A1394,Draft!E:E,1,FALSE)=A1394,\"Yes\")),\"\",IF(VLOOKUP(A1394,Draft!E:E,1,FALSE)=A1394,\"Yes\"))","v":""}]
[1390,"Butera, Drew",{"$f":"IF(ISNA(IF(VLOOKUP(A1395,Draft!E:E,1,FALSE)=A1395,\"Yes\")),\"\",IF(VLOOKUP(A1395,Draft!E:E,1,FALSE)=A1395,\"Yes\"))","v":""}]
[1391,"Montero, Jesus",{"$f":"IF(ISNA(IF(VLOOKUP(A1396,Draft!E:E,1,FALSE)=A1396,\"Yes\")),\"\",IF(VLOOKUP(A1396,Draft!E:E,1,FALSE)=A1396,\"Yes\"))","v":""}]
[1392,"Romine, Austin",{"$f":"IF(ISNA(IF(VLOOKUP(A1397,Draft!E:E,1,FALSE)=A1397,\"Yes\")),\"\",IF(VLOOKUP(A1397,Draft!E:E,1,FALSE)=A1397,\"Yes\"))","v":""}]
[1393,"Murphy, John",{"$f":"IF(ISNA(IF(VLOOKUP(A1398,Draft!E:E,1,FALSE)=A1398,\"Yes\")),\"\",IF(VLOOKUP(A1398,Draft!E:E,1,FALSE)=A1398,\"Yes\"))","v":""}]
[1394,"Donaldson, Joshua",{"$f":"IF(ISNA(IF(VLOOKUP(A1399,Draft!E:E,1,FALSE)=A1399,\"Yes\")),\"\",IF(VLOOKUP(A1399,Draft!E:E,1,FALSE)=A1399,\"Yes\"))","v":""}]
[1395,"Stassi, Max",{"$f":"IF(ISNA(IF(VLOOKUP(A1400,Draft!E:E,1,FALSE)=A1400,\"Yes\")),\"\",IF(VLOOKUP(A1400,Draft!E:E,1,FALSE)=A1400,\"Yes\"))","v":""}]
[1396,"Baron, Steven",{"$f":"IF(ISNA(IF(VLOOKUP(A1401,Draft!E:E,1,FALSE)=A1401,\"Yes\")),\"\",IF(VLOOKUP(A1401,Draft!E:E,1,FALSE)=A1401,\"Yes\"))","v":""}]
[1397,"Arencibia, Jonathan",{"$f":"IF(ISNA(IF(VLOOKUP(A1402,Draft!E:E,1,FALSE)=A1402,\"Yes\")),\"\",IF(VLOOKUP(A1402,Draft!E:E,1,FALSE)=A1402,\"Yes\"))","v":""}]
[1398,"D'Arnaud, Travis",{"$f":"IF(ISNA(IF(VLOOKUP(A1403,Draft!E:E,1,FALSE)=A1403,\"Yes\")),\"\",IF(VLOOKUP(A1403,Draft!E:E,1,FALSE)=A1403,\"Yes\"))","v":""}]
[1399,"Teixeira, Mark",{"$f":"IF(ISNA(IF(VLOOKUP(A1404,Draft!E:E,1,FALSE)=A1404,\"Yes\")),\"\",IF(VLOOKUP(A1404,Draft!E:E,1,FALSE)=A1404,\"Yes\"))","v":"Yes"}]
[1400,"Cabrera, Miguel",{"$f":"IF(ISNA(IF(VLOOKUP(A1405,Draft!E:E,1,FALSE)=A1405,\"Yes\")),\"\",IF(VLOOKUP(A1405,Draft!E:E,1,FALSE)=A1405,\"Yes\"))","v":"Yes"}]
[1401,"Butler, Billy",{"$f":"IF(ISNA(IF(VLOOKUP(A1406,Draft!E:E,1,FALSE)=A1406,\"Yes\")),\"\",IF(VLOOKUP(A1406,Draft!E:E,1,FALSE)=A1406,\"Yes\"))","v":""}]
[1402,"Ortiz, David",{"$f":"IF(ISNA(IF(VLOOKUP(A1407,Draft!E:E,1,FALSE)=A1407,\"Yes\")),\"\",IF(VLOOKUP(A1407,Draft!E:E,1,FALSE)=A1407,\"Yes\"))","v":""}]
[1403,"Konerko, Paul",{"$f":"IF(ISNA(IF(VLOOKUP(A1408,Draft!E:E,1,FALSE)=A1408,\"Yes\")),\"\",IF(VLOOKUP(A1408,Draft!E:E,1,FALSE)=A1408,\"Yes\"))","v":""}]
[1404,"Morales, Kendry",{"$f":"IF(ISNA(IF(VLOOKUP(A1409,Draft!E:E,1,FALSE)=A1409,\"Yes\")),\"\",IF(VLOOKUP(A1409,Draft!E:E,1,FALSE)=A1409,\"Yes\"))","v":""}]
[1405,"Morneau, Justin",{"$f":"IF(ISNA(IF(VLOOKUP(A1410,Draft!E:E,1,FALSE)=A1410,\"Yes\")),\"\",IF(VLOOKUP(A1410,Draft!E:E,1,FALSE)=A1410,\"Yes\"))","v":""}]
[1406,"Johnson, Nick",{"$f":"IF(ISNA(IF(VLOOKUP(A1411,Draft!E:E,1,FALSE)=A1411,\"Yes\")),\"\",IF(VLOOKUP(A1411,Draft!E:E,1,FALSE)=A1411,\"Yes\"))","v":""}]
[1407,"Pena, Carlos",{"$f":"IF(ISNA(IF(VLOOKUP(A1412,Draft!E:E,1,FALSE)=A1412,\"Yes\")),\"\",IF(VLOOKUP(A1412,Draft!E:E,1,FALSE)=A1412,\"Yes\"))","v":""}]
[1408,"Overbay, Lyle",{"$f":"IF(ISNA(IF(VLOOKUP(A1413,Draft!E:E,1,FALSE)=A1413,\"Yes\")),\"\",IF(VLOOKUP(A1413,Draft!E:E,1,FALSE)=A1413,\"Yes\"))","v":""}]
[1409,"Kotchman, Casey",{"$f":"IF(ISNA(IF(VLOOKUP(A1414,Draft!E:E,1,FALSE)=A1414,\"Yes\")),\"\",IF(VLOOKUP(A1414,Draft!E:E,1,FALSE)=A1414,\"Yes\"))","v":""}]
[1410,"Davis, Christopher",{"$f":"IF(ISNA(IF(VLOOKUP(A1415,Draft!E:E,1,FALSE)=A1415,\"Yes\")),\"\",IF(VLOOKUP(A1415,Draft!E:E,1,FALSE)=A1415,\"Yes\"))","v":""}]
[1411,"Hafner, Travis",{"$f":"IF(ISNA(IF(VLOOKUP(A1416,Draft!E:E,1,FALSE)=A1416,\"Yes\")),\"\",IF(VLOOKUP(A1416,Draft!E:E,1,FALSE)=A1416,\"Yes\"))","v":""}]
[1412,"Barton, Daric",{"$f":"IF(ISNA(IF(VLOOKUP(A1417,Draft!E:E,1,FALSE)=A1417,\"Yes\")),\"\",IF(VLOOKUP(A1417,Draft!E:E,1,FALSE)=A1417,\"Yes\"))","v":""}]
[1413,"Marte, Andy",{"$f":"IF(ISNA(IF(VLOOKUP(A1418,Draft!E:E,1,FALSE)=A1418,\"Yes\")),\"\",IF(VLOOKUP(A1418,Draft!E:E,1,FALSE)=A1418,\"Yes\"))","v":""}]
[1414,"Ruiz, Randy",{"$f":"IF(ISNA(IF(VLOOKUP(A1419,Draft!E:E,1,FALSE)=A1419,\"Yes\")),\"\",IF(VLOOKUP(A1419,Draft!E:E,1,FALSE)=A1419,\"Yes\"))","v":""}]
[1415,"Gimenez, Christopher",{"$f":"IF(ISNA(IF(VLOOKUP(A1420,Draft!E:E,1,FALSE)=A1420,\"Yes\")),\"\",IF(VLOOKUP(A1420,Draft!E:E,1,FALSE)=A1420,\"Yes\"))","v":""}]
[1416,"Aubrey, Michael",{"$f":"IF(ISNA(IF(VLOOKUP(A1421,Draft!E:E,1,FALSE)=A1421,\"Yes\")),\"\",IF(VLOOKUP(A1421,Draft!E:E,1,FALSE)=A1421,\"Yes\"))","v":""}]
[1417,"Everidge, Tommy",{"$f":"IF(ISNA(IF(VLOOKUP(A1422,Draft!E:E,1,FALSE)=A1422,\"Yes\")),\"\",IF(VLOOKUP(A1422,Draft!E:E,1,FALSE)=A1422,\"Yes\"))","v":""}]
[1418,"Larish, Jeff",{"$f":"IF(ISNA(IF(VLOOKUP(A1423,Draft!E:E,1,FALSE)=A1423,\"Yes\")),\"\",IF(VLOOKUP(A1423,Draft!E:E,1,FALSE)=A1423,\"Yes\"))","v":""}]
[1419,"Carp, Mike",{"$f":"IF(ISNA(IF(VLOOKUP(A1424,Draft!E:E,1,FALSE)=A1424,\"Yes\")),\"\",IF(VLOOKUP(A1424,Draft!E:E,1,FALSE)=A1424,\"Yes\"))","v":""}]
[1420,"Richard, Chris",{"$f":"IF(ISNA(IF(VLOOKUP(A1425,Draft!E:E,1,FALSE)=A1425,\"Yes\")),\"\",IF(VLOOKUP(A1425,Draft!E:E,1,FALSE)=A1425,\"Yes\"))","v":""}]
[1421,"Nelson, Brad",{"$f":"IF(ISNA(IF(VLOOKUP(A1426,Draft!E:E,1,FALSE)=A1426,\"Yes\")),\"\",IF(VLOOKUP(A1426,Draft!E:E,1,FALSE)=A1426,\"Yes\"))","v":""}]
[1422,"Bates, Aaron",{"$f":"IF(ISNA(IF(VLOOKUP(A1427,Draft!E:E,1,FALSE)=A1427,\"Yes\")),\"\",IF(VLOOKUP(A1427,Draft!E:E,1,FALSE)=A1427,\"Yes\"))","v":""}]
[1423,"Miranda, Juan",{"$f":"IF(ISNA(IF(VLOOKUP(A1428,Draft!E:E,1,FALSE)=A1428,\"Yes\")),\"\",IF(VLOOKUP(A1428,Draft!E:E,1,FALSE)=A1428,\"Yes\"))","v":""}]
[1424,"Shealy, Ryan",{"$f":"IF(ISNA(IF(VLOOKUP(A1429,Draft!E:E,1,FALSE)=A1429,\"Yes\")),\"\",IF(VLOOKUP(A1429,Draft!E:E,1,FALSE)=A1429,\"Yes\"))","v":""}]
[1425,"Ka'aihue, Kila",{"$f":"IF(ISNA(IF(VLOOKUP(A1430,Draft!E:E,1,FALSE)=A1430,\"Yes\")),\"\",IF(VLOOKUP(A1430,Draft!E:E,1,FALSE)=A1430,\"Yes\"))","v":""}]
[1426,"Snyder, Brandon",{"$f":"IF(ISNA(IF(VLOOKUP(A1431,Draft!E:E,1,FALSE)=A1431,\"Yes\")),\"\",IF(VLOOKUP(A1431,Draft!E:E,1,FALSE)=A1431,\"Yes\"))","v":""}]
[1427,"Anderson, Lars",{"$f":"IF(ISNA(IF(VLOOKUP(A1432,Draft!E:E,1,FALSE)=A1432,\"Yes\")),\"\",IF(VLOOKUP(A1432,Draft!E:E,1,FALSE)=A1432,\"Yes\"))","v":""}]
[1428,"Rizzo, Anthony",{"$f":"IF(ISNA(IF(VLOOKUP(A1433,Draft!E:E,1,FALSE)=A1433,\"Yes\")),\"\",IF(VLOOKUP(A1433,Draft!E:E,1,FALSE)=A1433,\"Yes\"))","v":""}]
[1429,"Trumbo, Mark",{"$f":"IF(ISNA(IF(VLOOKUP(A1434,Draft!E:E,1,FALSE)=A1434,\"Yes\")),\"\",IF(VLOOKUP(A1434,Draft!E:E,1,FALSE)=A1434,\"Yes\"))","v":""}]
[1430,"Stokes, Jason",{"$f":"IF(ISNA(IF(VLOOKUP(A1435,Draft!E:E,1,FALSE)=A1435,\"Yes\")),\"\",IF(VLOOKUP(A1435,Draft!E:E,1,FALSE)=A1435,\"Yes\"))","v":""}]
[1431,"Strieby, Ryan",{"$f":"IF(ISNA(IF(VLOOKUP(A1436,Draft!E:E,1,FALSE)=A1436,\"Yes\")),\"\",IF(VLOOKUP(A1436,Draft!E:E,1,FALSE)=A1436,\"Yes\"))","v":""}]
[1432,"Hosmer, Eric",{"$f":"IF(ISNA(IF(VLOOKUP(A1437,Draft!E:E,1,FALSE)=A1437,\"Yes\")),\"\",IF(VLOOKUP(A1437,Draft!E:E,1,FALSE)=A1437,\"Yes\"))","v":""}]
[1433,"Carter(Oak), Chris",{"$f":"IF(ISNA(IF(VLOOKUP(A1438,Draft!E:E,1,FALSE)=A1438,\"Yes\")),\"\",IF(VLOOKUP(A1438,Draft!E:E,1,FALSE)=A1438,\"Yes\"))","v":""}]
[1434,"Whitney, Matt",{"$f":"IF(ISNA(IF(VLOOKUP(A1439,Draft!E:E,1,FALSE)=A1439,\"Yes\")),\"\",IF(VLOOKUP(A1439,Draft!E:E,1,FALSE)=A1439,\"Yes\"))","v":""}]
[1435,"Poythress, Richard",{"$f":"IF(ISNA(IF(VLOOKUP(A1440,Draft!E:E,1,FALSE)=A1440,\"Yes\")),\"\",IF(VLOOKUP(A1440,Draft!E:E,1,FALSE)=A1440,\"Yes\"))","v":""}]
[1436,"Smoak, Justin",{"$f":"IF(ISNA(IF(VLOOKUP(A1441,Draft!E:E,1,FALSE)=A1441,\"Yes\")),\"\",IF(VLOOKUP(A1441,Draft!E:E,1,FALSE)=A1441,\"Yes\"))","v":""}]
[1437,"Cooper, David",{"$f":"IF(ISNA(IF(VLOOKUP(A1442,Draft!E:E,1,FALSE)=A1442,\"Yes\")),\"\",IF(VLOOKUP(A1442,Draft!E:E,1,FALSE)=A1442,\"Yes\"))","v":""}]
[1438,"Dopirak, Brian",{"$f":"IF(ISNA(IF(VLOOKUP(A1443,Draft!E:E,1,FALSE)=A1443,\"Yes\")),\"\",IF(VLOOKUP(A1443,Draft!E:E,1,FALSE)=A1443,\"Yes\"))","v":""}]
[1439,"Hill, Aaron",{"$f":"IF(ISNA(IF(VLOOKUP(A1444,Draft!E:E,1,FALSE)=A1444,\"Yes\")),\"\",IF(VLOOKUP(A1444,Draft!E:E,1,FALSE)=A1444,\"Yes\"))","v":""}]
[1440,"Roberts, Brian",{"$f":"IF(ISNA(IF(VLOOKUP(A1445,Draft!E:E,1,FALSE)=A1445,\"Yes\")),\"\",IF(VLOOKUP(A1445,Draft!E:E,1,FALSE)=A1445,\"Yes\"))","v":""}]
[1441,"Pedroia, Dustin",{"$f":"IF(ISNA(IF(VLOOKUP(A1446,Draft!E:E,1,FALSE)=A1446,\"Yes\")),\"\",IF(VLOOKUP(A1446,Draft!E:E,1,FALSE)=A1446,\"Yes\"))","v":""}]
[1442,"Cano, Robinson",{"$f":"IF(ISNA(IF(VLOOKUP(A1447,Draft!E:E,1,FALSE)=A1447,\"Yes\")),\"\",IF(VLOOKUP(A1447,Draft!E:E,1,FALSE)=A1447,\"Yes\"))","v":""}]
[1443,"Lopez, Jose",{"$f":"IF(ISNA(IF(VLOOKUP(A1448,Draft!E:E,1,FALSE)=A1448,\"Yes\")),\"\",IF(VLOOKUP(A1448,Draft!E:E,1,FALSE)=A1448,\"Yes\"))","v":""}]
[1444,"Kinsler, Ian",{"$f":"IF(ISNA(IF(VLOOKUP(A1449,Draft!E:E,1,FALSE)=A1449,\"Yes\")),\"\",IF(VLOOKUP(A1449,Draft!E:E,1,FALSE)=A1449,\"Yes\"))","v":""}]
[1445,"Callaspo, Alberto",{"$f":"IF(ISNA(IF(VLOOKUP(A1450,Draft!E:E,1,FALSE)=A1450,\"Yes\")),\"\",IF(VLOOKUP(A1450,Draft!E:E,1,FALSE)=A1450,\"Yes\"))","v":""}]
[1446,"Zobrist, Ben",{"$f":"IF(ISNA(IF(VLOOKUP(A1451,Draft!E:E,1,FALSE)=A1451,\"Yes\")),\"\",IF(VLOOKUP(A1451,Draft!E:E,1,FALSE)=A1451,\"Yes\"))","v":""}]
[1447,"Getz, Chris",{"$f":"IF(ISNA(IF(VLOOKUP(A1452,Draft!E:E,1,FALSE)=A1452,\"Yes\")),\"\",IF(VLOOKUP(A1452,Draft!E:E,1,FALSE)=A1452,\"Yes\"))","v":""}]
[1448,"Ellis, Mark",{"$f":"IF(ISNA(IF(VLOOKUP(A1453,Draft!E:E,1,FALSE)=A1453,\"Yes\")),\"\",IF(VLOOKUP(A1453,Draft!E:E,1,FALSE)=A1453,\"Yes\"))","v":""}]
[1449,"Kendrick, Howie",{"$f":"IF(ISNA(IF(VLOOKUP(A1454,Draft!E:E,1,FALSE)=A1454,\"Yes\")),\"\",IF(VLOOKUP(A1454,Draft!E:E,1,FALSE)=A1454,\"Yes\"))","v":""}]
[1450,"Valbuena, Luis",{"$f":"IF(ISNA(IF(VLOOKUP(A1455,Draft!E:E,1,FALSE)=A1455,\"Yes\")),\"\",IF(VLOOKUP(A1455,Draft!E:E,1,FALSE)=A1455,\"Yes\"))","v":""}]
[1451,"Aybar, Willy",{"$f":"IF(ISNA(IF(VLOOKUP(A1456,Draft!E:E,1,FALSE)=A1456,\"Yes\")),\"\",IF(VLOOKUP(A1456,Draft!E:E,1,FALSE)=A1456,\"Yes\"))","v":""}]
[1452,"Nix, Jayson",{"$f":"IF(ISNA(IF(VLOOKUP(A1457,Draft!E:E,1,FALSE)=A1457,\"Yes\")),\"\",IF(VLOOKUP(A1457,Draft!E:E,1,FALSE)=A1457,\"Yes\"))","v":""}]
[1453,"Casilla, Alexi",{"$f":"IF(ISNA(IF(VLOOKUP(A1458,Draft!E:E,1,FALSE)=A1458,\"Yes\")),\"\",IF(VLOOKUP(A1458,Draft!E:E,1,FALSE)=A1458,\"Yes\"))","v":""}]
[1454,"Tolbert, Matt",{"$f":"IF(ISNA(IF(VLOOKUP(A1459,Draft!E:E,1,FALSE)=A1459,\"Yes\")),\"\",IF(VLOOKUP(A1459,Draft!E:E,1,FALSE)=A1459,\"Yes\"))","v":""}]
[1455,"Miles, Aaron",{"$f":"IF(ISNA(IF(VLOOKUP(A1460,Draft!E:E,1,FALSE)=A1460,\"Yes\")),\"\",IF(VLOOKUP(A1460,Draft!E:E,1,FALSE)=A1460,\"Yes\"))","v":""}]
[1456,"German, Esteban",{"$f":"IF(ISNA(IF(VLOOKUP(A1461,Draft!E:E,1,FALSE)=A1461,\"Yes\")),\"\",IF(VLOOKUP(A1461,Draft!E:E,1,FALSE)=A1461,\"Yes\"))","v":""}]
[1457,"Rodriguez, Sean",{"$f":"IF(ISNA(IF(VLOOKUP(A1462,Draft!E:E,1,FALSE)=A1462,\"Yes\")),\"\",IF(VLOOKUP(A1462,Draft!E:E,1,FALSE)=A1462,\"Yes\"))","v":""}]
[1458,"Turner, Justin",{"$f":"IF(ISNA(IF(VLOOKUP(A1463,Draft!E:E,1,FALSE)=A1463,\"Yes\")),\"\",IF(VLOOKUP(A1463,Draft!E:E,1,FALSE)=A1463,\"Yes\"))","v":""}]
[1459,"Hulett, Tug(Tim)",{"$f":"IF(ISNA(IF(VLOOKUP(A1464,Draft!E:E,1,FALSE)=A1464,\"Yes\")),\"\",IF(VLOOKUP(A1464,Draft!E:E,1,FALSE)=A1464,\"Yes\"))","v":""}]
[1460,"Hoffpauir, Jarrett",{"$f":"IF(ISNA(IF(VLOOKUP(A1465,Draft!E:E,1,FALSE)=A1465,\"Yes\")),\"\",IF(VLOOKUP(A1465,Draft!E:E,1,FALSE)=A1465,\"Yes\"))","v":""}]
[1461,"Arias, Joaquin",{"$f":"IF(ISNA(IF(VLOOKUP(A1466,Draft!E:E,1,FALSE)=A1466,\"Yes\")),\"\",IF(VLOOKUP(A1466,Draft!E:E,1,FALSE)=A1466,\"Yes\"))","v":""}]
[1462,"McCoy, Mike",{"$f":"IF(ISNA(IF(VLOOKUP(A1467,Draft!E:E,1,FALSE)=A1467,\"Yes\")),\"\",IF(VLOOKUP(A1467,Draft!E:E,1,FALSE)=A1467,\"Yes\"))","v":""}]
[1463,"Grudzielanek, Mark",{"$f":"IF(ISNA(IF(VLOOKUP(A1468,Draft!E:E,1,FALSE)=A1468,\"Yes\")),\"\",IF(VLOOKUP(A1468,Draft!E:E,1,FALSE)=A1468,\"Yes\"))","v":""}]
[1464,"Johnson, Elliot",{"$f":"IF(ISNA(IF(VLOOKUP(A1469,Draft!E:E,1,FALSE)=A1469,\"Yes\")),\"\",IF(VLOOKUP(A1469,Draft!E:E,1,FALSE)=A1469,\"Yes\"))","v":""}]
[1465,"Sizemore, Scott",{"$f":"IF(ISNA(IF(VLOOKUP(A1470,Draft!E:E,1,FALSE)=A1470,\"Yes\")),\"\",IF(VLOOKUP(A1470,Draft!E:E,1,FALSE)=A1470,\"Yes\"))","v":""}]
[1466,"Hughes, Luke",{"$f":"IF(ISNA(IF(VLOOKUP(A1471,Draft!E:E,1,FALSE)=A1471,\"Yes\")),\"\",IF(VLOOKUP(A1471,Draft!E:E,1,FALSE)=A1471,\"Yes\"))","v":""}]
[1467,"Weeks, Jemile",{"$f":"IF(ISNA(IF(VLOOKUP(A1472,Draft!E:E,1,FALSE)=A1472,\"Yes\")),\"\",IF(VLOOKUP(A1472,Draft!E:E,1,FALSE)=A1472,\"Yes\"))","v":""}]
[1468,"Sogard, Eric",{"$f":"IF(ISNA(IF(VLOOKUP(A1473,Draft!E:E,1,FALSE)=A1473,\"Yes\")),\"\",IF(VLOOKUP(A1473,Draft!E:E,1,FALSE)=A1473,\"Yes\"))","v":""}]
[1469,"Figgins, Chone",{"$f":"IF(ISNA(IF(VLOOKUP(A1474,Draft!E:E,1,FALSE)=A1474,\"Yes\")),\"\",IF(VLOOKUP(A1474,Draft!E:E,1,FALSE)=A1474,\"Yes\"))","v":""}]
[1470,"Longoria, Evan",{"$f":"IF(ISNA(IF(VLOOKUP(A1475,Draft!E:E,1,FALSE)=A1475,\"Yes\")),\"\",IF(VLOOKUP(A1475,Draft!E:E,1,FALSE)=A1475,\"Yes\"))","v":""}]
[1471,"Inge, Brandon",{"$f":"IF(ISNA(IF(VLOOKUP(A1476,Draft!E:E,1,FALSE)=A1476,\"Yes\")),\"\",IF(VLOOKUP(A1476,Draft!E:E,1,FALSE)=A1476,\"Yes\"))","v":""}]
[1472,"Young, Michael",{"$f":"IF(ISNA(IF(VLOOKUP(A1477,Draft!E:E,1,FALSE)=A1477,\"Yes\")),\"\",IF(VLOOKUP(A1477,Draft!E:E,1,FALSE)=A1477,\"Yes\"))","v":""}]
[1473,"Youkilis, Kevin",{"$f":"IF(ISNA(IF(VLOOKUP(A1478,Draft!E:E,1,FALSE)=A1478,\"Yes\")),\"\",IF(VLOOKUP(A1478,Draft!E:E,1,FALSE)=A1478,\"Yes\"))","v":""}]
[1474,"Teahen, Mark",{"$f":"IF(ISNA(IF(VLOOKUP(A1479,Draft!E:E,1,FALSE)=A1479,\"Yes\")),\"\",IF(VLOOKUP(A1479,Draft!E:E,1,FALSE)=A1479,\"Yes\"))","v":""}]
[1475,"Kouzmanoff, Kevin",{"$f":"IF(ISNA(IF(VLOOKUP(A1480,Draft!E:E,1,FALSE)=A1480,\"Yes\")),\"\",IF(VLOOKUP(A1480,Draft!E:E,1,FALSE)=A1480,\"Yes\"))","v":""}]
[1476,"Rodriguez, Alex",{"$f":"IF(ISNA(IF(VLOOKUP(A1481,Draft!E:E,1,FALSE)=A1481,\"Yes\")),\"\",IF(VLOOKUP(A1481,Draft!E:E,1,FALSE)=A1481,\"Yes\"))","v":""}]
[1477,"Lowell, Mike",{"$f":"IF(ISNA(IF(VLOOKUP(A1482,Draft!E:E,1,FALSE)=A1482,\"Yes\")),\"\",IF(VLOOKUP(A1482,Draft!E:E,1,FALSE)=A1482,\"Yes\"))","v":""}]
[1478,"Beltre, Adrian",{"$f":"IF(ISNA(IF(VLOOKUP(A1483,Draft!E:E,1,FALSE)=A1483,\"Yes\")),\"\",IF(VLOOKUP(A1483,Draft!E:E,1,FALSE)=A1483,\"Yes\"))","v":"Yes"}]
[1479,"Wigginton, Ty",{"$f":"IF(ISNA(IF(VLOOKUP(A1484,Draft!E:E,1,FALSE)=A1484,\"Yes\")),\"\",IF(VLOOKUP(A1484,Draft!E:E,1,FALSE)=A1484,\"Yes\"))","v":""}]
[1480,"Beckham, Gordon",{"$f":"IF(ISNA(IF(VLOOKUP(A1485,Draft!E:E,1,FALSE)=A1485,\"Yes\")),\"\",IF(VLOOKUP(A1485,Draft!E:E,1,FALSE)=A1485,\"Yes\"))","v":""}]
[1481,"Atkins, Garrett",{"$f":"IF(ISNA(IF(VLOOKUP(A1486,Draft!E:E,1,FALSE)=A1486,\"Yes\")),\"\",IF(VLOOKUP(A1486,Draft!E:E,1,FALSE)=A1486,\"Yes\"))","v":""}]
[1482,"Bautista, Jose",{"$f":"IF(ISNA(IF(VLOOKUP(A1487,Draft!E:E,1,FALSE)=A1487,\"Yes\")),\"\",IF(VLOOKUP(A1487,Draft!E:E,1,FALSE)=A1487,\"Yes\"))","v":""}]
[1483,"Hall, Bill",{"$f":"IF(ISNA(IF(VLOOKUP(A1488,Draft!E:E,1,FALSE)=A1488,\"Yes\")),\"\",IF(VLOOKUP(A1488,Draft!E:E,1,FALSE)=A1488,\"Yes\"))","v":""}]
[1484,"Encarnacion, Edwin",{"$f":"IF(ISNA(IF(VLOOKUP(A1489,Draft!E:E,1,FALSE)=A1489,\"Yes\")),\"\",IF(VLOOKUP(A1489,Draft!E:E,1,FALSE)=A1489,\"Yes\"))","v":""}]
[1485,"Hannahan, Jack",{"$f":"IF(ISNA(IF(VLOOKUP(A1490,Draft!E:E,1,FALSE)=A1490,\"Yes\")),\"\",IF(VLOOKUP(A1490,Draft!E:E,1,FALSE)=A1490,\"Yes\"))","v":""}]
[1486,"Fields, Josh(3B)",{"$f":"IF(ISNA(IF(VLOOKUP(A1491,Draft!E:E,1,FALSE)=A1491,\"Yes\")),\"\",IF(VLOOKUP(A1491,Draft!E:E,1,FALSE)=A1491,\"Yes\"))","v":""}]
[1487,"Fox, Jake",{"$f":"IF(ISNA(IF(VLOOKUP(A1492,Draft!E:E,1,FALSE)=A1492,\"Yes\")),\"\",IF(VLOOKUP(A1492,Draft!E:E,1,FALSE)=A1492,\"Yes\"))","v":""}]
[1488,"Gordon, Alex",{"$f":"IF(ISNA(IF(VLOOKUP(A1493,Draft!E:E,1,FALSE)=A1493,\"Yes\")),\"\",IF(VLOOKUP(A1493,Draft!E:E,1,FALSE)=A1493,\"Yes\"))","v":""}]
[1489,"Buscher, Brian",{"$f":"IF(ISNA(IF(VLOOKUP(A1494,Draft!E:E,1,FALSE)=A1494,\"Yes\")),\"\",IF(VLOOKUP(A1494,Draft!E:E,1,FALSE)=A1494,\"Yes\"))","v":""}]
[1490,"Betemit, Wilson",{"$f":"IF(ISNA(IF(VLOOKUP(A1495,Draft!E:E,1,FALSE)=A1495,\"Yes\")),\"\",IF(VLOOKUP(A1495,Draft!E:E,1,FALSE)=A1495,\"Yes\"))","v":""}]
[1491,"Dillon, Joe",{"$f":"IF(ISNA(IF(VLOOKUP(A1496,Draft!E:E,1,FALSE)=A1496,\"Yes\")),\"\",IF(VLOOKUP(A1496,Draft!E:E,1,FALSE)=A1496,\"Yes\"))","v":""}]
[1492,"Chavez, Eric",{"$f":"IF(ISNA(IF(VLOOKUP(A1497,Draft!E:E,1,FALSE)=A1497,\"Yes\")),\"\",IF(VLOOKUP(A1497,Draft!E:E,1,FALSE)=A1497,\"Yes\"))","v":""}]
[1493,"Tuiasosopo, Matt",{"$f":"IF(ISNA(IF(VLOOKUP(A1498,Draft!E:E,1,FALSE)=A1498,\"Yes\")),\"\",IF(VLOOKUP(A1498,Draft!E:E,1,FALSE)=A1498,\"Yes\"))","v":""}]
[1494,"Sandoval, Freddy",{"$f":"IF(ISNA(IF(VLOOKUP(A1499,Draft!E:E,1,FALSE)=A1499,\"Yes\")),\"\",IF(VLOOKUP(A1499,Draft!E:E,1,FALSE)=A1499,\"Yes\"))","v":""}]
[1495,"McPherson, Dallas",{"$f":"IF(ISNA(IF(VLOOKUP(A1500,Draft!E:E,1,FALSE)=A1500,\"Yes\")),\"\",IF(VLOOKUP(A1500,Draft!E:E,1,FALSE)=A1500,\"Yes\"))","v":""}]
[1496,"Bell, Josh",{"$f":"IF(ISNA(IF(VLOOKUP(A1501,Draft!E:E,1,FALSE)=A1501,\"Yes\")),\"\",IF(VLOOKUP(A1501,Draft!E:E,1,FALSE)=A1501,\"Yes\"))","v":""}]
[1497,"Viciedo, Dayan",{"$f":"IF(ISNA(IF(VLOOKUP(A1502,Draft!E:E,1,FALSE)=A1502,\"Yes\")),\"\",IF(VLOOKUP(A1502,Draft!E:E,1,FALSE)=A1502,\"Yes\"))","v":""}]
[1498,"Morel, Brent",{"$f":"IF(ISNA(IF(VLOOKUP(A1503,Draft!E:E,1,FALSE)=A1503,\"Yes\")),\"\",IF(VLOOKUP(A1503,Draft!E:E,1,FALSE)=A1503,\"Yes\"))","v":""}]
[1499,"Hodges, Wes",{"$f":"IF(ISNA(IF(VLOOKUP(A1504,Draft!E:E,1,FALSE)=A1504,\"Yes\")),\"\",IF(VLOOKUP(A1504,Draft!E:E,1,FALSE)=A1504,\"Yes\"))","v":""}]
[1500,"Chisenhall, Lonnie",{"$f":"IF(ISNA(IF(VLOOKUP(A1505,Draft!E:E,1,FALSE)=A1505,\"Yes\")),\"\",IF(VLOOKUP(A1505,Draft!E:E,1,FALSE)=A1505,\"Yes\"))","v":""}]
[1501,"Moustakas, Michael",{"$f":"IF(ISNA(IF(VLOOKUP(A1506,Draft!E:E,1,FALSE)=A1506,\"Yes\")),\"\",IF(VLOOKUP(A1506,Draft!E:E,1,FALSE)=A1506,\"Yes\"))","v":""}]
[1502,"Valencia, Danny",{"$f":"IF(ISNA(IF(VLOOKUP(A1507,Draft!E:E,1,FALSE)=A1507,\"Yes\")),\"\",IF(VLOOKUP(A1507,Draft!E:E,1,FALSE)=A1507,\"Yes\"))","v":""}]
[1503,"Liddi, Alex",{"$f":"IF(ISNA(IF(VLOOKUP(A1508,Draft!E:E,1,FALSE)=A1508,\"Yes\")),\"\",IF(VLOOKUP(A1508,Draft!E:E,1,FALSE)=A1508,\"Yes\"))","v":""}]
[1504,"Mendonca, Thomas",{"$f":"IF(ISNA(IF(VLOOKUP(A1509,Draft!E:E,1,FALSE)=A1509,\"Yes\")),\"\",IF(VLOOKUP(A1509,Draft!E:E,1,FALSE)=A1509,\"Yes\"))","v":""}]
[1505,"Wallace, Brett",{"$f":"IF(ISNA(IF(VLOOKUP(A1510,Draft!E:E,1,FALSE)=A1510,\"Yes\")),\"\",IF(VLOOKUP(A1510,Draft!E:E,1,FALSE)=A1510,\"Yes\"))","v":"Yes"}]
[1506,"Jeter, Derek",{"$f":"IF(ISNA(IF(VLOOKUP(A1511,Draft!E:E,1,FALSE)=A1511,\"Yes\")),\"\",IF(VLOOKUP(A1511,Draft!E:E,1,FALSE)=A1511,\"Yes\"))","v":""}]
[1507,"Scutaro, Marcos",{"$f":"IF(ISNA(IF(VLOOKUP(A1512,Draft!E:E,1,FALSE)=A1512,\"Yes\")),\"\",IF(VLOOKUP(A1512,Draft!E:E,1,FALSE)=A1512,\"Yes\"))","v":""}]
[1508,"Peralta, Jhonny",{"$f":"IF(ISNA(IF(VLOOKUP(A1513,Draft!E:E,1,FALSE)=A1513,\"Yes\")),\"\",IF(VLOOKUP(A1513,Draft!E:E,1,FALSE)=A1513,\"Yes\"))","v":""}]
[1509,"Ramirez, Alexei",{"$f":"IF(ISNA(IF(VLOOKUP(A1514,Draft!E:E,1,FALSE)=A1514,\"Yes\")),\"\",IF(VLOOKUP(A1514,Draft!E:E,1,FALSE)=A1514,\"Yes\"))","v":""}]
[1510,"Cabrera, Asdrubal",{"$f":"IF(ISNA(IF(VLOOKUP(A1515,Draft!E:E,1,FALSE)=A1515,\"Yes\")),\"\",IF(VLOOKUP(A1515,Draft!E:E,1,FALSE)=A1515,\"Yes\"))","v":""}]
[1511,"Bartlett, Jason",{"$f":"IF(ISNA(IF(VLOOKUP(A1516,Draft!E:E,1,FALSE)=A1516,\"Yes\")),\"\",IF(VLOOKUP(A1516,Draft!E:E,1,FALSE)=A1516,\"Yes\"))","v":""}]
[1512,"Aybar, Erick",{"$f":"IF(ISNA(IF(VLOOKUP(A1517,Draft!E:E,1,FALSE)=A1517,\"Yes\")),\"\",IF(VLOOKUP(A1517,Draft!E:E,1,FALSE)=A1517,\"Yes\"))","v":""}]
[1513,"Andrus, Elvis",{"$f":"IF(ISNA(IF(VLOOKUP(A1518,Draft!E:E,1,FALSE)=A1518,\"Yes\")),\"\",IF(VLOOKUP(A1518,Draft!E:E,1,FALSE)=A1518,\"Yes\"))","v":"Yes"}]
[1514,"Betancourt, Yuniesky",{"$f":"IF(ISNA(IF(VLOOKUP(A1519,Draft!E:E,1,FALSE)=A1519,\"Yes\")),\"\",IF(VLOOKUP(A1519,Draft!E:E,1,FALSE)=A1519,\"Yes\"))","v":""}]
[1515,"Bloomquist, Willie",{"$f":"IF(ISNA(IF(VLOOKUP(A1520,Draft!E:E,1,FALSE)=A1520,\"Yes\")),\"\",IF(VLOOKUP(A1520,Draft!E:E,1,FALSE)=A1520,\"Yes\"))","v":""}]
[1516,"Hardy, J.J.",{"$f":"IF(ISNA(IF(VLOOKUP(A1521,Draft!E:E,1,FALSE)=A1521,\"Yes\")),\"\",IF(VLOOKUP(A1521,Draft!E:E,1,FALSE)=A1521,\"Yes\"))","v":""}]
[1517,"Harris, Brendan",{"$f":"IF(ISNA(IF(VLOOKUP(A1522,Draft!E:E,1,FALSE)=A1522,\"Yes\")),\"\",IF(VLOOKUP(A1522,Draft!E:E,1,FALSE)=A1522,\"Yes\"))","v":""}]
[1518,"Izturis, Maicer",{"$f":"IF(ISNA(IF(VLOOKUP(A1523,Draft!E:E,1,FALSE)=A1523,\"Yes\")),\"\",IF(VLOOKUP(A1523,Draft!E:E,1,FALSE)=A1523,\"Yes\"))","v":""}]
[1519,"Punto, Nick",{"$f":"IF(ISNA(IF(VLOOKUP(A1524,Draft!E:E,1,FALSE)=A1524,\"Yes\")),\"\",IF(VLOOKUP(A1524,Draft!E:E,1,FALSE)=A1524,\"Yes\"))","v":""}]
[1520,"Gonzalez, Alex",{"$f":"IF(ISNA(IF(VLOOKUP(A1525,Draft!E:E,1,FALSE)=A1525,\"Yes\")),\"\",IF(VLOOKUP(A1525,Draft!E:E,1,FALSE)=A1525,\"Yes\"))","v":""}]
[1521,"Izturis, Cesar",{"$f":"IF(ISNA(IF(VLOOKUP(A1526,Draft!E:E,1,FALSE)=A1526,\"Yes\")),\"\",IF(VLOOKUP(A1526,Draft!E:E,1,FALSE)=A1526,\"Yes\"))","v":""}]
[1522,"Wilson, Jack",{"$f":"IF(ISNA(IF(VLOOKUP(A1527,Draft!E:E,1,FALSE)=A1527,\"Yes\")),\"\",IF(VLOOKUP(A1527,Draft!E:E,1,FALSE)=A1527,\"Yes\"))","v":""}]
[1523,"Everett, Adam",{"$f":"IF(ISNA(IF(VLOOKUP(A1528,Draft!E:E,1,FALSE)=A1528,\"Yes\")),\"\",IF(VLOOKUP(A1528,Draft!E:E,1,FALSE)=A1528,\"Yes\"))","v":""}]
[1524,"Santiago, Ramon",{"$f":"IF(ISNA(IF(VLOOKUP(A1529,Draft!E:E,1,FALSE)=A1529,\"Yes\")),\"\",IF(VLOOKUP(A1529,Draft!E:E,1,FALSE)=A1529,\"Yes\"))","v":""}]
[1525,"Rodriguez, LuisO.",{"$f":"IF(ISNA(IF(VLOOKUP(A1530,Draft!E:E,1,FALSE)=A1530,\"Yes\")),\"\",IF(VLOOKUP(A1530,Draft!E:E,1,FALSE)=A1530,\"Yes\"))","v":""}]
[1526,"Pennington, Cliff",{"$f":"IF(ISNA(IF(VLOOKUP(A1531,Draft!E:E,1,FALSE)=A1531,\"Yes\")),\"\",IF(VLOOKUP(A1531,Draft!E:E,1,FALSE)=A1531,\"Yes\"))","v":""}]
[1527,"Andino, Robert",{"$f":"IF(ISNA(IF(VLOOKUP(A1532,Draft!E:E,1,FALSE)=A1532,\"Yes\")),\"\",IF(VLOOKUP(A1532,Draft!E:E,1,FALSE)=A1532,\"Yes\"))","v":""}]
[1528,"Wilson, Josh",{"$f":"IF(ISNA(IF(VLOOKUP(A1533,Draft!E:E,1,FALSE)=A1533,\"Yes\")),\"\",IF(VLOOKUP(A1533,Draft!E:E,1,FALSE)=A1533,\"Yes\"))","v":""}]
[1529,"Vizquel, Omar",{"$f":"IF(ISNA(IF(VLOOKUP(A1534,Draft!E:E,1,FALSE)=A1534,\"Yes\")),\"\",IF(VLOOKUP(A1534,Draft!E:E,1,FALSE)=A1534,\"Yes\"))","v":""}]
[1530,"Greene, Khalil",{"$f":"IF(ISNA(IF(VLOOKUP(A1535,Draft!E:E,1,FALSE)=A1535,\"Yes\")),\"\",IF(VLOOKUP(A1535,Draft!E:E,1,FALSE)=A1535,\"Yes\"))","v":""}]
[1531,"McDonald, John",{"$f":"IF(ISNA(IF(VLOOKUP(A1536,Draft!E:E,1,FALSE)=A1536,\"Yes\")),\"\",IF(VLOOKUP(A1536,Draft!E:E,1,FALSE)=A1536,\"Yes\"))","v":""}]
[1532,"Aviles, Mike",{"$f":"IF(ISNA(IF(VLOOKUP(A1537,Draft!E:E,1,FALSE)=A1537,\"Yes\")),\"\",IF(VLOOKUP(A1537,Draft!E:E,1,FALSE)=A1537,\"Yes\"))","v":""}]
[1533,"Pena, Ramiro",{"$f":"IF(ISNA(IF(VLOOKUP(A1538,Draft!E:E,1,FALSE)=A1538,\"Yes\")),\"\",IF(VLOOKUP(A1538,Draft!E:E,1,FALSE)=A1538,\"Yes\"))","v":""}]
[1534,"Lillibridge, Brent",{"$f":"IF(ISNA(IF(VLOOKUP(A1539,Draft!E:E,1,FALSE)=A1539,\"Yes\")),\"\",IF(VLOOKUP(A1539,Draft!E:E,1,FALSE)=A1539,\"Yes\"))","v":""}]
[1535,"Brignac, Reid",{"$f":"IF(ISNA(IF(VLOOKUP(A1540,Draft!E:E,1,FALSE)=A1540,\"Yes\")),\"\",IF(VLOOKUP(A1540,Draft!E:E,1,FALSE)=A1540,\"Yes\"))","v":""}]
[1536,"Woodward, Chris",{"$f":"IF(ISNA(IF(VLOOKUP(A1541,Draft!E:E,1,FALSE)=A1541,\"Yes\")),\"\",IF(VLOOKUP(A1541,Draft!E:E,1,FALSE)=A1541,\"Yes\"))","v":""}]
[1537,"Lowrie, Jed",{"$f":"IF(ISNA(IF(VLOOKUP(A1542,Draft!E:E,1,FALSE)=A1542,\"Yes\")),\"\",IF(VLOOKUP(A1542,Draft!E:E,1,FALSE)=A1542,\"Yes\"))","v":""}]
[1538,"Bixler, Brian",{"$f":"IF(ISNA(IF(VLOOKUP(A1543,Draft!E:E,1,FALSE)=A1543,\"Yes\")),\"\",IF(VLOOKUP(A1543,Draft!E:E,1,FALSE)=A1543,\"Yes\"))","v":""}]
[1539,"Wood, Brandon",{"$f":"IF(ISNA(IF(VLOOKUP(A1544,Draft!E:E,1,FALSE)=A1544,\"Yes\")),\"\",IF(VLOOKUP(A1544,Draft!E:E,1,FALSE)=A1544,\"Yes\"))","v":""}]
[1540,"Petit, Gregorio",{"$f":"IF(ISNA(IF(VLOOKUP(A1545,Draft!E:E,1,FALSE)=A1545,\"Yes\")),\"\",IF(VLOOKUP(A1545,Draft!E:E,1,FALSE)=A1545,\"Yes\"))","v":""}]
[1541,"Dlugach, Brent",{"$f":"IF(ISNA(IF(VLOOKUP(A1546,Draft!E:E,1,FALSE)=A1546,\"Yes\")),\"\",IF(VLOOKUP(A1546,Draft!E:E,1,FALSE)=A1546,\"Yes\"))","v":""}]
[1542,"Olmedo, Ray",{"$f":"IF(ISNA(IF(VLOOKUP(A1547,Draft!E:E,1,FALSE)=A1547,\"Yes\")),\"\",IF(VLOOKUP(A1547,Draft!E:E,1,FALSE)=A1547,\"Yes\"))","v":""}]
[1543,"Bynum, Freddie",{"$f":"IF(ISNA(IF(VLOOKUP(A1548,Draft!E:E,1,FALSE)=A1548,\"Yes\")),\"\",IF(VLOOKUP(A1548,Draft!E:E,1,FALSE)=A1548,\"Yes\"))","v":""}]
[1544,"Bocock, Brian",{"$f":"IF(ISNA(IF(VLOOKUP(A1549,Draft!E:E,1,FALSE)=A1549,\"Yes\")),\"\",IF(VLOOKUP(A1549,Draft!E:E,1,FALSE)=A1549,\"Yes\"))","v":""}]
[1545,"Givens, Mychal",{"$f":"IF(ISNA(IF(VLOOKUP(A1550,Draft!E:E,1,FALSE)=A1550,\"Yes\")),\"\",IF(VLOOKUP(A1550,Draft!E:E,1,FALSE)=A1550,\"Yes\"))","v":""}]
[1546,"Iglesias, Jose",{"$f":"IF(ISNA(IF(VLOOKUP(A1551,Draft!E:E,1,FALSE)=A1551,\"Yes\")),\"\",IF(VLOOKUP(A1551,Draft!E:E,1,FALSE)=A1551,\"Yes\"))","v":""}]
[1547,"Rivero, Carlos",{"$f":"IF(ISNA(IF(VLOOKUP(A1552,Draft!E:E,1,FALSE)=A1552,\"Yes\")),\"\",IF(VLOOKUP(A1552,Draft!E:E,1,FALSE)=A1552,\"Yes\"))","v":""}]
[1548,"Donald, Jason",{"$f":"IF(ISNA(IF(VLOOKUP(A1553,Draft!E:E,1,FALSE)=A1553,\"Yes\")),\"\",IF(VLOOKUP(A1553,Draft!E:E,1,FALSE)=A1553,\"Yes\"))","v":""}]
[1549,"Bianchi, Jeff",{"$f":"IF(ISNA(IF(VLOOKUP(A1554,Draft!E:E,1,FALSE)=A1554,\"Yes\")),\"\",IF(VLOOKUP(A1554,Draft!E:E,1,FALSE)=A1554,\"Yes\"))","v":""}]
[1550,"Plouffe, Trevor",{"$f":"IF(ISNA(IF(VLOOKUP(A1555,Draft!E:E,1,FALSE)=A1555,\"Yes\")),\"\",IF(VLOOKUP(A1555,Draft!E:E,1,FALSE)=A1555,\"Yes\"))","v":""}]
[1551,"Corona, Reegie",{"$f":"IF(ISNA(IF(VLOOKUP(A1556,Draft!E:E,1,FALSE)=A1556,\"Yes\")),\"\",IF(VLOOKUP(A1556,Draft!E:E,1,FALSE)=A1556,\"Yes\"))","v":""}]
[1552,"Cardenas, Adrian",{"$f":"IF(ISNA(IF(VLOOKUP(A1557,Draft!E:E,1,FALSE)=A1557,\"Yes\")),\"\",IF(VLOOKUP(A1557,Draft!E:E,1,FALSE)=A1557,\"Yes\"))","v":"Yes"}]
[1553,"Wimberly, Corey",{"$f":"IF(ISNA(IF(VLOOKUP(A1558,Draft!E:E,1,FALSE)=A1558,\"Yes\")),\"\",IF(VLOOKUP(A1558,Draft!E:E,1,FALSE)=A1558,\"Yes\"))","v":""}]
[1554,"Green, Grant",{"$f":"IF(ISNA(IF(VLOOKUP(A1559,Draft!E:E,1,FALSE)=A1559,\"Yes\")),\"\",IF(VLOOKUP(A1559,Draft!E:E,1,FALSE)=A1559,\"Yes\"))","v":""}]
[1555,"Triunfel, Carlos",{"$f":"IF(ISNA(IF(VLOOKUP(A1560,Draft!E:E,1,FALSE)=A1560,\"Yes\")),\"\",IF(VLOOKUP(A1560,Draft!E:E,1,FALSE)=A1560,\"Yes\"))","v":""}]
[1556,"Franklin, Nicholas",{"$f":"IF(ISNA(IF(VLOOKUP(A1561,Draft!E:E,1,FALSE)=A1561,\"Yes\")),\"\",IF(VLOOKUP(A1561,Draft!E:E,1,FALSE)=A1561,\"Yes\"))","v":""}]
[1557,"Beckham, Tim",{"$f":"IF(ISNA(IF(VLOOKUP(A1562,Draft!E:E,1,FALSE)=A1562,\"Yes\")),\"\",IF(VLOOKUP(A1562,Draft!E:E,1,FALSE)=A1562,\"Yes\"))","v":""}]
[1558,"Markakis, Nick",{"$f":"IF(ISNA(IF(VLOOKUP(A1563,Draft!E:E,1,FALSE)=A1563,\"Yes\")),\"\",IF(VLOOKUP(A1563,Draft!E:E,1,FALSE)=A1563,\"Yes\"))","v":""}]
[1559,"Granderson, Curtis",{"$f":"IF(ISNA(IF(VLOOKUP(A1564,Draft!E:E,1,FALSE)=A1564,\"Yes\")),\"\",IF(VLOOKUP(A1564,Draft!E:E,1,FALSE)=A1564,\"Yes\"))","v":""}]
[1560,"Wells, Vernon",{"$f":"IF(ISNA(IF(VLOOKUP(A1565,Draft!E:E,1,FALSE)=A1565,\"Yes\")),\"\",IF(VLOOKUP(A1565,Draft!E:E,1,FALSE)=A1565,\"Yes\"))","v":""}]
[1561,"Ellsbury, Jacoby",{"$f":"IF(ISNA(IF(VLOOKUP(A1566,Draft!E:E,1,FALSE)=A1566,\"Yes\")),\"\",IF(VLOOKUP(A1566,Draft!E:E,1,FALSE)=A1566,\"Yes\"))","v":""}]
[1562,"Choo, Shin-Soo",{"$f":"IF(ISNA(IF(VLOOKUP(A1567,Draft!E:E,1,FALSE)=A1567,\"Yes\")),\"\",IF(VLOOKUP(A1567,Draft!E:E,1,FALSE)=A1567,\"Yes\"))","v":""}]
[1563,"Suzuki, Ichiro",{"$f":"IF(ISNA(IF(VLOOKUP(A1568,Draft!E:E,1,FALSE)=A1568,\"Yes\")),\"\",IF(VLOOKUP(A1568,Draft!E:E,1,FALSE)=A1568,\"Yes\"))","v":""}]
[1564,"Crawford, Carl",{"$f":"IF(ISNA(IF(VLOOKUP(A1569,Draft!E:E,1,FALSE)=A1569,\"Yes\")),\"\",IF(VLOOKUP(A1569,Draft!E:E,1,FALSE)=A1569,\"Yes\"))","v":""}]
[1565,"Abreu, Bobby",{"$f":"IF(ISNA(IF(VLOOKUP(A1570,Draft!E:E,1,FALSE)=A1570,\"Yes\")),\"\",IF(VLOOKUP(A1570,Draft!E:E,1,FALSE)=A1570,\"Yes\"))","v":"Yes"}]
[1566,"Span, Denard",{"$f":"IF(ISNA(IF(VLOOKUP(A1571,Draft!E:E,1,FALSE)=A1571,\"Yes\")),\"\",IF(VLOOKUP(A1571,Draft!E:E,1,FALSE)=A1571,\"Yes\"))","v":""}]
[1567,"Lind, Adam",{"$f":"IF(ISNA(IF(VLOOKUP(A1572,Draft!E:E,1,FALSE)=A1572,\"Yes\")),\"\",IF(VLOOKUP(A1572,Draft!E:E,1,FALSE)=A1572,\"Yes\"))","v":""}]
[1568,"Cuddyer, Michael",{"$f":"IF(ISNA(IF(VLOOKUP(A1573,Draft!E:E,1,FALSE)=A1573,\"Yes\")),\"\",IF(VLOOKUP(A1573,Draft!E:E,1,FALSE)=A1573,\"Yes\"))","v":""}]
[1569,"Rios, Alex",{"$f":"IF(ISNA(IF(VLOOKUP(A1574,Draft!E:E,1,FALSE)=A1574,\"Yes\")),\"\",IF(VLOOKUP(A1574,Draft!E:E,1,FALSE)=A1574,\"Yes\"))","v":""}]
[1570,"Cameron, Mike",{"$f":"IF(ISNA(IF(VLOOKUP(A1575,Draft!E:E,1,FALSE)=A1575,\"Yes\")),\"\",IF(VLOOKUP(A1575,Draft!E:E,1,FALSE)=A1575,\"Yes\"))","v":""}]
[1571,"Upton, B.J.",{"$f":"IF(ISNA(IF(VLOOKUP(A1576,Draft!E:E,1,FALSE)=A1576,\"Yes\")),\"\",IF(VLOOKUP(A1576,Draft!E:E,1,FALSE)=A1576,\"Yes\"))","v":""}]
[1572,"Dejesus, David",{"$f":"IF(ISNA(IF(VLOOKUP(A1577,Draft!E:E,1,FALSE)=A1577,\"Yes\")),\"\",IF(VLOOKUP(A1577,Draft!E:E,1,FALSE)=A1577,\"Yes\"))","v":""}]
[1573,"Gutierrez, Franklin",{"$f":"IF(ISNA(IF(VLOOKUP(A1578,Draft!E:E,1,FALSE)=A1578,\"Yes\")),\"\",IF(VLOOKUP(A1578,Draft!E:E,1,FALSE)=A1578,\"Yes\"))","v":""}]
[1574,"Cust, Jack",{"$f":"IF(ISNA(IF(VLOOKUP(A1579,Draft!E:E,1,FALSE)=A1579,\"Yes\")),\"\",IF(VLOOKUP(A1579,Draft!E:E,1,FALSE)=A1579,\"Yes\"))","v":""}]
[1575,"Swisher, Nick",{"$f":"IF(ISNA(IF(VLOOKUP(A1580,Draft!E:E,1,FALSE)=A1580,\"Yes\")),\"\",IF(VLOOKUP(A1580,Draft!E:E,1,FALSE)=A1580,\"Yes\"))","v":""}]
[1576,"Podsednik, Scott",{"$f":"IF(ISNA(IF(VLOOKUP(A1581,Draft!E:E,1,FALSE)=A1581,\"Yes\")),\"\",IF(VLOOKUP(A1581,Draft!E:E,1,FALSE)=A1581,\"Yes\"))","v":""}]
[1577,"Kubel, Jason",{"$f":"IF(ISNA(IF(VLOOKUP(A1582,Draft!E:E,1,FALSE)=A1582,\"Yes\")),\"\",IF(VLOOKUP(A1582,Draft!E:E,1,FALSE)=A1582,\"Yes\"))","v":""}]
[1578,"Rivera, Juan",{"$f":"IF(ISNA(IF(VLOOKUP(A1583,Draft!E:E,1,FALSE)=A1583,\"Yes\")),\"\",IF(VLOOKUP(A1583,Draft!E:E,1,FALSE)=A1583,\"Yes\"))","v":""}]
[1579,"Drew, J.D.",{"$f":"IF(ISNA(IF(VLOOKUP(A1584,Draft!E:E,1,FALSE)=A1584,\"Yes\")),\"\",IF(VLOOKUP(A1584,Draft!E:E,1,FALSE)=A1584,\"Yes\"))","v":"Yes"}]
[1580,"Sweeney, Ryan",{"$f":"IF(ISNA(IF(VLOOKUP(A1585,Draft!E:E,1,FALSE)=A1585,\"Yes\")),\"\",IF(VLOOKUP(A1585,Draft!E:E,1,FALSE)=A1585,\"Yes\"))","v":""}]
[1581,"Matsui, Hideki",{"$f":"IF(ISNA(IF(VLOOKUP(A1586,Draft!E:E,1,FALSE)=A1586,\"Yes\")),\"\",IF(VLOOKUP(A1586,Draft!E:E,1,FALSE)=A1586,\"Yes\"))","v":""}]
[1582,"Jones, Adam",{"$f":"IF(ISNA(IF(VLOOKUP(A1587,Draft!E:E,1,FALSE)=A1587,\"Yes\")),\"\",IF(VLOOKUP(A1587,Draft!E:E,1,FALSE)=A1587,\"Yes\"))","v":""}]
[1583,"Cruz(Tex), Nelson",{"$f":"IF(ISNA(IF(VLOOKUP(A1588,Draft!E:E,1,FALSE)=A1588,\"Yes\")),\"\",IF(VLOOKUP(A1588,Draft!E:E,1,FALSE)=A1588,\"Yes\"))","v":""}]
[1584,"Ordonez, Magglio",{"$f":"IF(ISNA(IF(VLOOKUP(A1589,Draft!E:E,1,FALSE)=A1589,\"Yes\")),\"\",IF(VLOOKUP(A1589,Draft!E:E,1,FALSE)=A1589,\"Yes\"))","v":""}]
[1585,"Scott, Luke",{"$f":"IF(ISNA(IF(VLOOKUP(A1590,Draft!E:E,1,FALSE)=A1590,\"Yes\")),\"\",IF(VLOOKUP(A1590,Draft!E:E,1,FALSE)=A1590,\"Yes\"))","v":""}]
[1586,"Hunter, Torii",{"$f":"IF(ISNA(IF(VLOOKUP(A1591,Draft!E:E,1,FALSE)=A1591,\"Yes\")),\"\",IF(VLOOKUP(A1591,Draft!E:E,1,FALSE)=A1591,\"Yes\"))","v":""}]
[1587,"Sizemore, Grady",{"$f":"IF(ISNA(IF(VLOOKUP(A1592,Draft!E:E,1,FALSE)=A1592,\"Yes\")),\"\",IF(VLOOKUP(A1592,Draft!E:E,1,FALSE)=A1592,\"Yes\"))","v":""}]
[1588,"Hermida, Jeremy",{"$f":"IF(ISNA(IF(VLOOKUP(A1593,Draft!E:E,1,FALSE)=A1593,\"Yes\")),\"\",IF(VLOOKUP(A1593,Draft!E:E,1,FALSE)=A1593,\"Yes\"))","v":""}]
[1589,"Murphy, David",{"$f":"IF(ISNA(IF(VLOOKUP(A1594,Draft!E:E,1,FALSE)=A1594,\"Yes\")),\"\",IF(VLOOKUP(A1594,Draft!E:E,1,FALSE)=A1594,\"Yes\"))","v":""}]
[1590,"Burrell, Pat",{"$f":"IF(ISNA(IF(VLOOKUP(A1595,Draft!E:E,1,FALSE)=A1595,\"Yes\")),\"\",IF(VLOOKUP(A1595,Draft!E:E,1,FALSE)=A1595,\"Yes\"))","v":""}]
[1591,"Bradley, Milton",{"$f":"IF(ISNA(IF(VLOOKUP(A1596,Draft!E:E,1,FALSE)=A1596,\"Yes\")),\"\",IF(VLOOKUP(A1596,Draft!E:E,1,FALSE)=A1596,\"Yes\"))","v":""}]
[1592,"Griffey(Jr), Ken",{"$f":"IF(ISNA(IF(VLOOKUP(A1597,Draft!E:E,1,FALSE)=A1597,\"Yes\")),\"\",IF(VLOOKUP(A1597,Draft!E:E,1,FALSE)=A1597,\"Yes\"))","v":""}]
[1593,"Davis, Rajai",{"$f":"IF(ISNA(IF(VLOOKUP(A1598,Draft!E:E,1,FALSE)=A1598,\"Yes\")),\"\",IF(VLOOKUP(A1598,Draft!E:E,1,FALSE)=A1598,\"Yes\"))","v":""}]
[1594,"Pierre, Juan",{"$f":"IF(ISNA(IF(VLOOKUP(A1599,Draft!E:E,1,FALSE)=A1599,\"Yes\")),\"\",IF(VLOOKUP(A1599,Draft!E:E,1,FALSE)=A1599,\"Yes\"))","v":""}]
[1595,"Reimold, Nolan",{"$f":"IF(ISNA(IF(VLOOKUP(A1600,Draft!E:E,1,FALSE)=A1600,\"Yes\")),\"\",IF(VLOOKUP(A1600,Draft!E:E,1,FALSE)=A1600,\"Yes\"))","v":""}]
[1596,"Guerrero, Vladimir",{"$f":"IF(ISNA(IF(VLOOKUP(A1601,Draft!E:E,1,FALSE)=A1601,\"Yes\")),\"\",IF(VLOOKUP(A1601,Draft!E:E,1,FALSE)=A1601,\"Yes\"))","v":"Yes"}]
[1597,"Young, Delmon",{"$f":"IF(ISNA(IF(VLOOKUP(A1602,Draft!E:E,1,FALSE)=A1602,\"Yes\")),\"\",IF(VLOOKUP(A1602,Draft!E:E,1,FALSE)=A1602,\"Yes\"))","v":""}]
[1598,"Quentin, Carlos",{"$f":"IF(ISNA(IF(VLOOKUP(A1603,Draft!E:E,1,FALSE)=A1603,\"Yes\")),\"\",IF(VLOOKUP(A1603,Draft!E:E,1,FALSE)=A1603,\"Yes\"))","v":"Yes"}]
[1599,"Maier, Mitch",{"$f":"IF(ISNA(IF(VLOOKUP(A1604,Draft!E:E,1,FALSE)=A1604,\"Yes\")),\"\",IF(VLOOKUP(A1604,Draft!E:E,1,FALSE)=A1604,\"Yes\"))","v":""}]
[1600,"Hamilton, Josh",{"$f":"IF(ISNA(IF(VLOOKUP(A1605,Draft!E:E,1,FALSE)=A1605,\"Yes\")),\"\",IF(VLOOKUP(A1605,Draft!E:E,1,FALSE)=A1605,\"Yes\"))","v":"Yes"}]
[1601,"Matthews, Gary",{"$f":"IF(ISNA(IF(VLOOKUP(A1606,Draft!E:E,1,FALSE)=A1606,\"Yes\")),\"\",IF(VLOOKUP(A1606,Draft!E:E,1,FALSE)=A1606,\"Yes\"))","v":""}]
[1602,"Jones, Andruw",{"$f":"IF(ISNA(IF(VLOOKUP(A1607,Draft!E:E,1,FALSE)=A1607,\"Yes\")),\"\",IF(VLOOKUP(A1607,Draft!E:E,1,FALSE)=A1607,\"Yes\"))","v":""}]
[1603,"Guillen, Carlos",{"$f":"IF(ISNA(IF(VLOOKUP(A1608,Draft!E:E,1,FALSE)=A1608,\"Yes\")),\"\",IF(VLOOKUP(A1608,Draft!E:E,1,FALSE)=A1608,\"Yes\"))","v":""}]
[1604,"Guillen, Jose",{"$f":"IF(ISNA(IF(VLOOKUP(A1609,Draft!E:E,1,FALSE)=A1609,\"Yes\")),\"\",IF(VLOOKUP(A1609,Draft!E:E,1,FALSE)=A1609,\"Yes\"))","v":""}]
[1605,"Thomas, Clete",{"$f":"IF(ISNA(IF(VLOOKUP(A1610,Draft!E:E,1,FALSE)=A1610,\"Yes\")),\"\",IF(VLOOKUP(A1610,Draft!E:E,1,FALSE)=A1610,\"Yes\"))","v":""}]
[1606,"Raburn, Ryan",{"$f":"IF(ISNA(IF(VLOOKUP(A1611,Draft!E:E,1,FALSE)=A1611,\"Yes\")),\"\",IF(VLOOKUP(A1611,Draft!E:E,1,FALSE)=A1611,\"Yes\"))","v":""}]
[1607,"Gardner, Brett",{"$f":"IF(ISNA(IF(VLOOKUP(A1612,Draft!E:E,1,FALSE)=A1612,\"Yes\")),\"\",IF(VLOOKUP(A1612,Draft!E:E,1,FALSE)=A1612,\"Yes\"))","v":""}]
[1608,"Pie, Felix",{"$f":"IF(ISNA(IF(VLOOKUP(A1613,Draft!E:E,1,FALSE)=A1613,\"Yes\")),\"\",IF(VLOOKUP(A1613,Draft!E:E,1,FALSE)=A1613,\"Yes\"))","v":""}]
[1609,"Snider, Travis",{"$f":"IF(ISNA(IF(VLOOKUP(A1614,Draft!E:E,1,FALSE)=A1614,\"Yes\")),\"\",IF(VLOOKUP(A1614,Draft!E:E,1,FALSE)=A1614,\"Yes\"))","v":""}]
[1610,"Kapler, Gabe",{"$f":"IF(ISNA(IF(VLOOKUP(A1615,Draft!E:E,1,FALSE)=A1615,\"Yes\")),\"\",IF(VLOOKUP(A1615,Draft!E:E,1,FALSE)=A1615,\"Yes\"))","v":""}]
[1611,"Anderson, BrianN.",{"$f":"IF(ISNA(IF(VLOOKUP(A1616,Draft!E:E,1,FALSE)=A1616,\"Yes\")),\"\",IF(VLOOKUP(A1616,Draft!E:E,1,FALSE)=A1616,\"Yes\"))","v":""}]
[1612,"Kearns, Austin",{"$f":"IF(ISNA(IF(VLOOKUP(A1617,Draft!E:E,1,FALSE)=A1617,\"Yes\")),\"\",IF(VLOOKUP(A1617,Draft!E:E,1,FALSE)=A1617,\"Yes\"))","v":""}]
[1613,"Crisp, Coco",{"$f":"IF(ISNA(IF(VLOOKUP(A1618,Draft!E:E,1,FALSE)=A1618,\"Yes\")),\"\",IF(VLOOKUP(A1618,Draft!E:E,1,FALSE)=A1618,\"Yes\"))","v":""}]
[1614,"Kotsay, Mark",{"$f":"IF(ISNA(IF(VLOOKUP(A1619,Draft!E:E,1,FALSE)=A1619,\"Yes\")),\"\",IF(VLOOKUP(A1619,Draft!E:E,1,FALSE)=A1619,\"Yes\"))","v":""}]
[1615,"LaPorta, Matthew",{"$f":"IF(ISNA(IF(VLOOKUP(A1620,Draft!E:E,1,FALSE)=A1620,\"Yes\")),\"\",IF(VLOOKUP(A1620,Draft!E:E,1,FALSE)=A1620,\"Yes\"))","v":""}]
[1616,"Crowe, Trevor",{"$f":"IF(ISNA(IF(VLOOKUP(A1621,Draft!E:E,1,FALSE)=A1621,\"Yes\")),\"\",IF(VLOOKUP(A1621,Draft!E:E,1,FALSE)=A1621,\"Yes\"))","v":""}]
[1617,"Reed, Jeremy",{"$f":"IF(ISNA(IF(VLOOKUP(A1622,Draft!E:E,1,FALSE)=A1622,\"Yes\")),\"\",IF(VLOOKUP(A1622,Draft!E:E,1,FALSE)=A1622,\"Yes\"))","v":""}]
[1618,"Borbon, Julio",{"$f":"IF(ISNA(IF(VLOOKUP(A1623,Draft!E:E,1,FALSE)=A1623,\"Yes\")),\"\",IF(VLOOKUP(A1623,Draft!E:E,1,FALSE)=A1623,\"Yes\"))","v":""}]
[1619,"Saunders, Michael",{"$f":"IF(ISNA(IF(VLOOKUP(A1624,Draft!E:E,1,FALSE)=A1624,\"Yes\")),\"\",IF(VLOOKUP(A1624,Draft!E:E,1,FALSE)=A1624,\"Yes\"))","v":""}]
[1620,"Brantley, Michael",{"$f":"IF(ISNA(IF(VLOOKUP(A1625,Draft!E:E,1,FALSE)=A1625,\"Yes\")),\"\",IF(VLOOKUP(A1625,Draft!E:E,1,FALSE)=A1625,\"Yes\"))","v":""}]
[1621,"Langerhans, Ryan",{"$f":"IF(ISNA(IF(VLOOKUP(A1626,Draft!E:E,1,FALSE)=A1626,\"Yes\")),\"\",IF(VLOOKUP(A1626,Draft!E:E,1,FALSE)=A1626,\"Yes\"))","v":""}]
[1622,"Buck, Travis",{"$f":"IF(ISNA(IF(VLOOKUP(A1627,Draft!E:E,1,FALSE)=A1627,\"Yes\")),\"\",IF(VLOOKUP(A1627,Draft!E:E,1,FALSE)=A1627,\"Yes\"))","v":""}]
[1623,"Patterson, Eric",{"$f":"IF(ISNA(IF(VLOOKUP(A1628,Draft!E:E,1,FALSE)=A1628,\"Yes\")),\"\",IF(VLOOKUP(A1628,Draft!E:E,1,FALSE)=A1628,\"Yes\"))","v":""}]
[1624,"Inglett, Joe",{"$f":"IF(ISNA(IF(VLOOKUP(A1629,Draft!E:E,1,FALSE)=A1629,\"Yes\")),\"\",IF(VLOOKUP(A1629,Draft!E:E,1,FALSE)=A1629,\"Yes\"))","v":""}]
[1625,"Montanez, Lou",{"$f":"IF(ISNA(IF(VLOOKUP(A1630,Draft!E:E,1,FALSE)=A1630,\"Yes\")),\"\",IF(VLOOKUP(A1630,Draft!E:E,1,FALSE)=A1630,\"Yes\"))","v":""}]
[1626,"Willits, Reggie",{"$f":"IF(ISNA(IF(VLOOKUP(A1631,Draft!E:E,1,FALSE)=A1631,\"Yes\")),\"\",IF(VLOOKUP(A1631,Draft!E:E,1,FALSE)=A1631,\"Yes\"))","v":""}]
[1627,"Reddick, Josh",{"$f":"IF(ISNA(IF(VLOOKUP(A1632,Draft!E:E,1,FALSE)=A1632,\"Yes\")),\"\",IF(VLOOKUP(A1632,Draft!E:E,1,FALSE)=A1632,\"Yes\"))","v":""}]
[1628,"Kelly, Don",{"$f":"IF(ISNA(IF(VLOOKUP(A1633,Draft!E:E,1,FALSE)=A1633,\"Yes\")),\"\",IF(VLOOKUP(A1633,Draft!E:E,1,FALSE)=A1633,\"Yes\"))","v":""}]
[1629,"Joyce, Matt",{"$f":"IF(ISNA(IF(VLOOKUP(A1634,Draft!E:E,1,FALSE)=A1634,\"Yes\")),\"\",IF(VLOOKUP(A1634,Draft!E:E,1,FALSE)=A1634,\"Yes\"))","v":""}]
[1630,"Perez, Fernando",{"$f":"IF(ISNA(IF(VLOOKUP(A1635,Draft!E:E,1,FALSE)=A1635,\"Yes\")),\"\",IF(VLOOKUP(A1635,Draft!E:E,1,FALSE)=A1635,\"Yes\"))","v":""}]
[1631,"Gathright, Joey",{"$f":"IF(ISNA(IF(VLOOKUP(A1636,Draft!E:E,1,FALSE)=A1636,\"Yes\")),\"\",IF(VLOOKUP(A1636,Draft!E:E,1,FALSE)=A1636,\"Yes\"))","v":""}]
[1632,"Patterson, Corey",{"$f":"IF(ISNA(IF(VLOOKUP(A1637,Draft!E:E,1,FALSE)=A1637,\"Yes\")),\"\",IF(VLOOKUP(A1637,Draft!E:E,1,FALSE)=A1637,\"Yes\"))","v":""}]
[1633,"Padilla, Jorge",{"$f":"IF(ISNA(IF(VLOOKUP(A1638,Draft!E:E,1,FALSE)=A1638,\"Yes\")),\"\",IF(VLOOKUP(A1638,Draft!E:E,1,FALSE)=A1638,\"Yes\"))","v":""}]
[1634,"DeAza, Alejandro",{"$f":"IF(ISNA(IF(VLOOKUP(A1639,Draft!E:E,1,FALSE)=A1639,\"Yes\")),\"\",IF(VLOOKUP(A1639,Draft!E:E,1,FALSE)=A1639,\"Yes\"))","v":""}]
[1635,"Hoffmann, Jamie",{"$f":"IF(ISNA(IF(VLOOKUP(A1640,Draft!E:E,1,FALSE)=A1640,\"Yes\")),\"\",IF(VLOOKUP(A1640,Draft!E:E,1,FALSE)=A1640,\"Yes\"))","v":""}]
[1636,"Carson, Matt",{"$f":"IF(ISNA(IF(VLOOKUP(A1641,Draft!E:E,1,FALSE)=A1641,\"Yes\")),\"\",IF(VLOOKUP(A1641,Draft!E:E,1,FALSE)=A1641,\"Yes\"))","v":""}]
[1637,"Gentry, Craig",{"$f":"IF(ISNA(IF(VLOOKUP(A1642,Draft!E:E,1,FALSE)=A1642,\"Yes\")),\"\",IF(VLOOKUP(A1642,Draft!E:E,1,FALSE)=A1642,\"Yes\"))","v":""}]
[1638,"Boggs, Brandon",{"$f":"IF(ISNA(IF(VLOOKUP(A1643,Draft!E:E,1,FALSE)=A1643,\"Yes\")),\"\",IF(VLOOKUP(A1643,Draft!E:E,1,FALSE)=A1643,\"Yes\"))","v":""}]
[1639,"Duncan, Shelley",{"$f":"IF(ISNA(IF(VLOOKUP(A1644,Draft!E:E,1,FALSE)=A1644,\"Yes\")),\"\",IF(VLOOKUP(A1644,Draft!E:E,1,FALSE)=A1644,\"Yes\"))","v":""}]
[1640,"Ramirez, Wilkin",{"$f":"IF(ISNA(IF(VLOOKUP(A1645,Draft!E:E,1,FALSE)=A1645,\"Yes\")),\"\",IF(VLOOKUP(A1645,Draft!E:E,1,FALSE)=A1645,\"Yes\"))","v":""}]
[1641,"Evans, Terry",{"$f":"IF(ISNA(IF(VLOOKUP(A1646,Draft!E:E,1,FALSE)=A1646,\"Yes\")),\"\",IF(VLOOKUP(A1646,Draft!E:E,1,FALSE)=A1646,\"Yes\"))","v":""}]
[1642,"Pettit, Chris",{"$f":"IF(ISNA(IF(VLOOKUP(A1647,Draft!E:E,1,FALSE)=A1647,\"Yes\")),\"\",IF(VLOOKUP(A1647,Draft!E:E,1,FALSE)=A1647,\"Yes\"))","v":""}]
[1643,"Golson, Greg",{"$f":"IF(ISNA(IF(VLOOKUP(A1648,Draft!E:E,1,FALSE)=A1648,\"Yes\")),\"\",IF(VLOOKUP(A1648,Draft!E:E,1,FALSE)=A1648,\"Yes\"))","v":""}]
[1644,"Costa, Shane",{"$f":"IF(ISNA(IF(VLOOKUP(A1649,Draft!E:E,1,FALSE)=A1649,\"Yes\")),\"\",IF(VLOOKUP(A1649,Draft!E:E,1,FALSE)=A1649,\"Yes\"))","v":""}]
[1645,"Thorman, Scott",{"$f":"IF(ISNA(IF(VLOOKUP(A1650,Draft!E:E,1,FALSE)=A1650,\"Yes\")),\"\",IF(VLOOKUP(A1650,Draft!E:E,1,FALSE)=A1650,\"Yes\"))","v":""}]
[1646,"Ruggiano, Justin",{"$f":"IF(ISNA(IF(VLOOKUP(A1651,Draft!E:E,1,FALSE)=A1651,\"Yes\")),\"\",IF(VLOOKUP(A1651,Draft!E:E,1,FALSE)=A1651,\"Yes\"))","v":""}]
[1647,"Coats, Buck",{"$f":"IF(ISNA(IF(VLOOKUP(A1652,Draft!E:E,1,FALSE)=A1652,\"Yes\")),\"\",IF(VLOOKUP(A1652,Draft!E:E,1,FALSE)=A1652,\"Yes\"))","v":""}]
[1648,"Pridie, Jason",{"$f":"IF(ISNA(IF(VLOOKUP(A1653,Draft!E:E,1,FALSE)=A1653,\"Yes\")),\"\",IF(VLOOKUP(A1653,Draft!E:E,1,FALSE)=A1653,\"Yes\"))","v":""}]
[1649,"Kalish, Ryan",{"$f":"IF(ISNA(IF(VLOOKUP(A1654,Draft!E:E,1,FALSE)=A1654,\"Yes\")),\"\",IF(VLOOKUP(A1654,Draft!E:E,1,FALSE)=A1654,\"Yes\"))","v":""}]
[1650,"Westmoreland, Ryan",{"$f":"IF(ISNA(IF(VLOOKUP(A1655,Draft!E:E,1,FALSE)=A1655,\"Yes\")),\"\",IF(VLOOKUP(A1655,Draft!E:E,1,FALSE)=A1655,\"Yes\"))","v":""}]
[1651,"Fuentes, Reymond",{"$f":"IF(ISNA(IF(VLOOKUP(A1656,Draft!E:E,1,FALSE)=A1656,\"Yes\")),\"\",IF(VLOOKUP(A1656,Draft!E:E,1,FALSE)=A1656,\"Yes\"))","v":""}]
[1652,"Hazelbaker, Jeremy",{"$f":"IF(ISNA(IF(VLOOKUP(A1657,Draft!E:E,1,FALSE)=A1657,\"Yes\")),\"\",IF(VLOOKUP(A1657,Draft!E:E,1,FALSE)=A1657,\"Yes\"))","v":""}]
[1653,"Bourjos, Peter",{"$f":"IF(ISNA(IF(VLOOKUP(A1658,Draft!E:E,1,FALSE)=A1658,\"Yes\")),\"\",IF(VLOOKUP(A1658,Draft!E:E,1,FALSE)=A1658,\"Yes\"))","v":""}]
[1654,"Grichuk, Randal",{"$f":"IF(ISNA(IF(VLOOKUP(A1659,Draft!E:E,1,FALSE)=A1659,\"Yes\")),\"\",IF(VLOOKUP(A1659,Draft!E:E,1,FALSE)=A1659,\"Yes\"))","v":""}]
[1655,"Trout, Michael",{"$f":"IF(ISNA(IF(VLOOKUP(A1660,Draft!E:E,1,FALSE)=A1660,\"Yes\")),\"\",IF(VLOOKUP(A1660,Draft!E:E,1,FALSE)=A1660,\"Yes\"))","v":""}]
[1656,"Danks, Jordan",{"$f":"IF(ISNA(IF(VLOOKUP(A1661,Draft!E:E,1,FALSE)=A1661,\"Yes\")),\"\",IF(VLOOKUP(A1661,Draft!E:E,1,FALSE)=A1661,\"Yes\"))","v":""}]
[1657,"Mitchell, Jared",{"$f":"IF(ISNA(IF(VLOOKUP(A1662,Draft!E:E,1,FALSE)=A1662,\"Yes\")),\"\",IF(VLOOKUP(A1662,Draft!E:E,1,FALSE)=A1662,\"Yes\"))","v":""}]
[1658,"Thompson, Trayce",{"$f":"IF(ISNA(IF(VLOOKUP(A1663,Draft!E:E,1,FALSE)=A1663,\"Yes\")),\"\",IF(VLOOKUP(A1663,Draft!E:E,1,FALSE)=A1663,\"Yes\"))","v":""}]
[1659,"Gartrell, Stefan",{"$f":"IF(ISNA(IF(VLOOKUP(A1664,Draft!E:E,1,FALSE)=A1664,\"Yes\")),\"\",IF(VLOOKUP(A1664,Draft!E:E,1,FALSE)=A1664,\"Yes\"))","v":""}]
[1660,"Weglarz, Nick",{"$f":"IF(ISNA(IF(VLOOKUP(A1665,Draft!E:E,1,FALSE)=A1665,\"Yes\")),\"\",IF(VLOOKUP(A1665,Draft!E:E,1,FALSE)=A1665,\"Yes\"))","v":""}]
[1661,"Brown, Jordan",{"$f":"IF(ISNA(IF(VLOOKUP(A1666,Draft!E:E,1,FALSE)=A1666,\"Yes\")),\"\",IF(VLOOKUP(A1666,Draft!E:E,1,FALSE)=A1666,\"Yes\"))","v":""}]
[1662,"Kipnis, Jason",{"$f":"IF(ISNA(IF(VLOOKUP(A1667,Draft!E:E,1,FALSE)=A1667,\"Yes\")),\"\",IF(VLOOKUP(A1667,Draft!E:E,1,FALSE)=A1667,\"Yes\"))","v":""}]
[1663,"Jackson, Austin",{"$f":"IF(ISNA(IF(VLOOKUP(A1668,Draft!E:E,1,FALSE)=A1668,\"Yes\")),\"\",IF(VLOOKUP(A1668,Draft!E:E,1,FALSE)=A1668,\"Yes\"))","v":""}]
[1664,"Wells, Casper",{"$f":"IF(ISNA(IF(VLOOKUP(A1669,Draft!E:E,1,FALSE)=A1669,\"Yes\")),\"\",IF(VLOOKUP(A1669,Draft!E:E,1,FALSE)=A1669,\"Yes\"))","v":""}]
[1665,"Parraz, Jordan",{"$f":"IF(ISNA(IF(VLOOKUP(A1670,Draft!E:E,1,FALSE)=A1670,\"Yes\")),\"\",IF(VLOOKUP(A1670,Draft!E:E,1,FALSE)=A1670,\"Yes\"))","v":""}]
[1666,"Revere, Ben",{"$f":"IF(ISNA(IF(VLOOKUP(A1671,Draft!E:E,1,FALSE)=A1671,\"Yes\")),\"\",IF(VLOOKUP(A1671,Draft!E:E,1,FALSE)=A1671,\"Yes\"))","v":""}]
[1667,"Hicks, Aaron",{"$f":"IF(ISNA(IF(VLOOKUP(A1672,Draft!E:E,1,FALSE)=A1672,\"Yes\")),\"\",IF(VLOOKUP(A1672,Draft!E:E,1,FALSE)=A1672,\"Yes\"))","v":""}]
[1668,"Heathcott, Zachary",{"$f":"IF(ISNA(IF(VLOOKUP(A1673,Draft!E:E,1,FALSE)=A1673,\"Yes\")),\"\",IF(VLOOKUP(A1673,Draft!E:E,1,FALSE)=A1673,\"Yes\"))","v":""}]
[1669,"Desme, Grant",{"$f":"IF(ISNA(IF(VLOOKUP(A1674,Draft!E:E,1,FALSE)=A1674,\"Yes\")),\"\",IF(VLOOKUP(A1674,Draft!E:E,1,FALSE)=A1674,\"Yes\"))","v":""}]
[1670,"Taylor, Michael",{"$f":"IF(ISNA(IF(VLOOKUP(A1675,Draft!E:E,1,FALSE)=A1675,\"Yes\")),\"\",IF(VLOOKUP(A1675,Draft!E:E,1,FALSE)=A1675,\"Yes\"))","v":"Yes"}]
[1671,"Halman, Gregory",{"$f":"IF(ISNA(IF(VLOOKUP(A1676,Draft!E:E,1,FALSE)=A1676,\"Yes\")),\"\",IF(VLOOKUP(A1676,Draft!E:E,1,FALSE)=A1676,\"Yes\"))","v":""}]
[1672,"Chavez, Yohermyn",{"$f":"IF(ISNA(IF(VLOOKUP(A1677,Draft!E:E,1,FALSE)=A1677,\"Yes\")),\"\",IF(VLOOKUP(A1677,Draft!E:E,1,FALSE)=A1677,\"Yes\"))","v":""}]
[1673,"Ackley, Dustin",{"$f":"IF(ISNA(IF(VLOOKUP(A1678,Draft!E:E,1,FALSE)=A1678,\"Yes\")),\"\",IF(VLOOKUP(A1678,Draft!E:E,1,FALSE)=A1678,\"Yes\"))","v":""}]
[1674,"Carrera, Ezequiel",{"$f":"IF(ISNA(IF(VLOOKUP(A1679,Draft!E:E,1,FALSE)=A1679,\"Yes\")),\"\",IF(VLOOKUP(A1679,Draft!E:E,1,FALSE)=A1679,\"Yes\"))","v":""}]
[1675,"Lubanski, Chris",{"$f":"IF(ISNA(IF(VLOOKUP(A1680,Draft!E:E,1,FALSE)=A1680,\"Yes\")),\"\",IF(VLOOKUP(A1680,Draft!E:E,1,FALSE)=A1680,\"Yes\"))","v":""}]
[1676,"Marisnick, Jake",{"$f":"IF(ISNA(IF(VLOOKUP(A1681,Draft!E:E,1,FALSE)=A1681,\"Yes\")),\"\",IF(VLOOKUP(A1681,Draft!E:E,1,FALSE)=A1681,\"Yes\"))","v":""}]
[1677,"Jennings, Desmond",{"$f":"IF(ISNA(IF(VLOOKUP(A1682,Draft!E:E,1,FALSE)=A1682,\"Yes\")),\"\",IF(VLOOKUP(A1682,Draft!E:E,1,FALSE)=A1682,\"Yes\"))","v":""}]
[1678,"Colome, Alexander",{"$f":"IF(ISNA(IF(VLOOKUP(A1683,Draft!E:E,1,FALSE)=A1683,\"Yes\")),\"\",IF(VLOOKUP(A1683,Draft!E:E,1,FALSE)=A1683,\"Yes\"))","v":""}]
[1679,"(Sano) Jean, Miguel",{"$f":"IF(ISNA(IF(VLOOKUP(A1684,Draft!E:E,1,FALSE)=A1684,\"Yes\")),\"\",IF(VLOOKUP(A1684,Draft!E:E,1,FALSE)=A1684,\"Yes\"))","v":""}]
[1680,"Noriega, Gabriel",{"$f":"IF(ISNA(IF(VLOOKUP(A1685,Draft!E:E,1,FALSE)=A1685,\"Yes\")),\"\",IF(VLOOKUP(A1685,Draft!E:E,1,FALSE)=A1685,\"Yes\"))","v":""}]
[1681,"Pineiro, Joel",{"$f":"IF(ISNA(IF(VLOOKUP(A1686,Draft!E:E,1,FALSE)=A1686,\"Yes\")),\"\",IF(VLOOKUP(A1686,Draft!E:E,1,FALSE)=A1686,\"Yes\"))","v":""}]
[1682,"Hall, Toby",{"$f":"IF(ISNA(IF(VLOOKUP(A1687,Draft!E:E,1,FALSE)=A1687,\"Yes\")),\"\",IF(VLOOKUP(A1687,Draft!E:E,1,FALSE)=A1687,\"Yes\"))","v":""}]
[1683,"Hill, Shawn",{"$f":"IF(ISNA(IF(VLOOKUP(A1688,Draft!E:E,1,FALSE)=A1688,\"Yes\")),\"\",IF(VLOOKUP(A1688,Draft!E:E,1,FALSE)=A1688,\"Yes\"))","v":""}]
[1684,"Silverio, Juan",{"$f":"IF(ISNA(IF(VLOOKUP(A1689,Draft!E:E,1,FALSE)=A1689,\"Yes\")),\"\",IF(VLOOKUP(A1689,Draft!E:E,1,FALSE)=A1689,\"Yes\"))","v":""}]
[1685,"Duffy, Daniel",{"$f":"IF(ISNA(IF(VLOOKUP(A1690,Draft!E:E,1,FALSE)=A1690,\"Yes\")),\"\",IF(VLOOKUP(A1690,Draft!E:E,1,FALSE)=A1690,\"Yes\"))","v":""}]
[1687,"Betances, Dellin",{"$f":"IF(ISNA(IF(VLOOKUP(A1691,Draft!E:E,1,FALSE)=A1691,\"Yes\")),\"\",IF(VLOOKUP(A1691,Draft!E:E,1,FALSE)=A1691,\"Yes\"))","v":""}]
[1688,"Doolittle, Sean",{"$f":"IF(ISNA(IF(VLOOKUP(A1692,Draft!E:E,1,FALSE)=A1692,\"Yes\")),\"\",IF(VLOOKUP(A1692,Draft!E:E,1,FALSE)=A1692,\"Yes\"))","v":""}]
[1689,"Beltre, Engel",{"$f":"IF(ISNA(IF(VLOOKUP(A1693,Draft!E:E,1,FALSE)=A1693,\"Yes\")),\"\",IF(VLOOKUP(A1693,Draft!E:E,1,FALSE)=A1693,\"Yes\"))","v":""}]
[1690,"Mills, Beau",{"$f":"IF(ISNA(IF(VLOOKUP(A1694,Draft!E:E,1,FALSE)=A1694,\"Yes\")),\"\",IF(VLOOKUP(A1694,Draft!E:E,1,FALSE)=A1694,\"Yes\"))","v":""}]
[1691,"Ankiel, Rick",{"$f":"IF(ISNA(IF(VLOOKUP(A1695,Draft!E:E,1,FALSE)=A1695,\"Yes\")),\"\",IF(VLOOKUP(A1695,Draft!E:E,1,FALSE)=A1695,\"Yes\"))","v":""}]
[1692,"Johnson, Dan",{"$f":"IF(ISNA(IF(VLOOKUP(A1696,Draft!E:E,1,FALSE)=A1696,\"Yes\")),\"\",IF(VLOOKUP(A1696,Draft!E:E,1,FALSE)=A1696,\"Yes\"))","v":""}]
[1693,"Tejada, Miguel",{"$f":"IF(ISNA(IF(VLOOKUP(A1697,Draft!E:E,1,FALSE)=A1697,\"Yes\")),\"\",IF(VLOOKUP(A1697,Draft!E:E,1,FALSE)=A1697,\"Yes\"))","v":"Yes"}]
[1694,"Thome, Jim",{"$f":"IF(ISNA(IF(VLOOKUP(A1698,Draft!E:E,1,FALSE)=A1698,\"Yes\")),\"\",IF(VLOOKUP(A1698,Draft!E:E,1,FALSE)=A1698,\"Yes\"))","v":""}]
[1695,"Hilligoss, Mitch",{"$f":"IF(ISNA(IF(VLOOKUP(A1699,Draft!E:E,1,FALSE)=A1699,\"Yes\")),\"\",IF(VLOOKUP(A1699,Draft!E:E,1,FALSE)=A1699,\"Yes\"))","v":""}]
[1696,"Sheets, Ben",{"$f":"IF(ISNA(IF(VLOOKUP(A1700,Draft!E:E,1,FALSE)=A1700,\"Yes\")),\"\",IF(VLOOKUP(A1700,Draft!E:E,1,FALSE)=A1700,\"Yes\"))","v":"Yes"}]
[1697,"Shelby, John",{"$f":"IF(ISNA(IF(VLOOKUP(A1701,Draft!E:E,1,FALSE)=A1701,\"Yes\")),\"\",IF(VLOOKUP(A1701,Draft!E:E,1,FALSE)=A1701,\"Yes\"))","v":""}]
[1698,"Robertson, Tyler",{"$f":"IF(ISNA(IF(VLOOKUP(A1702,Draft!E:E,1,FALSE)=A1702,\"Yes\")),\"\",IF(VLOOKUP(A1702,Draft!E:E,1,FALSE)=A1702,\"Yes\"))","v":""}]
[1699,"Wang, Chien-ming",{"$f":"IF(ISNA(IF(VLOOKUP(A1703,Draft!E:E,1,FALSE)=A1703,\"Yes\")),\"\",IF(VLOOKUP(A1703,Draft!E:E,1,FALSE)=A1703,\"Yes\"))","v":""}]
[1700,"Bedard, Erik",{"$f":"IF(ISNA(IF(VLOOKUP(A1704,Draft!E:E,1,FALSE)=A1704,\"Yes\")),\"\",IF(VLOOKUP(A1704,Draft!E:E,1,FALSE)=A1704,\"Yes\"))","v":""}]
[1701,"Damon, Johnny",{"$f":"IF(ISNA(IF(VLOOKUP(A1705,Draft!E:E,1,FALSE)=A1705,\"Yes\")),\"\",IF(VLOOKUP(A1705,Draft!E:E,1,FALSE)=A1705,\"Yes\"))","v":""}]
[1702,"House, T.J.",{"$f":"IF(ISNA(IF(VLOOKUP(A1706,Draft!E:E,1,FALSE)=A1706,\"Yes\")),\"\",IF(VLOOKUP(A1706,Draft!E:E,1,FALSE)=A1706,\"Yes\"))","v":""}]
[1704,"Dye, Jermaine",{"$f":"IF(ISNA(IF(VLOOKUP(A1707,Draft!E:E,1,FALSE)=A1707,\"Yes\")),\"\",IF(VLOOKUP(A1707,Draft!E:E,1,FALSE)=A1707,\"Yes\"))","v":""}]
[1705,"Sanchez, Gary",{"$f":"IF(ISNA(IF(VLOOKUP(A1708,Draft!E:E,1,FALSE)=A1708,\"Yes\")),\"\",IF(VLOOKUP(A1708,Draft!E:E,1,FALSE)=A1708,\"Yes\"))","v":""}]
[1706,"Brown, Corey",{"$f":"IF(ISNA(IF(VLOOKUP(A1709,Draft!E:E,1,FALSE)=A1709,\"Yes\")),\"\",IF(VLOOKUP(A1709,Draft!E:E,1,FALSE)=A1709,\"Yes\"))","v":""}]
[1707,"Barness, Nick",{"$f":"IF(ISNA(IF(VLOOKUP(A1710,Draft!E:E,1,FALSE)=A1710,\"Yes\")),\"\",IF(VLOOKUP(A1710,Draft!E:E,1,FALSE)=A1710,\"Yes\"))","v":""}]
[1708,"Bleich, Jeremy",{"$f":"IF(ISNA(IF(VLOOKUP(A1711,Draft!E:E,1,FALSE)=A1711,\"Yes\")),\"\",IF(VLOOKUP(A1711,Draft!E:E,1,FALSE)=A1711,\"Yes\"))","v":""}]
[1709,"Byrnes, Eric",{"$f":"IF(ISNA(IF(VLOOKUP(A1712,Draft!E:E,1,FALSE)=A1712,\"Yes\")),\"\",IF(VLOOKUP(A1712,Draft!E:E,1,FALSE)=A1712,\"Yes\"))","v":""}]
[1710,"Iorg, Cale",{"$f":"IF(ISNA(IF(VLOOKUP(A1713,Draft!E:E,1,FALSE)=A1713,\"Yes\")),\"\",IF(VLOOKUP(A1713,Draft!E:E,1,FALSE)=A1713,\"Yes\"))","v":""}]
[1711,"Garko, Ryan",{"$f":"IF(ISNA(IF(VLOOKUP(A1714,Draft!E:E,1,FALSE)=A1714,\"Yes\")),\"\",IF(VLOOKUP(A1714,Draft!E:E,1,FALSE)=A1714,\"Yes\"))","v":""}]
[1712,"Gross, Gabe",{"$f":"IF(ISNA(IF(VLOOKUP(A1715,Draft!E:E,1,FALSE)=A1715,\"Yes\")),\"\",IF(VLOOKUP(A1715,Draft!E:E,1,FALSE)=A1715,\"Yes\"))","v":""}]
[1713,"Lewis, Scott",{"$f":"IF(ISNA(IF(VLOOKUP(A1716,Draft!E:E,1,FALSE)=A1716,\"Yes\")),\"\",IF(VLOOKUP(A1716,Draft!E:E,1,FALSE)=A1716,\"Yes\"))","v":""}]
[1714,"Sanchez, Humberto",{"$f":"IF(ISNA(IF(VLOOKUP(A1717,Draft!E:E,1,FALSE)=A1717,\"Yes\")),\"\",IF(VLOOKUP(A1717,Draft!E:E,1,FALSE)=A1717,\"Yes\"))","v":""}]
[1715,"Hunter, Shooter",{"$f":"IF(ISNA(IF(VLOOKUP(A1718,Draft!E:E,1,FALSE)=A1718,\"Yes\")),\"\",IF(VLOOKUP(A1718,Draft!E:E,1,FALSE)=A1718,\"Yes\"))","v":""}]
[1716,"Kiker, Kasey",{"$f":"IF(ISNA(IF(VLOOKUP(A1719,Draft!E:E,1,FALSE)=A1719,\"Yes\")),\"\",IF(VLOOKUP(A1719,Draft!E:E,1,FALSE)=A1719,\"Yes\"))","v":""}]
[1717,"Washburn, Jarrod",{"$f":"IF(ISNA(IF(VLOOKUP(A1720,Draft!E:E,1,FALSE)=A1720,\"Yes\")),\"\",IF(VLOOKUP(A1720,Draft!E:E,1,FALSE)=A1720,\"Yes\"))","v":""}]
[1718,"Pimentel, Guillermo",{"$f":"IF(ISNA(IF(VLOOKUP(A1721,Draft!E:E,1,FALSE)=A1721,\"Yes\")),\"\",IF(VLOOKUP(A1721,Draft!E:E,1,FALSE)=A1721,\"Yes\"))","v":""}]
[1719,"Hinckley, Mike",{"$f":"IF(ISNA(IF(VLOOKUP(A1722,Draft!E:E,1,FALSE)=A1722,\"Yes\")),\"\",IF(VLOOKUP(A1722,Draft!E:E,1,FALSE)=A1722,\"Yes\"))","v":""}]
[1720,"Torres, Carlos",{"$f":"IF(ISNA(IF(VLOOKUP(A1723,Draft!E:E,1,FALSE)=A1723,\"Yes\")),\"\",IF(VLOOKUP(A1723,Draft!E:E,1,FALSE)=A1723,\"Yes\"))","v":""}]
[1721,"Jackson, Justin",{"$f":"IF(ISNA(IF(VLOOKUP(A1724,Draft!E:E,1,FALSE)=A1724,\"Yes\")),\"\",IF(VLOOKUP(A1724,Draft!E:E,1,FALSE)=A1724,\"Yes\"))","v":""}]
[1722,"Almanzar, Michael",{"$f":"IF(ISNA(IF(VLOOKUP(A1725,Draft!E:E,1,FALSE)=A1725,\"Yes\")),\"\",IF(VLOOKUP(A1725,Draft!E:E,1,FALSE)=A1725,\"Yes\"))","v":""}]
[1723,"Fuenmayor, Balbino",{"$f":"IF(ISNA(IF(VLOOKUP(A1726,Draft!E:E,1,FALSE)=A1726,\"Yes\")),\"\",IF(VLOOKUP(A1726,Draft!E:E,1,FALSE)=A1726,\"Yes\"))","v":""}]
[1724,"Gutierrez, Carlos",{"$f":"IF(ISNA(IF(VLOOKUP(A1727,Draft!E:E,1,FALSE)=A1727,\"Yes\")),\"\",IF(VLOOKUP(A1727,Draft!E:E,1,FALSE)=A1727,\"Yes\"))","v":""}]
[1725,"Denker, Travis",{"$f":"IF(ISNA(IF(VLOOKUP(A1728,Draft!E:E,1,FALSE)=A1728,\"Yes\")),\"\",IF(VLOOKUP(A1728,Draft!E:E,1,FALSE)=A1728,\"Yes\"))","v":""}]
[1726,"Middlebrooks, Will",{"$f":"IF(ISNA(IF(VLOOKUP(A1729,Draft!E:E,1,FALSE)=A1729,\"Yes\")),\"\",IF(VLOOKUP(A1729,Draft!E:E,1,FALSE)=A1729,\"Yes\"))","v":""}]
[1727,"Simmons, James",{"$f":"IF(ISNA(IF(VLOOKUP(A1730,Draft!E:E,1,FALSE)=A1730,\"Yes\")),\"\",IF(VLOOKUP(A1730,Draft!E:E,1,FALSE)=A1730,\"Yes\"))","v":""}]
[1728,"Beaven, Blake",{"$f":"IF(ISNA(IF(VLOOKUP(A1731,Draft!E:E,1,FALSE)=A1731,\"Yes\")),\"\",IF(VLOOKUP(A1731,Draft!E:E,1,FALSE)=A1731,\"Yes\"))","v":""}]
[1729,"Venditte, Pat",{"$f":"IF(ISNA(IF(VLOOKUP(A1732,Draft!E:E,1,FALSE)=A1732,\"Yes\")),\"\",IF(VLOOKUP(A1732,Draft!E:E,1,FALSE)=A1732,\"Yes\"))","v":""}]
[1730,"Waring, Brandon",{"$f":"IF(ISNA(IF(VLOOKUP(A1733,Draft!E:E,1,FALSE)=A1733,\"Yes\")),\"\",IF(VLOOKUP(A1733,Draft!E:E,1,FALSE)=A1733,\"Yes\"))","v":""}]
[1731,"Nelson, Joe",{"$f":"IF(ISNA(IF(VLOOKUP(A1734,Draft!E:E,1,FALSE)=A1734,\"Yes\")),\"\",IF(VLOOKUP(A1734,Draft!E:E,1,FALSE)=A1734,\"Yes\"))","v":""}]
[1732,"Winn, Randy",{"$f":"IF(ISNA(IF(VLOOKUP(A1735,Draft!E:E,1,FALSE)=A1735,\"Yes\")),\"\",IF(VLOOKUP(A1735,Draft!E:E,1,FALSE)=A1735,\"Yes\"))","v":""}]
[1733,"Phillips, Heath",{"$f":"IF(ISNA(IF(VLOOKUP(A1736,Draft!E:E,1,FALSE)=A1736,\"Yes\")),\"\",IF(VLOOKUP(A1736,Draft!E:E,1,FALSE)=A1736,\"Yes\"))","v":""}]
[1734,"Alvarez, Henderson",{"$f":"IF(ISNA(IF(VLOOKUP(A1737,Draft!E:E,1,FALSE)=A1737,\"Yes\")),\"\",IF(VLOOKUP(A1737,Draft!E:E,1,FALSE)=A1737,\"Yes\"))","v":""}]
[1735,"Hudson, Orlando",{"$f":"IF(ISNA(IF(VLOOKUP(A1738,Draft!E:E,1,FALSE)=A1738,\"Yes\")),\"\",IF(VLOOKUP(A1738,Draft!E:E,1,FALSE)=A1738,\"Yes\"))","v":"Yes"}]
[1736,"Gregg, Kevin",{"$f":"IF(ISNA(IF(VLOOKUP(A1739,Draft!E:E,1,FALSE)=A1739,\"Yes\")),\"\",IF(VLOOKUP(A1739,Draft!E:E,1,FALSE)=A1739,\"Yes\"))","v":""}]
[1737,"Baldelli, Rocco",{"$f":"IF(ISNA(IF(VLOOKUP(A1740,Draft!E:E,1,FALSE)=A1740,\"Yes\")),\"\",IF(VLOOKUP(A1740,Draft!E:E,1,FALSE)=A1740,\"Yes\"))","v":""}]
[1739,"Tejada, Oscar",{"$f":"IF(ISNA(IF(VLOOKUP(A1741,Draft!E:E,1,FALSE)=A1741,\"Yes\")),\"\",IF(VLOOKUP(A1741,Draft!E:E,1,FALSE)=A1741,\"Yes\"))","v":""}]
[1740,"Thames, Marcus",{"$f":"IF(ISNA(IF(VLOOKUP(A1742,Draft!E:E,1,FALSE)=A1742,\"Yes\")),\"\",IF(VLOOKUP(A1742,Draft!E:E,1,FALSE)=A1742,\"Yes\"))","v":""}]
[1741,"Gorecki, Reid",{"$f":"IF(ISNA(IF(VLOOKUP(A1743,Draft!E:E,1,FALSE)=A1743,\"Yes\")),\"\",IF(VLOOKUP(A1743,Draft!E:E,1,FALSE)=A1743,\"Yes\"))","v":""}]
[1742,"Casto, Kory",{"$f":"IF(ISNA(IF(VLOOKUP(A1744,Draft!E:E,1,FALSE)=A1744,\"Yes\")),\"\",IF(VLOOKUP(A1744,Draft!E:E,1,FALSE)=A1744,\"Yes\"))","v":""}]
[1743,"Hendrickson, Mark",{"$f":"IF(ISNA(IF(VLOOKUP(A1745,Draft!E:E,1,FALSE)=A1745,\"Yes\")),\"\",IF(VLOOKUP(A1745,Draft!E:E,1,FALSE)=A1745,\"Yes\"))","v":""}]
[1744,"Colon, Bartolo",{"$f":"IF(ISNA(IF(VLOOKUP(A1746,Draft!E:E,1,FALSE)=A1746,\"Yes\")),\"\",IF(VLOOKUP(A1746,Draft!E:E,1,FALSE)=A1746,\"Yes\"))","v":""}]
[1745,"Ponson, Sidney",{"$f":"IF(ISNA(IF(VLOOKUP(A1747,Draft!E:E,1,FALSE)=A1747,\"Yes\")),\"\",IF(VLOOKUP(A1747,Draft!E:E,1,FALSE)=A1747,\"Yes\"))","v":""}]
[1746,"Benson, Kris",{"$f":"IF(ISNA(IF(VLOOKUP(A1748,Draft!E:E,1,FALSE)=A1748,\"Yes\")),\"\",IF(VLOOKUP(A1748,Draft!E:E,1,FALSE)=A1748,\"Yes\"))","v":""}]
[1747,"Wright, Jamey",{"$f":"IF(ISNA(IF(VLOOKUP(A1749,Draft!E:E,1,FALSE)=A1749,\"Yes\")),\"\",IF(VLOOKUP(A1749,Draft!E:E,1,FALSE)=A1749,\"Yes\"))","v":""}]
[1748,"Barajas, Rod",{"$f":"IF(ISNA(IF(VLOOKUP(A1750,Draft!E:E,1,FALSE)=A1750,\"Yes\")),\"\",IF(VLOOKUP(A1750,Draft!E:E,1,FALSE)=A1750,\"Yes\"))","v":"Yes"}]
[1749,"Molina, Jose",{"$f":"IF(ISNA(IF(VLOOKUP(A1751,Draft!E:E,1,FALSE)=A1751,\"Yes\")),\"\",IF(VLOOKUP(A1751,Draft!E:E,1,FALSE)=A1751,\"Yes\"))","v":""}]
[1750,"Branyan, Russell",{"$f":"IF(ISNA(IF(VLOOKUP(A1752,Draft!E:E,1,FALSE)=A1752,\"Yes\")),\"\",IF(VLOOKUP(A1752,Draft!E:E,1,FALSE)=A1752,\"Yes\"))","v":""}]
[1751,"Blalock, Hank",{"$f":"IF(ISNA(IF(VLOOKUP(A1753,Draft!E:E,1,FALSE)=A1753,\"Yes\")),\"\",IF(VLOOKUP(A1753,Draft!E:E,1,FALSE)=A1753,\"Yes\"))","v":""}]
[1752,"Jacobs, Mike",{"$f":"IF(ISNA(IF(VLOOKUP(A1754,Draft!E:E,1,FALSE)=A1754,\"Yes\")),\"\",IF(VLOOKUP(A1754,Draft!E:E,1,FALSE)=A1754,\"Yes\"))","v":""}]
[1753,"Barfield, Josh",{"$f":"IF(ISNA(IF(VLOOKUP(A1755,Draft!E:E,1,FALSE)=A1755,\"Yes\")),\"\",IF(VLOOKUP(A1755,Draft!E:E,1,FALSE)=A1755,\"Yes\"))","v":""}]
[1754,"Crede, Joe",{"$f":"IF(ISNA(IF(VLOOKUP(A1756,Draft!E:E,1,FALSE)=A1756,\"Yes\")),\"\",IF(VLOOKUP(A1756,Draft!E:E,1,FALSE)=A1756,\"Yes\"))","v":""}]
[1755,"Chavez, Endy",{"$f":"IF(ISNA(IF(VLOOKUP(A1757,Draft!E:E,1,FALSE)=A1757,\"Yes\")),\"\",IF(VLOOKUP(A1757,Draft!E:E,1,FALSE)=A1757,\"Yes\"))","v":""}]
[1756,"Gutierrez, Daniel",{"$f":"IF(ISNA(IF(VLOOKUP(A1758,Draft!E:E,1,FALSE)=A1758,\"Yes\")),\"\",IF(VLOOKUP(A1758,Draft!E:E,1,FALSE)=A1758,\"Yes\"))","v":""}]
[1757,"Pineda, Michael",{"$f":"IF(ISNA(IF(VLOOKUP(A1759,Draft!E:E,1,FALSE)=A1759,\"Yes\")),\"\",IF(VLOOKUP(A1759,Draft!E:E,1,FALSE)=A1759,\"Yes\"))","v":""}]
[1758,"Miller, Adam",{"$f":"IF(ISNA(IF(VLOOKUP(A1760,Draft!E:E,1,FALSE)=A1760,\"Yes\")),\"\",IF(VLOOKUP(A1760,Draft!E:E,1,FALSE)=A1760,\"Yes\"))","v":""}]
[1759,"Chen, Yung-Chi",{"$f":"IF(ISNA(IF(VLOOKUP(A1761,Draft!E:E,1,FALSE)=A1761,\"Yes\")),\"\",IF(VLOOKUP(A1761,Draft!E:E,1,FALSE)=A1761,\"Yes\"))","v":""}]
[1761,"Rowell, Bill",{"$f":"IF(ISNA(IF(VLOOKUP(A1762,Draft!E:E,1,FALSE)=A1762,\"Yes\")),\"\",IF(VLOOKUP(A1762,Draft!E:E,1,FALSE)=A1762,\"Yes\"))","v":""}]
[1762,"Jimenez, Cesar",{"$f":"IF(ISNA(IF(VLOOKUP(A1763,Draft!E:E,1,FALSE)=A1763,\"Yes\")),\"\",IF(VLOOKUP(A1763,Draft!E:E,1,FALSE)=A1763,\"Yes\"))","v":""}]
[1763,"Moreland, Mitch",{"$f":"IF(ISNA(IF(VLOOKUP(A1764,Draft!E:E,1,FALSE)=A1764,\"Yes\")),\"\",IF(VLOOKUP(A1764,Draft!E:E,1,FALSE)=A1764,\"Yes\"))","v":""}]
[1764,"Meyer, Alex",{"$f":"IF(ISNA(IF(VLOOKUP(A1765,Draft!E:E,1,FALSE)=A1765,\"Yes\")),\"\",IF(VLOOKUP(A1765,Draft!E:E,1,FALSE)=A1765,\"Yes\"))","v":""}]
[1765,"Bromberg, David",{"$f":"IF(ISNA(IF(VLOOKUP(A1766,Draft!E:E,1,FALSE)=A1766,\"Yes\")),\"\",IF(VLOOKUP(A1766,Draft!E:E,1,FALSE)=A1766,\"Yes\"))","v":""}]
[1766,"Macri, Matt",{"$f":"IF(ISNA(IF(VLOOKUP(A1767,Draft!E:E,1,FALSE)=A1767,\"Yes\")),\"\",IF(VLOOKUP(A1767,Draft!E:E,1,FALSE)=A1767,\"Yes\"))","v":""}]
[1767,"McCallum, Derek",{"$f":"IF(ISNA(IF(VLOOKUP(A1768,Draft!E:E,1,FALSE)=A1768,\"Yes\")),\"\",IF(VLOOKUP(A1768,Draft!E:E,1,FALSE)=A1768,\"Yes\"))","v":""}]
[1768,"Raben, Dennis",{"$f":"IF(ISNA(IF(VLOOKUP(A1769,Draft!E:E,1,FALSE)=A1769,\"Yes\")),\"\",IF(VLOOKUP(A1769,Draft!E:E,1,FALSE)=A1769,\"Yes\"))","v":""}]
[1769,"Navarro, Yamaico",{"$f":"IF(ISNA(IF(VLOOKUP(A1770,Draft!E:E,1,FALSE)=A1770,\"Yes\")),\"\",IF(VLOOKUP(A1770,Draft!E:E,1,FALSE)=A1770,\"Yes\"))","v":""}]
[1770,"Hollimon, Michael",{"$f":"IF(ISNA(IF(VLOOKUP(A1771,Draft!E:E,1,FALSE)=A1771,\"Yes\")),\"\",IF(VLOOKUP(A1771,Draft!E:E,1,FALSE)=A1771,\"Yes\"))","v":""}]
[1771,"McCulloch, Kyle",{"$f":"IF(ISNA(IF(VLOOKUP(A1772,Draft!E:E,1,FALSE)=A1772,\"Yes\")),\"\",IF(VLOOKUP(A1772,Draft!E:E,1,FALSE)=A1772,\"Yes\"))","v":""}]
[1772,"Gilmore, Jonathan",{"$f":"IF(ISNA(IF(VLOOKUP(A1773,Draft!E:E,1,FALSE)=A1773,\"Yes\")),\"\",IF(VLOOKUP(A1773,Draft!E:E,1,FALSE)=A1773,\"Yes\"))","v":""}]
[1773,"Marks, Justin",{"$f":"IF(ISNA(IF(VLOOKUP(A1774,Draft!E:E,1,FALSE)=A1774,\"Yes\")),\"\",IF(VLOOKUP(A1774,Draft!E:E,1,FALSE)=A1774,\"Yes\"))","v":""}]
[1774,"Price, Bryan",{"$f":"IF(ISNA(IF(VLOOKUP(A1775,Draft!E:E,1,FALSE)=A1775,\"Yes\")),\"\",IF(VLOOKUP(A1775,Draft!E:E,1,FALSE)=A1775,\"Yes\"))","v":""}]
[1775,"Waddell, Jason",{"$f":"IF(ISNA(IF(VLOOKUP(A1776,Draft!E:E,1,FALSE)=A1776,\"Yes\")),\"\",IF(VLOOKUP(A1776,Draft!E:E,1,FALSE)=A1776,\"Yes\"))","v":""}]
[1776,"Hampson, Justin",{"$f":"IF(ISNA(IF(VLOOKUP(A1777,Draft!E:E,1,FALSE)=A1777,\"Yes\")),\"\",IF(VLOOKUP(A1777,Draft!E:E,1,FALSE)=A1777,\"Yes\"))","v":""}]
[1777,"Profar, Jurickson",{"$f":"IF(ISNA(IF(VLOOKUP(A1778,Draft!E:E,1,FALSE)=A1778,\"Yes\")),\"\",IF(VLOOKUP(A1778,Draft!E:E,1,FALSE)=A1778,\"Yes\"))","v":""}]
[1778,"Ohman, Will",{"$f":"IF(ISNA(IF(VLOOKUP(A1779,Draft!E:E,1,FALSE)=A1779,\"Yes\")),\"\",IF(VLOOKUP(A1779,Draft!E:E,1,FALSE)=A1779,\"Yes\"))","v":""}]
[1779,"Jones, Jacque",{"$f":"IF(ISNA(IF(VLOOKUP(A1780,Draft!E:E,1,FALSE)=A1780,\"Yes\")),\"\",IF(VLOOKUP(A1780,Draft!E:E,1,FALSE)=A1780,\"Yes\"))","v":""}]
[1780,"Colome, Jesus",{"$f":"IF(ISNA(IF(VLOOKUP(A1781,Draft!E:E,1,FALSE)=A1781,\"Yes\")),\"\",IF(VLOOKUP(A1781,Draft!E:E,1,FALSE)=A1781,\"Yes\"))","v":""}]
[1781,"Quinlan, Robb",{"$f":"IF(ISNA(IF(VLOOKUP(A1782,Draft!E:E,1,FALSE)=A1782,\"Yes\")),\"\",IF(VLOOKUP(A1782,Draft!E:E,1,FALSE)=A1782,\"Yes\"))","v":""}]
[1782,"Sweeney, Mike",{"$f":"IF(ISNA(IF(VLOOKUP(A1783,Draft!E:E,1,FALSE)=A1783,\"Yes\")),\"\",IF(VLOOKUP(A1783,Draft!E:E,1,FALSE)=A1783,\"Yes\"))","v":""}]
[1783,"Morales, Angel",{"$f":"IF(ISNA(IF(VLOOKUP(A1784,Draft!E:E,1,FALSE)=A1784,\"Yes\")),\"\",IF(VLOOKUP(A1784,Draft!E:E,1,FALSE)=A1784,\"Yes\"))","v":""}]
[1786,"Tolisano, John",{"$f":"IF(ISNA(IF(VLOOKUP(A1785,Draft!E:E,1,FALSE)=A1785,\"Yes\")),\"\",IF(VLOOKUP(A1785,Draft!E:E,1,FALSE)=A1785,\"Yes\"))","v":""}]
[1787,"Ramirez, Niel",{"$f":"IF(ISNA(IF(VLOOKUP(A1786,Draft!E:E,1,FALSE)=A1786,\"Yes\")),\"\",IF(VLOOKUP(A1786,Draft!E:E,1,FALSE)=A1786,\"Yes\"))","v":""}]
[1788,"Johnson, Kris",{"$f":"IF(ISNA(IF(VLOOKUP(A1787,Draft!E:E,1,FALSE)=A1787,\"Yes\")),\"\",IF(VLOOKUP(A1787,Draft!E:E,1,FALSE)=A1787,\"Yes\"))","v":""}]
[1789,"Herrerra, Javier",{"$f":"IF(ISNA(IF(VLOOKUP(A1788,Draft!E:E,1,FALSE)=A1788,\"Yes\")),\"\",IF(VLOOKUP(A1788,Draft!E:E,1,FALSE)=A1788,\"Yes\"))","v":""}]
[1790,"Sulentic, Matt",{"$f":"IF(ISNA(IF(VLOOKUP(A1789,Draft!E:E,1,FALSE)=A1789,\"Yes\")),\"\",IF(VLOOKUP(A1789,Draft!E:E,1,FALSE)=A1789,\"Yes\"))","v":""}]
[1791,"Boscan, Wilfredo",{"$f":"IF(ISNA(IF(VLOOKUP(A1790,Draft!E:E,1,FALSE)=A1790,\"Yes\")),\"\",IF(VLOOKUP(A1790,Draft!E:E,1,FALSE)=A1790,\"Yes\"))","v":""}]
[1792,"Pimental, Stolmy",{"$f":"IF(ISNA(IF(VLOOKUP(A1791,Draft!E:E,1,FALSE)=A1791,\"Yes\")),\"\",IF(VLOOKUP(A1791,Draft!E:E,1,FALSE)=A1791,\"Yes\"))","v":""}]
[1793,"Lin, Che-Hsuan",{"$f":"IF(ISNA(IF(VLOOKUP(A1792,Draft!E:E,1,FALSE)=A1792,\"Yes\")),\"\",IF(VLOOKUP(A1792,Draft!E:E,1,FALSE)=A1792,\"Yes\"))","v":""}]
[1795,"Chaffee, Ryan",{"$f":"IF(ISNA(IF(VLOOKUP(A1793,Draft!E:E,1,FALSE)=A1793,\"Yes\")),\"\",IF(VLOOKUP(A1793,Draft!E:E,1,FALSE)=A1793,\"Yes\"))","v":""}]
[1796,"Cassel, Justin",{"$f":"IF(ISNA(IF(VLOOKUP(A1794,Draft!E:E,1,FALSE)=A1794,\"Yes\")),\"\",IF(VLOOKUP(A1794,Draft!E:E,1,FALSE)=A1794,\"Yes\"))","v":""}]
[1797,"Parmelee, Chris",{"$f":"IF(ISNA(IF(VLOOKUP(A1795,Draft!E:E,1,FALSE)=A1795,\"Yes\")),\"\",IF(VLOOKUP(A1795,Draft!E:E,1,FALSE)=A1795,\"Yes\"))","v":""}]
[1798,"Lemon, Marcus",{"$f":"IF(ISNA(IF(VLOOKUP(A1796,Draft!E:E,1,FALSE)=A1796,\"Yes\")),\"\",IF(VLOOKUP(A1796,Draft!E:E,1,FALSE)=A1796,\"Yes\"))","v":""}]
[1799,"Register, Steven",{"$f":"IF(ISNA(IF(VLOOKUP(A1797,Draft!E:E,1,FALSE)=A1797,\"Yes\")),\"\",IF(VLOOKUP(A1797,Draft!E:E,1,FALSE)=A1797,\"Yes\"))","v":""}]
[4002,"Morlan, Eduardo",{"$f":"IF(ISNA(IF(VLOOKUP(A1798,Draft!E:E,1,FALSE)=A1798,\"Yes\")),\"\",IF(VLOOKUP(A1798,Draft!E:E,1,FALSE)=A1798,\"Yes\"))","v":""}]
[4003,"Peguero, Carlos",{"$f":"IF(ISNA(IF(VLOOKUP(A1799,Draft!E:E,1,FALSE)=A1799,\"Yes\")),\"\",IF(VLOOKUP(A1799,Draft!E:E,1,FALSE)=A1799,\"Yes\"))","v":""}]
[4004,"Moreno, Edwin",{"$f":"IF(ISNA(IF(VLOOKUP(A1800,Draft!E:E,1,FALSE)=A1800,\"Yes\")),\"\",IF(VLOOKUP(A1800,Draft!E:E,1,FALSE)=A1800,\"Yes\"))","v":""}]
[4005,"Peguero, Jailen",{"$f":"IF(ISNA(IF(VLOOKUP(A1801,Draft!E:E,1,FALSE)=A1801,\"Yes\")),\"\",IF(VLOOKUP(A1801,Draft!E:E,1,FALSE)=A1801,\"Yes\"))","v":""}]
[4006,"Hoey, Jim",{"$f":"IF(ISNA(IF(VLOOKUP(A1802,Draft!E:E,1,FALSE)=A1802,\"Yes\")),\"\",IF(VLOOKUP(A1802,Draft!E:E,1,FALSE)=A1802,\"Yes\"))","v":""}]
[4007,"Benoit, Joaquin",{"$f":"IF(ISNA(IF(VLOOKUP(A1803,Draft!E:E,1,FALSE)=A1803,\"Yes\")),\"\",IF(VLOOKUP(A1803,Draft!E:E,1,FALSE)=A1803,\"Yes\"))","v":""}]
[4008,"Mahay, Ron",{"$f":"IF(ISNA(IF(VLOOKUP(A1804,Draft!E:E,1,FALSE)=A1804,\"Yes\")),\"\",IF(VLOOKUP(A1804,Draft!E:E,1,FALSE)=A1804,\"Yes\"))","v":""}]
[4009,"Simon, Alfredo",{"$f":"IF(ISNA(IF(VLOOKUP(A1805,Draft!E:E,1,FALSE)=A1805,\"Yes\")),\"\",IF(VLOOKUP(A1805,Draft!E:E,1,FALSE)=A1805,\"Yes\"))","v":""}]
[4010,"Bradford, Chad",{"$f":"IF(ISNA(IF(VLOOKUP(A1806,Draft!E:E,1,FALSE)=A1806,\"Yes\")),\"\",IF(VLOOKUP(A1806,Draft!E:E,1,FALSE)=A1806,\"Yes\"))","v":""}]
[4011,"Dunigan, Joe",{"$f":"IF(ISNA(IF(VLOOKUP(A1807,Draft!E:E,1,FALSE)=A1807,\"Yes\")),\"\",IF(VLOOKUP(A1807,Draft!E:E,1,FALSE)=A1807,\"Yes\"))","v":""}]
[4012,"Gomez, Edwin",{"$f":"IF(ISNA(IF(VLOOKUP(A1808,Draft!E:E,1,FALSE)=A1808,\"Yes\")),\"\",IF(VLOOKUP(A1808,Draft!E:E,1,FALSE)=A1808,\"Yes\"))","v":""}]
[4013,"Townsend, Wade",{"$f":"IF(ISNA(IF(VLOOKUP(A1809,Draft!E:E,1,FALSE)=A1809,\"Yes\")),\"\",IF(VLOOKUP(A1809,Draft!E:E,1,FALSE)=A1809,\"Yes\"))","v":""}]
[4014,"Dwyer, Chris",{"$f":"IF(ISNA(IF(VLOOKUP(A1810,Draft!E:E,1,FALSE)=A1810,\"Yes\")),\"\",IF(VLOOKUP(A1810,Draft!E:E,1,FALSE)=A1810,\"Yes\"))","v":""}]
[4015,"Solano, Wilfredo",{"$f":"IF(ISNA(IF(VLOOKUP(A1811,Draft!E:E,1,FALSE)=A1811,\"Yes\")),\"\",IF(VLOOKUP(A1811,Draft!E:E,1,FALSE)=A1811,\"Yes\"))","v":""}]
[4016,"Dixon, Rashun",{"$f":"IF(ISNA(IF(VLOOKUP(A1812,Draft!E:E,1,FALSE)=A1812,\"Yes\")),\"\",IF(VLOOKUP(A1812,Draft!E:E,1,FALSE)=A1812,\"Yes\"))","v":""}]
[4017,"Figueroa, Pedro",{"$f":"IF(ISNA(IF(VLOOKUP(A1813,Draft!E:E,1,FALSE)=A1813,\"Yes\")),\"\",IF(VLOOKUP(A1813,Draft!E:E,1,FALSE)=A1813,\"Yes\"))","v":""}]
[4018,"Robbins, James",{"$f":"IF(ISNA(IF(VLOOKUP(A1814,Draft!E:E,1,FALSE)=A1814,\"Yes\")),\"\",IF(VLOOKUP(A1814,Draft!E:E,1,FALSE)=A1814,\"Yes\"))","v":""}]
[4019,"Ciriaco, Audy",{"$f":"IF(ISNA(IF(VLOOKUP(A1815,Draft!E:E,1,FALSE)=A1815,\"Yes\")),\"\",IF(VLOOKUP(A1815,Draft!E:E,1,FALSE)=A1815,\"Yes\"))","v":""}]
[4020,"Fields, Daniel",{"$f":"IF(ISNA(IF(VLOOKUP(A1816,Draft!E:E,1,FALSE)=A1816,\"Yes\")),\"\",IF(VLOOKUP(A1816,Draft!E:E,1,FALSE)=A1816,\"Yes\"))","v":""}]
[4021,"Nunez, Gustavo",{"$f":"IF(ISNA(IF(VLOOKUP(A1817,Draft!E:E,1,FALSE)=A1817,\"Yes\")),\"\",IF(VLOOKUP(A1817,Draft!E:E,1,FALSE)=A1817,\"Yes\"))","v":""}]
[4022,"Azcona, Javier",{"$f":"IF(ISNA(IF(VLOOKUP(A1818,Draft!E:E,1,FALSE)=A1818,\"Yes\")),\"\",IF(VLOOKUP(A1818,Draft!E:E,1,FALSE)=A1818,\"Yes\"))","v":""}]
[4023,"Moseley, Dustin",{"$f":"IF(ISNA(IF(VLOOKUP(A1819,Draft!E:E,1,FALSE)=A1819,\"Yes\")),\"\",IF(VLOOKUP(A1819,Draft!E:E,1,FALSE)=A1819,\"Yes\"))","v":""}]
[4024,"Salcedo, Adrian",{"$f":"IF(ISNA(IF(VLOOKUP(A1820,Draft!E:E,1,FALSE)=A1820,\"Yes\")),\"\",IF(VLOOKUP(A1820,Draft!E:E,1,FALSE)=A1820,\"Yes\"))","v":""}]
[4025,"Jody, Josh",{"$f":"IF(ISNA(IF(VLOOKUP(A1821,Draft!E:E,1,FALSE)=A1821,\"Yes\")),\"\",IF(VLOOKUP(A1821,Draft!E:E,1,FALSE)=A1821,\"Yes\"))","v":""}]
[4026,"Sweeney, Matt",{"$f":"IF(ISNA(IF(VLOOKUP(A1822,Draft!E:E,1,FALSE)=A1822,\"Yes\")),\"\",IF(VLOOKUP(A1822,Draft!E:E,1,FALSE)=A1822,\"Yes\"))","v":""}]
[4027,"Ahrens, Kevin",{"$f":"IF(ISNA(IF(VLOOKUP(A1823,Draft!E:E,1,FALSE)=A1823,\"Yes\")),\"\",IF(VLOOKUP(A1823,Draft!E:E,1,FALSE)=A1823,\"Yes\"))","v":""}]
[4029,"Jennings, Jason",{"$f":"IF(ISNA(IF(VLOOKUP(A1824,Draft!E:E,1,FALSE)=A1824,\"Yes\")),\"\",IF(VLOOKUP(A1824,Draft!E:E,1,FALSE)=A1824,\"Yes\"))","v":""}]
[4030,"Tomko, Brett",{"$f":"IF(ISNA(IF(VLOOKUP(A1825,Draft!E:E,1,FALSE)=A1825,\"Yes\")),\"\",IF(VLOOKUP(A1825,Draft!E:E,1,FALSE)=A1825,\"Yes\"))","v":""}]
[4031,"Robles, Mauricio",{"$f":"IF(ISNA(IF(VLOOKUP(A1826,Draft!E:E,1,FALSE)=A1826,\"Yes\")),\"\",IF(VLOOKUP(A1826,Draft!E:E,1,FALSE)=A1826,\"Yes\"))","v":""}]
[4032,",",{"$f":"IF(ISNA(IF(VLOOKUP(A1827,Draft!E:E,1,FALSE)=A1827,\"Yes\")),\"\",IF(VLOOKUP(A1827,Draft!E:E,1,FALSE)=A1827,\"Yes\"))","v":""}]
[4033,",",{"$f":"IF(ISNA(IF(VLOOKUP(A1828,Draft!E:E,1,FALSE)=A1828,\"Yes\")),\"\",IF(VLOOKUP(A1828,Draft!E:E,1,FALSE)=A1828,\"Yes\"))","v":""}]
[4034,",",{"$f":"IF(ISNA(IF(VLOOKUP(A1829,Draft!E:E,1,FALSE)=A1829,\"Yes\")),\"\",IF(VLOOKUP(A1829,Draft!E:E,1,FALSE)=A1829,\"Yes\"))","v":""}]
[4035,",",{"$f":"IF(ISNA(IF(VLOOKUP(A1830,Draft!E:E,1,FALSE)=A1830,\"Yes\")),\"\",IF(VLOOKUP(A1830,Draft!E:E,1,FALSE)=A1830,\"Yes\"))","v":""}]
[4036,",",{"$f":"IF(ISNA(IF(VLOOKUP(A1831,Draft!E:E,1,FALSE)=A1831,\"Yes\")),\"\",IF(VLOOKUP(A1831,Draft!E:E,1,FALSE)=A1831,\"Yes\"))","v":""}]
[4037,",",{"$f":"IF(ISNA(IF(VLOOKUP(A1832,Draft!E:E,1,FALSE)=A1832,\"Yes\")),\"\",IF(VLOOKUP(A1832,Draft!E:E,1,FALSE)=A1832,\"Yes\"))","v":""}]
[4038,",",{"$f":"IF(ISNA(IF(VLOOKUP(A1833,Draft!E:E,1,FALSE)=A1833,\"Yes\")),\"\",IF(VLOOKUP(A1833,Draft!E:E,1,FALSE)=A1833,\"Yes\"))","v":""}]
[4039,",",{"$f":"IF(ISNA(IF(VLOOKUP(A1834,Draft!E:E,1,FALSE)=A1834,\"Yes\")),\"\",IF(VLOOKUP(A1834,Draft!E:E,1,FALSE)=A1834,\"Yes\"))","v":""}]
[4040,",",{"$f":"IF(ISNA(IF(VLOOKUP(A1835,Draft!E:E,1,FALSE)=A1835,\"Yes\")),\"\",IF(VLOOKUP(A1835,Draft!E:E,1,FALSE)=A1835,\"Yes\"))","v":""}]
[4041,",",{"$f":"IF(ISNA(IF(VLOOKUP(A1836,Draft!E:E,1,FALSE)=A1836,\"Yes\")),\"\",IF(VLOOKUP(A1836,Draft!E:E,1,FALSE)=A1836,\"Yes\"))","v":""}]
[4042,",",{"$f":"IF(ISNA(IF(VLOOKUP(A1837,Draft!E:E,1,FALSE)=A1837,\"Yes\")),\"\",IF(VLOOKUP(A1837,Draft!E:E,1,FALSE)=A1837,\"Yes\"))","v":""}]
[4043,",",{"$f":"IF(ISNA(IF(VLOOKUP(A1838,Draft!E:E,1,FALSE)=A1838,\"Yes\")),\"\",IF(VLOOKUP(A1838,Draft!E:E,1,FALSE)=A1838,\"Yes\"))","v":""}]
[4044,",",{"$f":"IF(ISNA(IF(VLOOKUP(A1839,Draft!E:E,1,FALSE)=A1839,\"Yes\")),\"\",IF(VLOOKUP(A1839,Draft!E:E,1,FALSE)=A1839,\"Yes\"))","v":""}]
[4045,",",{"$f":"IF(ISNA(IF(VLOOKUP(A1840,Draft!E:E,1,FALSE)=A1840,\"Yes\")),\"\",IF(VLOOKUP(A1840,Draft!E:E,1,FALSE)=A1840,\"Yes\"))","v":""}]
[4046,",",{"$f":"IF(ISNA(IF(VLOOKUP(A1841,Draft!E:E,1,FALSE)=A1841,\"Yes\")),\"\",IF(VLOOKUP(A1841,Draft!E:E,1,FALSE)=A1841,\"Yes\"))","v":""}]
[4047,",",{"$f":"IF(ISNA(IF(VLOOKUP(A1842,Draft!E:E,1,FALSE)=A1842,\"Yes\")),\"\",IF(VLOOKUP(A1842,Draft!E:E,1,FALSE)=A1842,\"Yes\"))","v":"Yes"}]
[4048,",",{"$f":"IF(ISNA(IF(VLOOKUP(A1843,Draft!E:E,1,FALSE)=A1843,\"Yes\")),\"\",IF(VLOOKUP(A1843,Draft!E:E,1,FALSE)=A1843,\"Yes\"))","v":""}]
[4049,",",{"$f":"IF(ISNA(IF(VLOOKUP(A1844,Draft!E:E,1,FALSE)=A1844,\"Yes\")),\"\",IF(VLOOKUP(A1844,Draft!E:E,1,FALSE)=A1844,\"Yes\"))","v":""}]
[4050,",",{"$f":"IF(ISNA(IF(VLOOKUP(A1845,Draft!E:E,1,FALSE)=A1845,\"Yes\")),\"\",IF(VLOOKUP(A1845,Draft!E:E,1,FALSE)=A1845,\"Yes\"))","v":""}]
[4051,",",{"$f":"IF(ISNA(IF(VLOOKUP(A1846,Draft!E:E,1,FALSE)=A1846,\"Yes\")),\"\",IF(VLOOKUP(A1846,Draft!E:E,1,FALSE)=A1846,\"Yes\"))","v":"Yes"}]
[4052,",",{"$f":"IF(ISNA(IF(VLOOKUP(A1847,Draft!E:E,1,FALSE)=A1847,\"Yes\")),\"\",IF(VLOOKUP(A1847,Draft!E:E,1,FALSE)=A1847,\"Yes\"))","v":""}]
[4053,",",{"$f":"IF(ISNA(IF(VLOOKUP(A1848,Draft!E:E,1,FALSE)=A1848,\"Yes\")),\"\",IF(VLOOKUP(A1848,Draft!E:E,1,FALSE)=A1848,\"Yes\"))","v":""}]
[4054,",",{"$f":"IF(ISNA(IF(VLOOKUP(A1849,Draft!E:E,1,FALSE)=A1849,\"Yes\")),\"\",IF(VLOOKUP(A1849,Draft!E:E,1,FALSE)=A1849,\"Yes\"))","v":""}]
[4055,",",{"$f":"IF(ISNA(IF(VLOOKUP(A1850,Draft!E:E,1,FALSE)=A1850,\"Yes\")),\"\",IF(VLOOKUP(A1850,Draft!E:E,1,FALSE)=A1850,\"Yes\"))","v":""}]
[4056,",",{"$f":"IF(ISNA(IF(VLOOKUP(A1851,Draft!E:E,1,FALSE)=A1851,\"Yes\")),\"\",IF(VLOOKUP(A1851,Draft!E:E,1,FALSE)=A1851,\"Yes\"))","v":"Yes"}]
[4057,",",{"$f":"IF(ISNA(IF(VLOOKUP(A1852,Draft!E:E,1,FALSE)=A1852,\"Yes\")),\"\",IF(VLOOKUP(A1852,Draft!E:E,1,FALSE)=A1852,\"Yes\"))","v":""}]
[4058,",",{"$f":"IF(ISNA(IF(VLOOKUP(A1853,Draft!E:E,1,FALSE)=A1853,\"Yes\")),\"\",IF(VLOOKUP(A1853,Draft!E:E,1,FALSE)=A1853,\"Yes\"))","v":""}]
[4059,",",{"$f":"IF(ISNA(IF(VLOOKUP(A1854,Draft!E:E,1,FALSE)=A1854,\"Yes\")),\"\",IF(VLOOKUP(A1854,Draft!E:E,1,FALSE)=A1854,\"Yes\"))","v":""}]
[4060,",",{"$f":"IF(ISNA(IF(VLOOKUP(A1855,Draft!E:E,1,FALSE)=A1855,\"Yes\")),\"\",IF(VLOOKUP(A1855,Draft!E:E,1,FALSE)=A1855,\"Yes\"))","v":"Yes"}]
[4061,",",{"$f":"IF(ISNA(IF(VLOOKUP(A1856,Draft!E:E,1,FALSE)=A1856,\"Yes\")),\"\",IF(VLOOKUP(A1856,Draft!E:E,1,FALSE)=A1856,\"Yes\"))","v":""}]
[4062,",",{"$f":"IF(ISNA(IF(VLOOKUP(A1857,Draft!E:E,1,FALSE)=A1857,\"Yes\")),\"\",IF(VLOOKUP(A1857,Draft!E:E,1,FALSE)=A1857,\"Yes\"))","v":""}]
[4063,",",{"$f":"IF(ISNA(IF(VLOOKUP(A1858,Draft!E:E,1,FALSE)=A1858,\"Yes\")),\"\",IF(VLOOKUP(A1858,Draft!E:E,1,FALSE)=A1858,\"Yes\"))","v":""}]
[4064,",",{"$f":"IF(ISNA(IF(VLOOKUP(A1859,Draft!E:E,1,FALSE)=A1859,\"Yes\")),\"\",IF(VLOOKUP(A1859,Draft!E:E,1,FALSE)=A1859,\"Yes\"))","v":""}]
[4065,",",{"$f":"IF(ISNA(IF(VLOOKUP(A1860,Draft!E:E,1,FALSE)=A1860,\"Yes\")),\"\",IF(VLOOKUP(A1860,Draft!E:E,1,FALSE)=A1860,\"Yes\"))","v":"Yes"}]
[4066,",",{"$f":"IF(ISNA(IF(VLOOKUP(A1861,Draft!E:E,1,FALSE)=A1861,\"Yes\")),\"\",IF(VLOOKUP(A1861,Draft!E:E,1,FALSE)=A1861,\"Yes\"))","v":""}]
[4067,",",{"$f":"IF(ISNA(IF(VLOOKUP(A1862,Draft!E:E,1,FALSE)=A1862,\"Yes\")),\"\",IF(VLOOKUP(A1862,Draft!E:E,1,FALSE)=A1862,\"Yes\"))","v":""}]
[4068,",",{"$f":"IF(ISNA(IF(VLOOKUP(A1863,Draft!E:E,1,FALSE)=A1863,\"Yes\")),\"\",IF(VLOOKUP(A1863,Draft!E:E,1,FALSE)=A1863,\"Yes\"))","v":""}]
[4069,",",{"$f":"IF(ISNA(IF(VLOOKUP(A1864,Draft!E:E,1,FALSE)=A1864,\"Yes\")),\"\",IF(VLOOKUP(A1864,Draft!E:E,1,FALSE)=A1864,\"Yes\"))","v":""}]
[4070,",",{"$f":"IF(ISNA(IF(VLOOKUP(A1865,Draft!E:E,1,FALSE)=A1865,\"Yes\")),\"\",IF(VLOOKUP(A1865,Draft!E:E,1,FALSE)=A1865,\"Yes\"))","v":""}]
[4071,",",{"$f":"IF(ISNA(IF(VLOOKUP(A1866,Draft!E:E,1,FALSE)=A1866,\"Yes\")),\"\",IF(VLOOKUP(A1866,Draft!E:E,1,FALSE)=A1866,\"Yes\"))","v":""}]
[4072,",",{"$f":"IF(ISNA(IF(VLOOKUP(A1867,Draft!E:E,1,FALSE)=A1867,\"Yes\")),\"\",IF(VLOOKUP(A1867,Draft!E:E,1,FALSE)=A1867,\"Yes\"))","v":""}]
[4073,",",{"$f":"IF(ISNA(IF(VLOOKUP(A1868,Draft!E:E,1,FALSE)=A1868,\"Yes\")),\"\",IF(VLOOKUP(A1868,Draft!E:E,1,FALSE)=A1868,\"Yes\"))","v":""}]
[4074,",",{"$f":"IF(ISNA(IF(VLOOKUP(A1869,Draft!E:E,1,FALSE)=A1869,\"Yes\")),\"\",IF(VLOOKUP(A1869,Draft!E:E,1,FALSE)=A1869,\"Yes\"))","v":""}]
[4075,",",{"$f":"IF(ISNA(IF(VLOOKUP(A1870,Draft!E:E,1,FALSE)=A1870,\"Yes\")),\"\",IF(VLOOKUP(A1870,Draft!E:E,1,FALSE)=A1870,\"Yes\"))","v":""}]
[4076,",",{"$f":"IF(ISNA(IF(VLOOKUP(A1871,Draft!E:E,1,FALSE)=A1871,\"Yes\")),\"\",IF(VLOOKUP(A1871,Draft!E:E,1,FALSE)=A1871,\"Yes\"))","v":""}]
[4077,",",{"$f":"IF(ISNA(IF(VLOOKUP(A1872,Draft!E:E,1,FALSE)=A1872,\"Yes\")),\"\",IF(VLOOKUP(A1872,Draft!E:E,1,FALSE)=A1872,\"Yes\"))","v":""}]
[4078,",",{"$f":"IF(ISNA(IF(VLOOKUP(A1873,Draft!E:E,1,FALSE)=A1873,\"Yes\")),\"\",IF(VLOOKUP(A1873,Draft!E:E,1,FALSE)=A1873,\"Yes\"))","v":""}]
[4079,",",{"$f":"IF(ISNA(IF(VLOOKUP(A1874,Draft!E:E,1,FALSE)=A1874,\"Yes\")),\"\",IF(VLOOKUP(A1874,Draft!E:E,1,FALSE)=A1874,\"Yes\"))","v":""}]
[4080,",",{"$f":"IF(ISNA(IF(VLOOKUP(A1875,Draft!E:E,1,FALSE)=A1875,\"Yes\")),\"\",IF(VLOOKUP(A1875,Draft!E:E,1,FALSE)=A1875,\"Yes\"))","v":""}]
[4081,",",{"$f":"IF(ISNA(IF(VLOOKUP(A1876,Draft!E:E,1,FALSE)=A1876,\"Yes\")),\"\",IF(VLOOKUP(A1876,Draft!E:E,1,FALSE)=A1876,\"Yes\"))","v":""}]
[4082,",",{"$f":"IF(ISNA(IF(VLOOKUP(A1877,Draft!E:E,1,FALSE)=A1877,\"Yes\")),\"\",IF(VLOOKUP(A1877,Draft!E:E,1,FALSE)=A1877,\"Yes\"))","v":""}]
[4083,",",{"$f":"IF(ISNA(IF(VLOOKUP(A1878,Draft!E:E,1,FALSE)=A1878,\"Yes\")),\"\",IF(VLOOKUP(A1878,Draft!E:E,1,FALSE)=A1878,\"Yes\"))","v":""}]
[4084,",",{"$f":"IF(ISNA(IF(VLOOKUP(A1879,Draft!E:E,1,FALSE)=A1879,\"Yes\")),\"\",IF(VLOOKUP(A1879,Draft!E:E,1,FALSE)=A1879,\"Yes\"))","v":""}]
[4085,",",{"$f":"IF(ISNA(IF(VLOOKUP(A1880,Draft!E:E,1,FALSE)=A1880,\"Yes\")),\"\",IF(VLOOKUP(A1880,Draft!E:E,1,FALSE)=A1880,\"Yes\"))","v":""}]
[4086,",",{"$f":"IF(ISNA(IF(VLOOKUP(A1881,Draft!E:E,1,FALSE)=A1881,\"Yes\")),\"\",IF(VLOOKUP(A1881,Draft!E:E,1,FALSE)=A1881,\"Yes\"))","v":""}]
[4087,",",{"$f":"IF(ISNA(IF(VLOOKUP(A1882,Draft!E:E,1,FALSE)=A1882,\"Yes\")),\"\",IF(VLOOKUP(A1882,Draft!E:E,1,FALSE)=A1882,\"Yes\"))","v":""}]
[4088,",",{"$f":"IF(ISNA(IF(VLOOKUP(A1883,Draft!E:E,1,FALSE)=A1883,\"Yes\")),\"\",IF(VLOOKUP(A1883,Draft!E:E,1,FALSE)=A1883,\"Yes\"))","v":""}]
[4089,",",{"$f":"IF(ISNA(IF(VLOOKUP(A1884,Draft!E:E,1,FALSE)=A1884,\"Yes\")),\"\",IF(VLOOKUP(A1884,Draft!E:E,1,FALSE)=A1884,\"Yes\"))","v":""}]
[4090,",",{"$f":"IF(ISNA(IF(VLOOKUP(A1885,Draft!E:E,1,FALSE)=A1885,\"Yes\")),\"\",IF(VLOOKUP(A1885,Draft!E:E,1,FALSE)=A1885,\"Yes\"))","v":""}]
[4091,",",{"$f":"IF(ISNA(IF(VLOOKUP(A1886,Draft!E:E,1,FALSE)=A1886,\"Yes\")),\"\",IF(VLOOKUP(A1886,Draft!E:E,1,FALSE)=A1886,\"Yes\"))","v":""}]
[4092,",",{"$f":"IF(ISNA(IF(VLOOKUP(A1887,Draft!E:E,1,FALSE)=A1887,\"Yes\")),\"\",IF(VLOOKUP(A1887,Draft!E:E,1,FALSE)=A1887,\"Yes\"))","v":""}]
[4093,",",{"$f":"IF(ISNA(IF(VLOOKUP(A1888,Draft!E:E,1,FALSE)=A1888,\"Yes\")),\"\",IF(VLOOKUP(A1888,Draft!E:E,1,FALSE)=A1888,\"Yes\"))","v":""}]
[4094,",",{"$f":"IF(ISNA(IF(VLOOKUP(A1889,Draft!E:E,1,FALSE)=A1889,\"Yes\")),\"\",IF(VLOOKUP(A1889,Draft!E:E,1,FALSE)=A1889,\"Yes\"))","v":""}]
[4095,",",{"$f":"IF(ISNA(IF(VLOOKUP(A1890,Draft!E:E,1,FALSE)=A1890,\"Yes\")),\"\",IF(VLOOKUP(A1890,Draft!E:E,1,FALSE)=A1890,\"Yes\"))","v":""}]
[4096,",",{"$f":"IF(ISNA(IF(VLOOKUP(A1891,Draft!E:E,1,FALSE)=A1891,\"Yes\")),\"\",IF(VLOOKUP(A1891,Draft!E:E,1,FALSE)=A1891,\"Yes\"))","v":""}]
[4097,",",{"$f":"IF(ISNA(IF(VLOOKUP(A1892,Draft!E:E,1,FALSE)=A1892,\"Yes\")),\"\",IF(VLOOKUP(A1892,Draft!E:E,1,FALSE)=A1892,\"Yes\"))","v":""}]
[4098,",",{"$f":"IF(ISNA(IF(VLOOKUP(A1893,Draft!E:E,1,FALSE)=A1893,\"Yes\")),\"\",IF(VLOOKUP(A1893,Draft!E:E,1,FALSE)=A1893,\"Yes\"))","v":""}]
[4099,",",{"$f":"IF(ISNA(IF(VLOOKUP(A1894,Draft!E:E,1,FALSE)=A1894,\"Yes\")),\"\",IF(VLOOKUP(A1894,Draft!E:E,1,FALSE)=A1894,\"Yes\"))","v":""}]
[4100,",",{"$f":"IF(ISNA(IF(VLOOKUP(A1895,Draft!E:E,1,FALSE)=A1895,\"Yes\")),\"\",IF(VLOOKUP(A1895,Draft!E:E,1,FALSE)=A1895,\"Yes\"))","v":""}]
[4101,",",{"$f":"IF(ISNA(IF(VLOOKUP(A1896,Draft!E:E,1,FALSE)=A1896,\"Yes\")),\"\",IF(VLOOKUP(A1896,Draft!E:E,1,FALSE)=A1896,\"Yes\"))","v":""}]
[4102,",",{"$f":"IF(ISNA(IF(VLOOKUP(A1897,Draft!E:E,1,FALSE)=A1897,\"Yes\")),\"\",IF(VLOOKUP(A1897,Draft!E:E,1,FALSE)=A1897,\"Yes\"))","v":""}]
[4103,",",{"$f":"IF(ISNA(IF(VLOOKUP(A1898,Draft!E:E,1,FALSE)=A1898,\"Yes\")),\"\",IF(VLOOKUP(A1898,Draft!E:E,1,FALSE)=A1898,\"Yes\"))","v":""}]
[4104,",",{"$f":"IF(ISNA(IF(VLOOKUP(A1899,Draft!E:E,1,FALSE)=A1899,\"Yes\")),\"\",IF(VLOOKUP(A1899,Draft!E:E,1,FALSE)=A1899,\"Yes\"))","v":""}]
[4105,",",{"$f":"IF(ISNA(IF(VLOOKUP(A1900,Draft!E:E,1,FALSE)=A1900,\"Yes\")),\"\",IF(VLOOKUP(A1900,Draft!E:E,1,FALSE)=A1900,\"Yes\"))","v":""}]
[4106,",",{"$f":"IF(ISNA(IF(VLOOKUP(A1901,Draft!E:E,1,FALSE)=A1901,\"Yes\")),\"\",IF(VLOOKUP(A1901,Draft!E:E,1,FALSE)=A1901,\"Yes\"))","v":""}]
[4107,",",{"$f":"IF(ISNA(IF(VLOOKUP(A1902,Draft!E:E,1,FALSE)=A1902,\"Yes\")),\"\",IF(VLOOKUP(A1902,Draft!E:E,1,FALSE)=A1902,\"Yes\"))","v":""}]

{"sheet":"09BPdraft","index":3,"n_rows":88,"n_cols":14,"rows_kept":88,"cut":false,"hidden":false,"merged":[]}
[null,"Team 1","Team 2","Team 11","Team 9","Team 5","Team 10","Team 6","Team 4","Team 12","Team 8","Team 7","Team 3"]
["Rd","Ray","Kevin","Andy","Chris","Will","Casey","Jeremy","Mark","Duke & Josh","Tim & Jeremy","Bill","JTP","Rd"]
[1,"(S.Kazmir)","(J.Saltalamacchia)","(Mi.Cabrera)","(M.Holliday)","(B.Abreu)","(L.Hochevar)","(T.Lincecum)","(A.Burnett)","(C.Sabathia)","(R.Dempster)","(B.Fuentes)","(J.Beckett)",1]
[2,"(C.Quentin)","(V.Guerrero)","(B.Webb)","12>(M.Teixeira)","(R.Oswalt)","(R.Nolasco)","12>(A.Beltre)","(J.Bay)","(J.Hamilton)","(J.Jurrjens)","(J.Drew)","(M.DeRosa)",2]
[3,"(A.Cook)","(D.Lowe)","(C.Kershaw)","(J.Vazquez)","(R.Harden)","(P.Maholm)","(B.Myers)","(A.Harang)","Jo.Santana","(J.Lannan)","(C.Hamels)","(C.Zambrano)",3]
[4,"(H.Kuroda)","(H.Kuo)","(C.R.Young)","(T.Lilly)","(J.Cueto)","(S.Olsen)","(An.Miller)","(J.Maine)","D.Haren","(Wa.Rodriguez)","(M.Cain)","(J.Peavy)",4]
[5,"(M.Owings)","(B.Lidge)","(C.Snyder)","(M.Pelfrey)","(J.Moyer)","(K.Lohse)","(Jo.Johnson)","(A.Wainwirght)","B.Zito","(Ad.LaRoche)","(C.Billingsley)","(C.Marmol)",5]
[6,"(S.Marshall)","(J.Loney)","(R.Weeks)","(M.Scherzer)","(T.Pena)","(J.Blanton)","(C.Volstad)","(C.Carpenter)","J.Flores","(D.Wright)","(Ed.Volquez)","(G.Soto)",6]
[7,"(H.Bailey)","(B.Phillips)","(J.Cantu)","(A.Ramirez)","(J.Broxton)","(D.Bush)","(B.McCann)","(Y.Molina)","I.Rodriguez","(S.Drew)","(Y.Gallard)","(C.Iannetta)",7]
[8,"(T.Hudson)","(M.Reynolds)","(J.Hardy)","(Jo.Reyes)","(Ra.Hernandez)","(Ra.Johnson)","(Ke.Johnson)","(Ad.Gonzalez)","F.Lopez","(R.Winn)","(Ru.Martin)","(A.Pujols)",8]
[9,"(De.Lee)","(R.Furcal)","(R.Ludwick)","(H.Pence)","(C.Kotchman)","(M.Parra)","(G.Atkins)","(D.Uggla)","Ha.Ramirez","(A.Rowand)","(P.Fielder)","(R.Zimmerman)",9]
[10,"(M.Hoffpauir)","(M.Kemp)","(C.Maybin)","(S.Victorino)","(C.Utley)","(R.Doumit)","(Y.Escobar)","(T.Glaus)","R.Braun","(B.Hawpe)","(L.Berkman)","(C.Guzman)",10]
[11,"(Ca.Lee)","(E.Dukes)","7>(M.Fontenot)","(Ma.Ramirez)","(C.Jones)","(R.Howard)","(C.B.Young)","(K.Greene)","A.Soriano","(J.Gerut)","(E.Encarnacion)","(T.Tulowitzki)",11]
[12,"(C.Headley)","7>(J.Rollins)","3>(C.Beltran)","3>(K.Fukudome)","(J.Francouer)","(Co.Hart)","(L.Milledge)","(A.Ethier)","6>(J.Hermida)","(R.Spilborghs)","(N.McLouth)","(M.Cameron)",12]
[13,"3>(M.Bradley)","7>(C.Ross)","3>(J.Bruce)","3>(B.Sheets)","(J.Werth)","(Co.Jackson)","(J.Votto)","(R.Ankiel)","4>(F.Lewis)","(A.Dunn)","(J.Upton)","(O.Hudson)",13]
[14,"R.Ibanez","I.Stewart","F.Rodriguez","C.Delgado","8>Ol.Perez","T.Helton","Jo.Sanchez","K.Kouzmanoff","11>J.Putz","2>K.Kawakami","P.Sandoval","R.Wolf",14]
[15,"B.Molina","M.Stanton","U.Jimenez","I.Snell","8>D.Cabrera","Dan.Murphy","T.Wellemeyer","8>C.Baek","J.Garland","2>W.Flores","12>K.Correia","B.Arroyo",15]
[16,"8>B.Looper","F.Morales","Z.Duke","An.Sanchez","M.Tejada","C.Blake","Mi.Gonzalez","F.Cordero","11>J.Valverde","Ro.Belliard","2>C.Qualls","11>An.LaRoche",16]
[17,"R.Theriot","C.Wade","S.Schumaker","B.Schneider","M.Bourn","E.Renteria","H.Bell","F.Sanchez","C.Duncan","Jo.Baker","M.Capps","C.Barmes",17]
[18,"A.Miles","I.DeJesus","Ca.Gonzalez","K.Matsui","J.Motte","B.Giles","Se.Smith","Ja.Wilson","H.Street","M.Montero","C.Meredith","11>Je.Baker",18]
[19,"Mi.Adams","L.Nunez","C.Ruiz","R.Madson","M.Lindstrom","12>M.Loretta","Bi.Hall","M.Corpas","10>L.Castillo","R.Castro","J.Hairston","1>K.Gregg",19]
[20,"B.Howry","Se.West","C.Ballester","A.Heilman","J.Kendall","De.Reyes","T.Hoffman","5>W.Taveras","11>J.delaRosa","A.Cora","K.McClellan","J.Pineiro",20]
[21,"O.Infante","Jh.Chacin","Al.Gonzalez","Ni.Johnson","Do.Davis","J.Grabow","P.Feliciano","C.Villanueva","7>L.Morrison","M.Prado","2>Jo.Ceda","J.Suppan",21]
[22,"S.McClung","12>C.Tracy","C.Gaudin","J.Affeldt","J.Rauch","Ad.Rosales","B.Bray","N.Hundley","Rob.Diaz","P.Feliz","Y.Petit","5>J.Samardzija",22]
[23,"Br.Ryan","C.Dickerson","T.Buchholz","D.McPherson","E.Byrnes","C.Sampson","J.Willingham","R.Church","5>N.Morgan","C.Counsell","K.Frandsen","N.Schierholtz",23]
[24,"S.Pearce","J.Geer","(A.McCutchen)","S.Rivera","T.Glavine","R.Soriano","Br.Wilson","R.Franklin","Ra.Vazquez","Se.Green","Re.Johnson","J.Kinney",24]
[25,"D.Eckstein","12>J.Hanrahan","(Fe.Martinez)","J.Happ","C.Capuano","B.Boyer","D.Ross","M.Acosta","11>S.Martis","J.Julio","B.Carlyle","M.Stetter",25]
[26,"Ch.Perez","K.Blanks","(G.Golson)","Ry.Tucker","11>B.Logan","D.Brocail","O.Quintanilla","L.Hawkins","Jo.Anderson","Tr.Miller","Br.Moss","B.DeWitt",26]
[27,"J.Towles","Jo-Jo.Reyes","(Al.Escobar)","G.Blum","Jon.Gomes","M.Stairs","Ga.Sanchez","S.Shell","C.Vargas","Ma.DiFelice","R.Ohlendorf","C.Patterson",27]
[28,"(D.Stubbs)","E.Campbell","(E.Andrus)","M.Hampton","S.Palazzolo","R.Pinto","J.Hampson","J.Burton","C.Park","E.Burriss","P.Moylan","(C.Mortensen)",28]
[29,"(Gor.Hernandez)","Ja.Garcia","(P.Alvarez)","Li.Hernandez","C.Coste","C.Burke","A.Amezaga","Ga.Anderson","10>T.Coffey","A.Ojeda","C.Hu","(C.Rasmus)",29]
[30,"M.Antonelli)","E.Bonifacio","(M.Gamel)","(B.Wallace)","D.Schlereth","T.Gorzelanny","Lu.Rodriguez","(A.Crow)","W.Silva","G.Geary","A.Rhodes","(J.Tabata)",30]
[31,"(B.Posey)","Ja.Donald","(Y.Alonso)","(B.Lawrie)","J.Pierre","R.Paulino","(M.LaPorta)","(D.Freese)","(Ra.Rodriguez)","S.Hill","B.Ausmus","(D.Fowler)",31]
[32,"(A.Salome)","(M.Burgess)","(K.Skipworth)","(W.Inman)","J.Gathright","H.Quintero","(J.Nix)","(A.Gose)","(C.Hunter)","F.Freeman","S.Romo","(C.Coghlan)",32]
[33,"(H.Sosa)","(J.Schafer)","(Br.Anderson)","(J.Todd)","B.Backe","Ru.Ortiz","(J.Vitters)","(Ch.Friedrich)","(R.Havens)","(A.Cardenas)","G.Dobbs","(L.Marson)",33]
[34,"(Jo.Zimmerman)","(J.Lucroy)","(J.Castro)","(J.Parker)","J.Romero","E.Hinske","(C.Marrero)","(R.Detwiler)","(A.Villalona)","(M.Latos)","(M.Dominguez)","(T.Alderson)",34]
[35,"(Jam.McDonald)","(J.Jeffress)","(C.Rohrbaugh)","(T.Hanson)","R.Parnell","(T.Patton)","(Da.Thompson)","(Me.Valdez)","(M.Bumgarner)","(C.Carrasco)","(J.Heyward)","(J.Niese)",35]
[]
[]
[]
[]
[]
[]
[]
[null,"Team 1","Team 2","Team 11","Team 9","Team 5","Team 10","Team 6","Team 4","Team 12","Team 8","Team 7","Team 3"]
["Rd","Ray","Kevin","Andy","Chris","Will","Casey","Jeremy","Mark","Duke & Josh","Tim & Jeremy","Bill","JTP","Rd"]
["C","B.Molina","J.Salatalamacchia","C.Snyder","B.Schneider","Ra.Hernandez","R.Doumit","B.McCann","Y.Molina","J.Flores","Jo.Baker","Ru.Martin","G.Soto","C"]
["1B","D.Lee","J.Loney","Mi.Cabrera","C.Delgado","C.Kotchman","R.Howard","J.Votto","Ad.Gonzalez","M.Teixeira","Ad.LaRoche","L.Berkman","A.Pujols","1B"]
["2B","A.Miles","B.Phillips","R.Weeks","K.Matsui","C.Utley","L.Castillo","Ke.Johnson","D.Uggla","F.Lopez","Ro.Belliard","M.Fontenot","O.Hudson","2B"]
["3B","O.Infante","M.Reynolds","J.Cantu","A.Ramirez","Ch.Jones","C.Blake","G.Atkins","T.Glaus","A.Beltre","D.Wright","E.Encarnacion","R.Zimmerman","3B"]
["SS","R.Theriot","R.Furcal","J.Hardy","Jo.Reyes","M.Tejada","E.Renteria","Y.Escobar","K.Greene","Ha.Ramirez","S.Drew","J.Rollins","T.Tulowitzki","SS"]
["CF","C.Quentin","M.Kemp","C.Maybin","S.Victorino","J.Werth","Co.Hart","C.B.Young","R.Ankiel","J.Hamilton","J.Gerut","N.McLouth","C.Beltran","CF"]
["OF","Ca.Lee","V.Guerrero","R.Ludwick","Ma.Ramirez","B.Abreu","Co.Jackson","L.Milledge","J.Bay","R.Braun","A.Dunn","J.Upton","M.Bradley","OF"]
["OF","C.Headley","E.Dukes","M.Bourn","M.Holliday","J.Francoeur","Dan.Murphy","J.Hermida","A.Ethier","A.Soriano","R.Winn","J.Drew","M.Cameron","OF"]
["BC","J.Towles",null,"C.Ruiz",null,"J.Kendall","R.Paulino","D.Ross","N.Hundley","I.Rodriguez","M.Montero","B.Ausmus","C.Iannetta","BC"]
["IF","M.Hoffpauir","I.Stewart","E.Andrus","Ni.Johnson",null,"Ad.Rosales","Bi.Hall","K.Kouzmanoff","M.Loretta","A.Cora","P.Fielder","M.DeRosa","IF"]
["IF","Br.Ryan","E.Bonifacio","An.LaRoche","G.Blum",null,"C.Burke","O.Quintanilla","F.Sanchez","C.Tracy","M.Prado","P.Sandoval","C.Guzman","IF"]
["OF","R.Ibanez","J.Schafer","Ca.Gonzalez","H.Pence","W.Taveras","B.Giles","Se.Smith","F.Lewis","C.Duncan","R.Spilborghs","C.Ross","J.Bruce","OF"]
["OF","S.Pearce","C.Dickerson","Jef.Baker",null,"E.Byrnes","M.Stairs","J.Willingham","R.Church","Rob.Diaz","A.Rowand","J.Hairston","K.Fukudome","OF"]
["UT","D.Eckstein",null,"Al.Gonzalez",null,"Jon.Gomes","H.Quintero","Ga.Sanchez","Ja.Wilson","Ra.Vazquez","B.Hawpe","Re.Johnson","C.Barmes","UT"]
["UT",null,null,null,null,"C.Coste","E.Hinske","A.Amezaga","Ga.Anderson",null,"R.Castro","Br.Moss","N.Schierholtz","UT"]
["UT",null,"J.Donald",null,null,"J.Pierre",null,"Lu.Rodriguez",null,null,"P.Feliz","C.Hu","B.DeWitt","UT"]
["?","A.Salome","J.Lucroy","J.Castro","B.Wallace","J.Gathright",null,"C.Marrero","D.Freese","A.Villalona","Ad.Cardenas","M.Dominguez","L.Marson","?"]
["?","B.Posey","M.Burgess","Br.Anderson","B.Lawrie",null,null,"J.Vitters","A.Gose","Ra.Rodriguez","C.Counsell","J.Heyward","C.Coghlan","?"]
["?","M.Antonelli","M.Stanton","K.Skipworth",null,null,null,"J.Nix",null,null,"E.Burriss","G.Dobbs","D.Fowler","?"]
["?","Gor.Hernandez","W.Flores","Y.Alonso",null,null,null,"M.LaPorta",null,null,"A.Ojeda",null,"J.Tabata","?"]
["?","D.Stubbs","I.DeJesus","M.Gamel",null,null,null,null,null,null,"F.Freeman",null,"C.Rasmus","?"]
["?",null,"R.Havens","P.Alvarez",null,null,null,null,null,null,null,null,"C.Patterson","?"]
["?",null,"Ce.Hunter","Alc.Escobar",null,null,null,null,null,null,null,null,null,"?"]
["?",null,"K.Blanks","G.Golson",null,null,"Ru.Ortiz",null,null,null,null,null,null,"?"]
["?",null,"E.Campbell","Fe.Martinez",null,null,"T.Gorzelanny",null,null,null,null,null,null,"?"]
["?",null,"L.Morrison","A.McCutchen","W.Inman","R.Parnell","T.Coffey",null,"J.Burton",null,null,null,"T.Alderson","?"]
["?",null,"Ja.Garcia",null,"J.Todd","J.Romero","R.Pinto",null,"A.Crow",null,"S.Hill",null,"C.Mortensen","?"]
["?","H.Sosa","Jh.Chacin","B.Logan","J.Parker","B.Backe","D.Brocail","J.Hampson","Ch.Friedrich",null,"M.Latos","S.Romo","J.Niese","?"]
["?","T.Hudson","J.Jeffress","C.Rohrbaugh","T.Hanson","D.Schlereth","T.Patton","Da.Thompson","R.Detwiler","M.Bumgarner","C.Carrasco","A.Rhodes","B.Sheets","?"]
["SP","S.Kazmir","D.Lowe","B.Webb","J.Vazquez","R.Oswalt","R.Nolasco","T.Lincecum","A.Burnett","C.Sabathia","R.Dempster","C.Hamels","J.Peavy","SP"]
["SP","A.Cook","K.Kawakami","C.Kershaw","T.Lilly","R.Harden","P.Maholm","B.Myers","A.Harang","J.Santana","J.Jurrjens","M.Cain","C.Zambrano","SP"]
["SP","H.Kuroda","F.Morales","C.R.Young","M.Pelfrey","J.Cueto","S.Olsen","An.Miller","A.Wainwright","D.Haren","J.Lannan","C.Billingsley","J.Beckett","SP"]
["SP","M.Owings","J.Geer","U.Jimenez","M.Scherzer","J.Moyer","K.Lohse","Jo.Johnson","J.Maine","B.Zito","Wa.Rodriguez","Ed.Volquez","R.Wolf","SP"]
["SP","S.Marshall","Jo-Jo.Reyes","Z.Duke","I.Snell","Do.Davis","J.Blanton","C.Volstad","C.Carpenter","J.Garland","Ol.Perez","Y.Gallardo","B.Arroyo","SP"]
["P","H.Bailey","Se.West","C.Ballester","An.Sanchez","T.Glavine","D.Bush","Jo.Sanchez","S.Shell","K.Correia","D.Cabrera","Y.Petit","J.Pineiro","P"]
["P","Jo.Zimmerman",null,"J.delaRosa","J.Happ","C.Capuano","Ra.Johnson","T.Wellemeyer","L.Hawkins","C.Park","C.Baek","R.Ohlendorf","J.Suppan","P"]
["P","Ch.Perez",null,"S.Martis","M.Hampton","S.Palazzolo","M.Parra","Br.Wilson","M.Acosta","W.Silva","B.Looper","P.Moylan",null,"P"]
["P","S.McClung",null,"T.Buchholz","Ry.Tucker","J.Rauch","L.Hochevar","B.Bray","C.Villanueva",null,"G.Geary","H.Kuo",null,"P"]
["P","B.Howry","Jo.Ceda","C.Gaudin","S.Rivera","M.Lindstrom","B.Boyer","P.Feliciano","R.Franklin","C.Vargas","Ma.DiFelice","B.Carlyle",null,"P"]
["P","K.Gregg","L.Nunez","J.Valverde","J.Affeldt","J.Motte","R.Soriano","T.Hoffman","M.Corpas","Jo.Hanrahan","Tr.Miller","K.McClellan","M.Stetter","P"]
["P","Mi.Adams","C.Wade","J.Putz","A.Heilman","T.Pena","C.Sampson","H.Bell","F.Cordero","H.Street","J.Julio","C.Meredith","J.Kinney","P"]
["P","Ja.McDonald","B.Lidge","F.Rodriguez","R.Madson","J.Broxton","De.Reyes","Mi.Gonzalez","Me.Valdez","C.Qualls","Se.Green","B.Fuentes","C.Marmol","P"]

{"sheet":"08BPdraft","index":4,"n_rows":80,"n_cols":14,"rows_kept":80,"cut":false,"hidden":false,"merged":[]}
[null,"Team 10","Team 12","Team 2","Team 6","Team 4","Team 5","Team 1","Team 11","Team 9","Team 7","Team 3","Team 8"]
["Rd","Casey","Duke & Josh","Kevin","Rich&Jeremy","Mark","Pat","Ray","Andy","Chris","Bill","JTP","Tom","Rd"]
[1,"(R.Johnson)","(D.Willis)","(J.Saltalamacchia)","(B.Arroyo)","(I.Rodriguez)","(B.Abreu)","(R.Hernandez)","(A.Pettitte)","(J.Beckett)","(S.Kazmir)","(J.Vazquez)","(A.Burnett)",1]
[2,"1>(A.Beltre)","(J.Hamilton)","(V.Guerrero)","7>(P.Polanco)","(S.Rolen)","(R.Hill)","(C.Quentin","(M.Cabrera)","(J.Thome)","(J.Drew)","(M.Bradley)","(J.Lugo)",2]
[3,"(D.Bush)","(C.Young)","(D.Lowe)","(T.Lincecum)","(A.Harang)","(F.Morales)","(T.Hudson)","(B.Webb)","(B.Penny)","(C.Billingsley)","(J.Peavy)","(R.Oswalt)",3]
[4,"(P.Maholm","(T.Lilly)","(T.Gorzelanny)","(B.Myers)","(A.Wanwright)","(Do.Davis)","(G.Maddux)","(Ol.Perez)","(N.Lowry)","(C.Hamels)","(C.Zambrano)","(J.Smoltz)",4]
[5,"(S.Olsen)","(B.Zito)","(I.Snell)","(S.Hill)","(J.Maine)","(J.Francis)","(M.Owings)","(U.Jimenez)","(M.Parra)","(Y.Gallardo)","(P.Martinez)","(K.Kendrick)",5]
[6,"(R.Soriano)","(R.Wolf)","(H.Bell)","(B.McCann)","(C.Carpenter)","(W.Rodriguez)","(H.Bailey)","(C.Marmol)","(B.Molina)","(M.Cain)","(B.Sheets)","(S.Mitre)",6]
[7,"(R.Howard)","(M.Teixeira)","(C.Delgado)","(T.Wigginton)","(Ad.Gonzalez)","(M.Corpas)","(T.Hoffman)","(J.Bard)","(J.Kent)","(Ru.Martin)","(M.Montero)","(Y.Torrealba)",7]
[8,"(E.Renteria)","(K.Johnson)","(J.Loney)","(R.Braun)","(D.Uggla)","(J.Broxton)","(T.Saito)","(C.Snyder)","(A.Ramirez)","(De.Lee)","(G.Soto)","(T.Helton)",8]
[9,"(Co.Hart)","(G.Atkins)","(B.Phillips)","(L.Milledge)","(P.Feliz)","(Ad.LaRoche)","(P.Fielder)","(J.Votto)","(K.Kouzmanoff)","(E.Encarnacion)","(A.Pujols)","(C.Utley)",9]
[10,"(M.Bourn)","(An.LaRoche)","(B.Hall)","(C.Young)","(K.Greene)","(F.Sanchez)","(L.Castillo)","(R.Weeks)","(J.Reyes)","(J.Rollins)","(O.Hudson)","(C.Jones)",10]
[11,"(W.Taveras)","(H.Ramirez)","(R.Furcal)","(J.Hermida)","(E.Byrnes)","(D.Wright)","(C.Lee)","(J.Hardy)","(S.Victorino)","(A.Jones)","(R.Zimmerman)","(A.Rowand)",11]
[12,"7>(S.Drew)","(A.Soriano)","(A.Kearns)","(J.Willingham)","(J.Bay)","(A.Dunn)","(J.Upton)","(K.Griffey)","(M.Holliday)","(L.Berkman)","(T.Tulowitzki)","(B.Hawpe)",12]
[13,"3>(M.Cameron)","(H.Pence)","(M.Kemp)","(F.Pie)","(C.Duncan)","(J.Francoeur)","3>(C.Iannetta)","(B.Giles","(P.Burrell)","6>(Y.Escobar)","(C.Beltran)","(R.Church)",13]
[14,"12>J.Santana","D.Haren","M.Reynolds","An.Miller","4>10>M.Tejada","4>T.Glaus","9>M.Jacobs","C.Maybin","Ch.James","B.Wagner","K.Fukudome","4>R.Ankiel",14]
[15,"C.Tracy","F.Cordero","J.Schafer","H.Kuroda","K.Correia","1>C.Capuano","5>A.Cook","N.Johnson","J.Germano","Co.Jackson","M.DeRosa","9>M.Capps",15]
[16,"4>T.Glavine","J.Schmidt","An.Reyes","J.Valverde","A.Ethier","10>J.Pierre","6>C.Meredith","J.Patterson","6>A.Heilman","B.Fuentes","12>R.Freel","3>J.Suppan",16]
[17,"M.Alou","B.Lyon","M.Prior","Jon.Sanchez","P.Feliciano","1>W.M.Pena","8>J.Pineiro","C.Cordero","3>M.Pelfrey","J.Wilson","4>J.Isringhausen","5>B.Howry",17]
[18,"5>J.Rauch","R.Spilborghs","B.Lidge","D.Marte","Y.Molina","6>R.Castro","J.Edmonds","N.Garciaparra","O.Hernandez","H-c.Kuo","O.Vizquel","5>J.Jurrjens",18]
[19,"R.Doumit","K.Wood","C.Qualls","T.Tankersley","Fe.Lopez","1>C.Villanueva","5>B.Schneider","E.Gagne","D.Riske","J.Bergmann","7>Ed.Volquez","C.Ruiz",19]
[20,"5>R.Paulino","8>S.Hairston","E.Dukes","J.Keppinger","K.Matsui","9>L.Gardner","M.Barrett","An.Sanchez","12>M.Loretta","D.Ross","Jam.McDonald","P.Moylan",20]
[21,"G.Jenkins","5>R.Theriot","G.Reynolds","M.Wuertz","5>R.Winn","1>K.Frandsen","5>T.Pena","A.Gonzalez","R.Durham","N.McLouth","Raj.Davis","X.Nady",21]
[22,"P.LoDuca","Br.Wilson","T.Iguchi","Dm.Young","M.Morris","J.Bautista","S.Marshall","M.Mulder","K.Gregg","C.Ross","S.Hatteberg","Jav.Valentin",22]
[23,"R.Belliard","M.Treanor","J.Beimel","M.Gonzalez","S.Proctor","1>C.Counsell","10>R.Nolasco","M.Giles","S.Rivera","9>M.Diaz","M.Clement","C.Izturis",23]
[24,"4>R.Springer","B.Hennessey","T.Yates","T.Abreu","5>J.C.Romero","1>FelipePaulino","Ch.Perez","R.Ludwick","M.Murton","Ju.Cruz","10>C.Burke","J.Werth",24]
[25,"3>J.Baker","(C.Hunter)","M.Lindstrom","9>D.Weathers","J.Smith","10>T.Coffey","5>M.Rabelo","J.Kendall","D.Roberts","Ron.Cedeno","1>M.Kotsay","M.Belisle",25]
[26,"A.Kennedy","3>Z.Duke","A.Amezaga","D.McPherson","J.Marquis","J.Lannan","J.D'Antona","J.Cantu","B.Looper","M.Fontenot","6>Josh.Johnson","R.Dempster",26]
[27,"4>B.Shouse","(D.Stubbs)","S.Fuld","9>J.Estrada","D.Turnbow","5>A.Miles","5>J.Moyer","E.Loaiza","M.Hampton","J.Flores","J.Lieber","5>D.Mientkiewicz",27]
[28,"(N.Walker)","(A.Villalona)","J.Hampson","(M.LaPorta)","R.Messenger","4>K.Cameron","6>J.Savery","Du.Sanchez","M.Hendrickson","J.Ascanio","R.Franklin","R.Aurilia",28]
[29,"(W.Fairley)","(H.Sosa)","Ch.Nelson","(C.Gonzalez)","Ju.Gonzalez","10>T.Gordon","1>B.Backe","(A.McCutcheon)","W.Williams","C.Schroder","C.Vargas","C.Coste",29]
[30,"(Delw.Young)","(T.Alderson)","M.Burgess","(C.Marrero)","10>M.McLemore","(Br.Jones)","A.Boone","(F.Martinez)","C.Sampson","J.Hirsh","(P.Humber)","Br.Ryan",30]
[31,"(T.Frazier)","(T.Patton)","J.Jeffress","(B.Lillibridge)","10>B.Carlyle","1>C.Crabbe","5>(A.Cardenas)","(E.Andrus)","D.Easley","10>R.Wagner","(C.Balester)","L.Ayala",31]
[32,"(J.Smoker)","(S.Elbert)","(E.Patterson)","(J.Vitters)","(B.Lincoln)","(Gi.Gonzalez)","D.Borkowski","(I.Stewart)","El.Alfonzo","G.Gross","(W.Inman)","S.Torres",32]
[33,"(B.Sinkbeil)","(B.Hynick)","(S.Pearce)","(J.Garcia)","(D.Moskos)","1>(C.Hu)","5>(C.Carrasco)","(B.Anderson)","B.Barton","(J.Meloan)","(D.Fowler)","T.Buchholz",33]
[34,"(A.Ottavino)","(D.Veal)","(J.Towles)","(C.Volstad)","(C.Carrillo)","(D.Guerra)","(C.Headley)","(J.Thatcher)","(J.Parker)","(M.Dominguez)","(C.Rasmus)","J.Fogg",34]
[35,"(L.Hochevar)","10>G.Dobbs","(Ga.Hernandez)","(S.Gallagher)","(R.Detwiler)","1>(M.Antonelli)","5>(J.Cueto)","(C.Kershaw)","(M.Scherzer)","(J.Heyward)","(J.Bruce)","Ed.Gonzalez",35]
[]
[]
[]
[null,"Team 10","Team 12","Team 2","Team 6","Team 4","Team 5","Team 1","Team 11","Team 9","Team 7","Team 3","Team 8"]
["Rd","Casey","Duke & Josh","Kevin","Rich","Mark","Pat","Ray","Andy","Chris","Bill","JTP","Tom","Rd"]
["C","R.Doumit","Y.Torrealba","J.Saltalamacchia","B.McCann","I.Rodriguez","B.Schneider","R.Hernandez","J.Bard","B.Molina","Ru.Martin","G.Soto","C.Ruiz","C"]
["1B","R.Howard","M.Teixeira","J.Loney","Dm.Young","Ad.Gonzalez","Ad.LaRoche","De.Lee","J.Votto","J.Thome","P.Fielder","A.Pujols","T.Helton","1B"]
["2B","A.Kennedy","K.Johnson","B.Phillips","T.Wigginton","D.Uggla","F.Sanchez","L.Castillo","R.Weeks","J.Kent","P.Polanco","O.Hudson","C.Utley","2B"]
["3B","S.Rolen","G.Atkins","B.Hall","R.Braun","T.Glaus","D.Wright","A.Beltre","M.Cabrera","A.Ramirez","E.Encarnacion","R.Zimmerman","C.Jones","3B"]
["SS","M.Tejada","H.Ramirez","R.Furcal","Y.Escobar","K.Greene","E.Renteria","S.Drew","J.Hardy","J.Reyes","J.Rollins","T.Tulowitzki","J.Lugo","SS"]
["CF","W.Taveras","J.Hamilton","M.Kemp","C.B.Young","E.Byrnes","J.Francoeur","W.M.Pena","C.Maybin","S.Victorino","A.Jones","C.Beltran","A.Rowand","CF"]
["OF","Co.Hart","A.Soriano","V.Guerrero","J.Hermida","J.Bay","A.Dunn","C.Lee","B.Giles","M.Holliday","L.Berkman","M.Bradley","B.Hawpe","OF"]
["OF","M.Bourn","H.Pence","A.Kearns","F.Pie","C.Duncan","B.Abreu","C.Quentin","K.Griffey","P.Burrell","J.Drew","K.Fukudome","R.Church","OF"]
["BC","P.LoDuca","M.Treanor","J.Towles","R.Castro","Y.Molina","R.Paulino","M.Barrett","C.Snyder","J.Estrada","D.Ross","M.Montero","Jav.Valentin","BC"]
["IF","C.Tracy","M.Loretta","C.Delgado","J.Keppinger","P.Feliz","R.Theriot","C.Headley","N.Johnson","K.Kouzmanoff","A.LaRoche","M.DeRosa","C.Izturis","IF"]
["IF","C.Jackson",null,"M.Reynolds","T.Abreu","F.Lopez","J.Bautista","C.Hu","N.Garciaparra","M.Jacobs","J.Wilson","O.Vizquel","R.Aurilia","IF"]
["OF","J.Pierre","R.Freel","S.Pearce","J.Willingham","R.Ankiel","Br.Jones","J.Edmonds","R.Ludwick","M.Diaz","J.Upton","M.Cameron","S.Hairston","OF"]
["OF","M.Alou","R.Spilborghs","E.Dukes","L.Milledge","A.Ethier","R.Winn","M.Kotsay",null,"M.Murton","N.McLouth","Raj.Davis","X.Nady","OF"]
["?","T.Frazier","A.Villalona","E.Patterson","J.Vitters","K.Matsui","A.Cardenas","M.Antonelli","B.Anderson","R.Durham","M.Dominguez","J.Bruce","Br.Ryan","?"]
["?","Delw.Young","D.Stubbs","J.Schafer","B.Lillibridge","Ju.Gonzalez","M.Rabelo","K.Frandsen","I.Stewart","D.Roberts","J.Heyward","C.Rasmus",null,"?"]
["?","W.Fairley","C.Hunter","T.Iguchi","C.Marrero",null,"A.Miles","C.Counsell","E.Andrus","D.Easley","Co.Ross","D.Fowler",null,"?"]
["?","G.Jenkins",null,"A.Amezaga","C.Gonzalez",null,"D.Mientkiewicz","J.D'Antona","F.Martinez","El.Alfonzo","Ron.Cedeno","C.Iannetta",null,"?"]
["?","R.Belliard",null,"S.Fuld","M.LaPorta","D.Turnbow",null,"A.Boone","A.McCutcheon","B.Barton","M.Fontenot","S.Hatteberg",null,"?"]
["?","C.Burke",null,"Ch.Nelson","D.McPherson","B.Shouse",null,"C.Crabbe","A.Gonzalez","C.Sampson","J.Flores","J.Baker",null,"?"]
["?","G.Dobbs",null,"M.Burgess","Josh.Johnson","J.Marquis","J.Moyer",null,"M.Giles","Wo.Williams","G.Gross",null,null,"?"]
["?","R.Wagner","B.Hennessey",null,"M.Gonzalez","J.Smith","J.Lannan",null,"J.Kendall","M.Hendrickson",null,null,null,"?"]
["?","B.Carlyle","T.Alderson",null,"M.Wuertz","J.C.Romero","T.Pena",null,"J.Cantu","M.Hampton",null,"C.Vargas",null,"?"]
["?","T.Patton","S.Elbert","J.Jeffress","T.Tankersley","B.Lincoln","J.Jurrjens",null,null,"B.Looper",null,"Jam.McDonald","Ed.Gonzalez","?"]
["?","J.Smoker","B.Hynick","J.Hampson","J.Garcia","D.Moskos","D.Guerra",null,"Du.Sanchez","D.Weathers",null,"P.Humber","J.Fogg","?"]
["?","B.Sinkbeil","D.Veal","G.Reynolds","C.Volstad","C.Carrillo","C.Carrasco","Ch.Perez","E.Loaiza","M.Scherzer","J.Hirsh","C.Ballester","T.Buchholz","?"]
["?","A.Ottavino","H.Sosa","Ga.Hernandez","S.Gallagher","R.Detwiler","Gi.Gonzalez","F.Paulino","C.Kershaw","J.Parker","C.Schroder","W.Inman","S.Torres","?"]
["SP","R.Johnson","J.Santana","D.Lowe","T.Lincecum","A.Harang","A.Burnett","S.Kazmir","B.Webb","J.Beckett","M.Cain","J.Peavy","R.Oswalt","SP"]
["SP","D.Bush","D.Haren","T.Gorzelanny","B.Arroyo","A.Wainwright","R.Hill","T.Hudson","Ol.Perez","B.Penny","C.Billingsley","C.Zambrano","J.Smoltz","SP"]
["SP","P.Maholm","C.Young","I.Snell","B.Myers","J.Maine","F.Morales","G.Maddux","U.Jimenez","N.Lowry","C.Hamels","J.Vazquez","Do.Davis","SP"]
["SP","S.Olsen","T.Lilly","An.Reyes","S.Hill","C.Carpenter","J.Francis","M.Owings","A.Pettitte","Ch.James","Y.Gallardo","P.Martinez","K.Kendrick","SP"]
["SP","L.Hochevar","D.Willis","M.Prior","An.Miller","K.Correia","W.Rodriguez","H.Bailey","J.Patterson","J.Germano","J.Bergmann","B.Sheets","S.Mitre","SP"]
["P","M.Parra","B.Zito","M.Lindstrom","H.Kuroda","T.Glavine","J.Cueto","C.Capuano","An.Sanchez","O.Hernandez","Ed.Volquez","J.Suppan","J.Pineiro","P"]
["P","R.Nolasco","R.Wolf","T.Yates","Jon.Sanchez","M.Morris","A.Cook","C.Villanueva","M.Mulder","S.Rivera","J.Ascanio","M.Pelfrey","M.Belisle","P"]
["P","M.McLemore","J.Schmidt","J.Beimel","D.Marte","R.Springer","J.Rauch","S.Marshall","E.Gagne","K.Gregg","Ju.Cruz","M.Clement","L.Ayala","P"]
["P","T.Gordon","Br.Wilson","C.Qualls","A.Heilman","S.Proctor","B.Howry","B.Backe","C.Cordero","L.Gardner","B.Fuentes","Z.Duke","R.Dempster","P"]
["P","T.Coffey","K.Wood","B.Lidge","C.Meredith","J.Isringhausen","J.Broxton","D.Borkowski","J.Thatcher","D.Riske","J.Meloan","J.Lieber","P.Moylan","P"]
["P","R.Soriano","F.Cordero","H.Bell","J.Valverde","P.Feliciano","M.Corpas","T.Hoffman","C.Marmol","M.Capps","T.Saito","R.Franklin","B.Lyon","P"]
[null,null,null,null,"J.Savery"]

{"sheet":"07BPdraft","index":5,"n_rows":78,"n_cols":14,"rows_kept":78,"cut":false,"hidden":false,"merged":[]}
[null,"Team 1","Team 10","Team 12","Team 2","Team 11","Team 9","Team 8","Team 5","Team 4","Team 6","Team 3","Team 7"]
["Rd","Ray","Casey","Duke & Josh","Kevin","Andy","Chris","Tom","Pat","Mark","Rich","JTP","Bill","Rd"]
[1,"Ra.Hernandez","F.Nieve","J.Vazquez","V.Guerrero","A.Pettitte","J.Beckett","A.Burnett","C.Schilling","I.Rodriguez","P.Polanco","B.Abreu","S.Kazmir",1]
[2,"L.Castillo","3>A.Beltre","J.Barfield","D.Lowe","G.Sheffield","J.Thome","J.Lugo","J.Schmidt","7>A.Marte","B.Myers","M.Bradley","J.Drew",2]
[3,"D.Willis","D.Bush","Z.Duke","C.Hensley","B.Webb","B.Arroyo","R.Oswalt","R.Hill","C.Carpenter","G.Maddux","J.Peavy","B.Sheets",3]
[4,"T.Hudson","S.Olson","R.Johnson","T.Gorzelanny","An.Reyes","C.Billingsley","J.Smoltz","L.Hernandez","A.Harang","An.Sanchez","C.Zambrano","C.Capuano",4]
[5,"J.Suppan","C.Young","J.Hirsh","J.Patterson","K.Wells","N.Lowry","Do.Davis","J.Broxton","R.Clemens","Jo.Johnson","B.Penny","M.Cain",5]
[6,"T.Saito","B.Wagner","K.Wood","J.Jennings","H.Kuo","M.Prior","P.LoDuca","B.Lidge","A.Wainwright","B.McCann","M.Barrett","C.Hamels",6]
[7,"P.Fielder","C.Jackson","D.Ross","C.Delgado","R.Weeks","J.Francis","T.Helton","J.Estrada","C.Cordero","N.Johnson","C.Iannetta","Ru.Martin",7]
[8,"W.Betemit","N.Garciaparra","R.Howard","B.Phillips","M.Cabrera","T.Glavine","C.Utley","M.Giles","Ad.Gonzalez","A.Ramirez","A.Pujols","D.Lee",8]
[9,"D.Eckstein","S.Thorman","R.Zimmerman","Ch.Tracy","M.Ensberg","Ad.LaRoche","C.Jones","D.Wright","D.Uggla","F.Lopez","O.Hudson","R.Durham",9]
[10,"C.Lee","C.Burke","Ha.Ramirez","R.Furcal","J.Hardy","Jo.Reyes","R.Aurilia","B.Bonds","S.Rolen","C.B.Young","G.Atkins","S.Drew",10]
[11,"C.Quentin","E.Renteria","A.Soriano","B.Hall","K.Griffey","E.Encarnacion","R.Winn","W.Taveras","Fr.Sanchez","L.Milledge","T.Tulowitzki","A.Jones",11]
[12,"J.Pierre","Co.Hart","A.Ethier","M.Kemp","B.Giles","P.Burrell","B.Hawpe","A.Dunn","J.Bay","J.Willingham","C.Beltran","L.Berkman",12]
[13,"3>R.Paulino","7>J.Rollins","J.Francoeur","A.Kearns","M.Murton","M.Holliday","M.Alou","D.Roberts","J.Edmonds","J.Hermida","L.Scott","4>C.Meredith",13]
[14,"FreddyGarcia","5>BarryZito","ChuckJames","IanSnell","MikeJacobs","BenMolina","10>PaulMaholm","10>Hoffman","9>JeffKent","TimLincecum","Pe.Martinez","M.Cameron",14]
[15,"10>R.Soriano","4>JohnMaine","Ted Lilly","11>JoshBard","2>F.Cordero","4>M.Morris","AdamEaton","ChrisDuncan","9>Kouzmanoff","C. Vargas","12>Rowand","3>R.Wolf",15]
[16,"JonLieber","KellyJohnson","BrianFuentes","MiguelOlivo","S.Linebrink","MikeGonzlez","JoseValverde","OmarVizquel","Eric Byrnes","DavidWells","S.Victorino","DanWheeler",16]
[17,"10>J.Jones","1>AaronCook","CedricHunter","11>A.Everett","2>KyleDavies","O.Hernandez","RyanChurch","BobbyHowry","YadierMolina","XavierNady","A.Callaspo","B.Thompson",17]
[18,"RyanFreel","JasonLane","3>KhalilGreene","B.Schneider","TreverMiller","A.Heilman","B.H.Kim","MattHarrison","PedroFeliz","KevinGregg","DexterFowler","C.Villanueva",18]
[19,"10>Jo.Valentin","1>A.Gonzalez","6>M.Corpas","11>OliverPerez","2>J.Loney","KevinMench","RussBranyan","Jamie Moyer","Jack Wilson","Jon Rauch","MarkMulder","MarkDeRosa",19]
[20,"B.Looper","RonBelliard","JonSanchez","M.McBride","Juan Cruz","6>Lillibridge","BobWickman","Chad Qualls","CraigBiggio","JoseCapellan","Jeff Baker","JavierValentin",20]
[21,"10>Bullington","1>A.Kennedy","RickyNolasco","11>C.Snyder","2>En.Gonzalez","Matt Diaz","Cesar Izturis","Wes Helms","Geoff Jenkins","Rod Barajas","YusmeiroPetit","DamasoMarte",21]
[22,"Eli Ramirez","Willy Aybar","4>T.Gordon","7>MattCapps","Mike Wuertz","J.Marquis","Damian Miller","Brad Ausmus","P.Feliciano","Chris Volstad","Nook Logan","4>MikeLamb",22]
[23,"10>R.Doumit","1>T.Coffey","JoshHamilton","11>Thompson","2>C.Gomez","S.Torres","Ed Gonzalez","RyanMadson","Chris Duffy","Bill Bray","9>Isringhsen","Carlos Ruiz",23]
[24,"D.Weathers","W.Williams","Mark Loretta","Josh Hancock","Cliff Floyd","Craig Wilson","Aaron Miles","Todd Walker","J.Encarnacion","A.Burgos","Chan Ho Park","9>Du.Sanchez",24]
[25,"10>R.Pinto","1>Dempster","F.Morales","11>Bry.Anderson","2>T.Tankersley","12>C.Guzman","1>B.Tomko","10>Br.Clark","Geoff Geary","K.Frandsen","12>Hennessy","ScottHairston",25]
[26,"LuisGonzalez","Abercrombie","(Tr.Patton)","T.Sledge","5>Neal Cotts","Scott Eyre","Sergio Mitre","TimHamulack","LanceCormier","Shawn Hill","ElmerDessens","B.Medders",26]
[27,"8>Hampton","1>Marshall","7>O.Villarreal","11>(A.McCutcheon)","2>R.Wagner","7>Ma.Anderson","Ryan Klesko","Juan Castro","Dana Eveland","KazMatsui","12>A.Villalona","Will Ohman",27]
[28,"Shawn Green","Y.Torrealba","(D.Stubbs)","A.Amezaga","(Fe.Martinez)","12>E.Munson","Wade Miller","Ca.Carrasco","Eric Milton","Jaime Garcia","Jamey Carroll","2>Hernandez",28]
[29,"10>A.Guzman","1>An.LaRoche","(H.Pence)","11>(E.Andrus)","2>G.Mota","Langerhans","Scott Spiezio","M.Lieberthal","Kevin Correia","S.Gallagher","(J.Bruce)","Matt Wise",29]
[30,"(M.Antonelli)","8>R.Castro","(J.Samardzija)","(E.Campbell)","(I.Stewart)","Javy Lopez","Ryan Theriot","S.Hatteberg","3>Heath Bell","Chris Marrero","(C.Rasmus)","Paul Estrada",30]
[31,"10>(Delw.Young)","7>J.Grabow","(Gio.Gonzalez)","11>(J.Votto)","2>(E.Patterson)","Jose Bautista","EmilianoFruto","Kirk Saarloos","Steve Kline","Corey Koskie","(J.Upton)","J.Bergmann",31]
[32,"(J.Koshansky)","(M.Bourn)","(M.Owings)","(J.Saltalamacchia)","(U.Jimenez)","Wa.Rodriguez","Henry Blanco","Rheal Cormier","Pr.Wilson","J.Jeffress","(C.Gonzalez)","Chris Snelling",32]
[33,"10>(B.Sinkbeil)","1>(M.Pawelek)","(D.Veal)","11>(Gr.Miller)","2>(T.Bowyer)","Jeff Conine","Clint Barmes","So Taguchi","(B.Lincoln)","(K.Drabek)","(K.Casto)","C.Sampson",33]
[34,"(Se.West)","(A.Ottavino)","(S.Elbert)","(J.Devine)","(C.Kershaw)","(L.Broadway)","10>Ru.Ortiz","11>D.Turnbow","(C.Carrillo)","(F.Pie)","(M.Montero)","CraigCounsell",34]
[35,"10>(L.Hochevar)","1>(H.Bailey)","1>ChrisCoste","11>(D.Nippert)","2>(He.Owens)","(M.Albers)","10>R.Springer","11>M.Prado","(M.Pelfrey)","(R.Braun)","(P.Humber)","(Y.Gallardo)",35]
[]
[]
[null,"Team 1","Team 10","Team 12","Team 2","Team 11","Team 9","Team 8","Team 5","Team 4","Team 6","Team 3","Team 7"]
["Rd","Ray","Casey","Duke & Josh","Kevin","Andy","Chris","Tom","Pat","Mark","Rich","JTP","Bill","Rd"]
["C","Ra.Hernandez","RonPaulino","D.Ross","MiguelOlivo","Josh Bard","BenMolina","P.LoDuca","J.Estrada","I.Rodriguez","B.McCann","C.Iannetta","Ru.Martin","C"]
["1B","P.Fielder","Co.Jackson","R.Howard","C.Delgado","M.Cabrera","J.Thome","T.Helton","S.Hatteberg","Ad.Gonzalez","N.Johnson","A.Pujols","D.Lee","1B"]
["2B","L.Castillo","C.Burke","J.Barfield","B.Phillips","R.Weeks","Jeff Kent","C.Utley","M.Giles","D.Uggla","P.Polanco","O.Hudson","R.Durham","2B"]
["3B","W.Betemit","N.Garciaparra","R.Zimmerman","C.Tracy","M.Ensberg","E.Encarnacion","C.Jones","D.Wright","S.Rolen","A.Ramirez","G.Atkins","A.Marte","3B"]
["SS","D.Eckstein","E.Renteria","Ha.Ramirez","R.Furcal","J.Hardy","Jo.Reyes","J.Lugo","OmarVizquel","Fr.Sanchez","F.Lopez","T.Tulowitzki","J.Rollins","SS"]
["CF","J.Pierre","KellyJohnson","A.Soriano","B.Hall","K.Griffey","Langerhans","R.Winn","W.Taveras","J.Edmonds","C.Young","C.Beltran","An.Jones","CF"]
["OF","C.Lee","Co.Hart","A.Ethier","V.Guerrero","B.Giles","M.Holliday","B.Hawpe","B.Bonds","J.Bay","J.Hermida","B.Abreu","L.Berkman","OF"]
["OF","C.Quentin","S.Thorman","J.Francouer","A.Kearns","G.Sheffield","P.Burrell","M.Alou","A.Dunn","Eric Byrnes","J.Willingham","M.Bradley","J.Drew","OF"]
["BC","Chris Coste","RyanDoumit","E.Munson","B.Schneider","Chris Snyder","Javy Lopez","DamianMiller","Brad Ausmus","YadierMolina","Rod Barajas","M.Barrett","JavierValentin","BC"]
["IF","AlexGonzalez","JoseValentin","C.Guzman","JamesLoney","MikeJacobs","Ad.LaRoche","R.Aurilia","Wes Helms","PedroFeliz","KazMatsui","AdrianBeltre","S.Drew","IF"]
["IF","A.Kennedy","RonBelliard","Mark Loretta","A.Amezaga","AdamEverett","Kouzmanoff","RussBranyan","Todd Walker","Jack Wilson","K.Frandsen","A.Callaspo","MarkDeRosa","IF"]
["OF","RyanFreel","JacqueJones","A.Rowand","M.Kemp","M.Murton","KevinMench","RyanChurch","D.Roberts","Geoff Jenkins","XavierNady","L.Scott","M.Cameron","OF"]
["OF","LuisGonzalez","JasonLane","JoshHamilton","T.Sledge","Cliff Floyd","Matt Diaz","Ryan Klesko","ChrisDuncan","Chris Duffy","F.Pie","Victorino","ScottHairston","OF"]
["?","J.Koshansky","M.Bourn","H.Pence","J.Saltalamacchia","J.Votto","L.Broadway","Cesar Izturis","Juan Castro","Craig Biggio","L.Milledge","M.Montero","Carlos Ruiz","?"]
["?","An.LaRoche","Delw.Young","D.Stubbs","E.Patterson","I.Stewart","Craig Wilson","Aaron Miles","Lieberthal","Mike Lamb","R.Braun","K.Casto","M.Anderson","?"]
["?","M.Antonelli","Willie Aybar","CedricHunter","E.Campbell","E.Andrus","Jose Bautista","Scott Spiezio","So Taguchi","J.Encarnacion","B.Lillibridge","C.Gonzalez","Chris Snelling","?"]
["?","Shawn Green","Brady Clark","An.Villalona","Carlos Gomez","Fe.Martinez","Jeff Conine","RamonCastro",null,"Pr.Wilson","ChrisMarrero","J.Upton","CraigCounsell","?"]
["?",null,"Abercrombie",null,null,"A.McCutcheon",null,"Ryan Theriot",null,null,"Corey Koskie","C.Rasmus",null,"?"]
["?",null,"Y.Torrealba","Fr.Morales",null,"Bry.Anderson",null,"Henry Blanco",null,"Steve Kline","J.Jeffress","J.Bruce","C.Sampson","?"]
["?",null,null,"J.Samardzija","G.Mota","Martin Prado",null,"Clint Barmes",null,"Kevin Correia","S.Gallagher","DexterFowler","J.Bergmann","?"]
["?","SeanMarshall","RussSpringer","Troy Patton","G.Hernandez",null,"W.Rodriguez",null,"Kirk Saarloos","Eric Milton","Jaime Garcia","Jeff Baker","John Grabow","?"]
["?","Brett Tomko","B.Bullington","Gio.Gonzalez","RyanWagner","D.Turnbow","Scott Eyre",null,"Rheal Cormier","Geoff Geary","Shawn Hill","Nook Logan","Paul Estrada","?"]
["?","Se.West","B.Sinkbeil","M.Owings","T.Tankersley","U.Jimenez","D.Sanchez",null,"C.Carrasco","B.Lincoln","ChrisVolstad","Khalil Greene","Matt Wise","?"]
["?","M.Pawelek","A.Ottavino","D.Veal","JoshHancock","Gr.Miller","Isringhausen",null,"TimHamulack","C.Carrillo","TimLincecum","JameyCarroll","Villarreal","?"]
["?","H.Bailey","L.Hochevar","S.Elbert","T.Bowyer","C.Kershaw","M.Albers","EmilianoFruto","MattHarrison","M.Pelfrey","K.Drabek","P.Humber","Y.Gallardo","?"]
["SP","D.Willis","C.Young","R.Johnson","D.Lowe","B.Webb","B.Arroyo","R.Oswalt","J.Schmidt","C.Carpenter","B.Myers","C.Zambrano","B.Sheets","SP"]
["SP","T.Hudson","D.Bush","J.Vazquez","C.Hensley","A.Pettitte","J.Beckett","J.Smoltz","R.Hill","A.Harang","G.Maddux","J.Peavy","C.Capuano","SP"]
["SP","FreddyGarcia","S.Olson","Z.Duke","T.Gorzelanny","An.Reyes","T.Glavine","A.Burnett","L.Hernandez","R.Clemens","An.Sanchez","B.Penny","M.Cain","SP"]
["SP","J.Suppan","F.Nieve","J.Hirsh","J.Patterson","K.Wells","N.Lowry","Do.Davis","C.Schilling","A.Wainwright","Jo.Johnson","P.Martinez","S.Kazmir","SP"]
["SP","J.Lieber","PaulMaholm","ChuckJames","J.Jennings","H.Kuo","J.Francis","AdamEaton","BarryZito","JohnMaine","C.Vargas","Randy Wolf","C.Hamels","SP"]
["P","B.Looper","W. Williams","Ted Lilly","IanSnell","D.Nippert","C.Billingsley","B.H.Kim","Jamie Moyer","MattMorris","DavidWells","Mark Mulder","B.Thompson","P"]
["P","AaronCook","AngelGuzman","JonSanchez","KyleDavies","OliverPerez","M.Prior","Ed Gonzalez","RyanMadson","DanaEveland","A.Burgos","YusmeiroPetit","C.Villanueva","P"]
["P","Eli Ramirez","Renyel Pinto","RickyNolasco","En.Gonzalez","M.Thompson","O.Hernandez","Sergio Mitre","Neal Cotts","LanceCormier","Bill Bray","Chan Ho Park","Will Ohman","P"]
["P","D.Weathers","Ru.Ortiz","B.Hennessey","M.McBride","Mike Wuertz","J.Marquis","Wade Miller","Chad Qualls","P.Feliciano","KevinGregg","ElmerDessens","B.Medders","P"]
["P","Todd Coffey","R.Soriano",null,"F. Cordero","Juan Cruz","S.Torres","M.Hampton","BobbyHowry","Tom Gordon","JoseCapellan",null,"Matt Capps","P"]
["P","R.Dempster","Hoffman","BrianFuentes","He.Owens","TreverMiller","A.Heilman","BobWickman","J.Broxton","C.Meredith","Jon Rauch",null,"DamasoMarte","P"]
["P","T.Saito","B.Wagner","K.Wood","J.Devine","Linebrink","M.Gonzalez","JoseValverde","B.Lidge","C.Cordero","M.Corpas","Heath Bell","DanWheeler","P"]